cayenne-commits mailing list archives

Site index · List index
Message view « Date » · « Thread »
Top « Date » · « Thread »
From Apache Jenkins Server <jenk...@builds.apache.org>
Subject Build failed in Jenkins: Cayenne-doc #295
Date Thu, 26 Jan 2012 00:22:28 GMT
See <https://builds.apache.org/job/Cayenne-doc/295/changes>

Changes:

[oltka] CAY-1459 add note to RELEASE-NOTES about this task

[oltka] CAY-1459 Modeler: DbEntities from other DataMaps under same domain are not displayed

[oltka] CAY-1654 add note to RELEASE-NOTES about this task

[oltka] CAY-1654 Can't switch DataSource Factory on certain projects

------------------------------------------
[...truncated 89598 lines...]
	at sun.reflect.DelegatingMethodAccessorImpl.invoke(DelegatingMethodAccessorImpl.java:25)
	at java.lang.reflect.Method.invoke(Method.java:597)
	at org.apache.maven.surefire.junit.JUnitTestSet.execute(JUnitTestSet.java:213)
	at org.apache.maven.surefire.suite.AbstractDirectoryTestSuite.executeTestSet(AbstractDirectoryTestSuite.java:115)
	at org.apache.maven.surefire.suite.AbstractDirectoryTestSuite.execute(AbstractDirectoryTestSuite.java:102)
	at org.apache.maven.surefire.Surefire.run(Surefire.java:180)
	at sun.reflect.NativeMethodAccessorImpl.invoke0(Native Method)
	at sun.reflect.NativeMethodAccessorImpl.invoke(NativeMethodAccessorImpl.java:39)
	at sun.reflect.DelegatingMethodAccessorImpl.invoke(DelegatingMethodAccessorImpl.java:25)
	at java.lang.reflect.Method.invoke(Method.java:597)
	at org.apache.maven.surefire.booter.SurefireBooter.runSuitesInProcess(SurefireBooter.java:350)
	at org.apache.maven.surefire.booter.SurefireBooter.main(SurefireBooter.java:1021)
Jan 26, 2012 12:22:25 AM org.apache.cayenne.configuration.XMLDataChannelDescriptorLoader load
INFO: Loading XML configuration resource from <https://builds.apache.org/job/Cayenne-doc/ws/trunk/itests/cayenne-runtime-itest/target/classes/cayenne-DEFAULT.xml>
Jan 26, 2012 12:22:25 AM org.apache.cayenne.configuration.XMLDataChannelDescriptorLoader$DataSourceChildrenHandler
createChildTagHandler
INFO: loading user name and password.
Jan 26, 2012 12:22:25 AM org.apache.cayenne.log.CommonsJdbcEventLogger logPoolCreated
INFO: Created connection pool: jdbc:hsqldb:mem:DEFAULT
	Driver class: org.hsqldb.jdbcDriver
	Min. connections in the pool: 1
	Max. connections in the pool: 1
Jan 26, 2012 12:22:25 AM org.apache.cayenne.log.CommonsJdbcEventLogger logConnect
INFO: Opening connection: jdbc:hsqldb:mem:DEFAULT
	Login: 
	Password: *******
Jan 26, 2012 12:22:25 AM org.apache.cayenne.log.CommonsJdbcEventLogger logConnectFailure
INFO: *** Connecting: FAILURE.
java.sql.SQLException: User not found: 
	at org.hsqldb.jdbc.Util.sqlException(Unknown Source)
	at org.hsqldb.jdbc.jdbcConnection.<init>(Unknown Source)
	at org.hsqldb.jdbcDriver.getConnection(Unknown Source)
	at org.hsqldb.jdbcDriver.connect(Unknown Source)
	at org.apache.cayenne.conn.DriverDataSource.getConnection(DriverDataSource.java:157)
	at org.apache.cayenne.conn.PooledConnectionImpl.reconnect(PooledConnectionImpl.java:83)
	at org.apache.cayenne.conn.PooledConnectionImpl.getConnection(PooledConnectionImpl.java:120)
	at org.apache.cayenne.conn.PoolManager.uncheckConnection(PoolManager.java:397)
	at org.apache.cayenne.conn.PoolManager.getConnection(PoolManager.java:368)
	at org.apache.cayenne.conn.PoolManager.getConnection(PoolManager.java:354)
	at org.apache.cayenne.configuration.server.DefaultDbAdapterFactory.detectAdapter(DefaultDbAdapterFactory.java:98)
	at org.apache.cayenne.configuration.server.DefaultDbAdapterFactory$1.get(DefaultDbAdapterFactory.java:85)
	at org.apache.cayenne.configuration.server.DefaultDbAdapterFactory$1.get(DefaultDbAdapterFactory.java:82)
	at org.apache.cayenne.dba.AutoAdapter.loadAdapter(AutoAdapter.java:93)
	at org.apache.cayenne.dba.AutoAdapter.getAdapter(AutoAdapter.java:81)
	at org.apache.cayenne.dba.AutoAdapter.tableTypeForTable(AutoAdapter.java:186)
	at org.apache.cayenne.access.dbsync.CreateIfNoSchemaStrategy.getNameTablesInDB(CreateIfNoSchemaStrategy.java:94)
	at org.apache.cayenne.access.dbsync.CreateIfNoSchemaStrategy.processSchemaUpdate(CreateIfNoSchemaStrategy.java:47)
	at org.apache.cayenne.access.dbsync.BaseSchemaUpdateStrategy.updateSchema(BaseSchemaUpdateStrategy.java:48)
	at org.apache.cayenne.configuration.server.ServerRuntimeCase.setUp(ServerRuntimeCase.java:60)
	at junit.framework.TestCase.runBare(TestCase.java:125)
	at junit.framework.TestResult$1.protect(TestResult.java:106)
	at junit.framework.TestResult.runProtected(TestResult.java:124)
	at junit.framework.TestResult.run(TestResult.java:109)
	at junit.framework.TestCase.run(TestCase.java:118)
	at junit.framework.TestSuite.runTest(TestSuite.java:208)
	at junit.framework.TestSuite.run(TestSuite.java:203)
	at sun.reflect.NativeMethodAccessorImpl.invoke0(Native Method)
	at sun.reflect.NativeMethodAccessorImpl.invoke(NativeMethodAccessorImpl.java:39)
	at sun.reflect.DelegatingMethodAccessorImpl.invoke(DelegatingMethodAccessorImpl.java:25)
	at java.lang.reflect.Method.invoke(Method.java:597)
	at org.apache.maven.surefire.junit.JUnitTestSet.execute(JUnitTestSet.java:213)
	at org.apache.maven.surefire.suite.AbstractDirectoryTestSuite.executeTestSet(AbstractDirectoryTestSuite.java:115)
	at org.apache.maven.surefire.suite.AbstractDirectoryTestSuite.execute(AbstractDirectoryTestSuite.java:102)
	at org.apache.maven.surefire.Surefire.run(Surefire.java:180)
	at sun.reflect.NativeMethodAccessorImpl.invoke0(Native Method)
	at sun.reflect.NativeMethodAccessorImpl.invoke(NativeMethodAccessorImpl.java:39)
	at sun.reflect.DelegatingMethodAccessorImpl.invoke(DelegatingMethodAccessorImpl.java:25)
	at java.lang.reflect.Method.invoke(Method.java:597)
	at org.apache.maven.surefire.booter.SurefireBooter.runSuitesInProcess(SurefireBooter.java:350)
	at org.apache.maven.surefire.booter.SurefireBooter.main(SurefireBooter.java:1021)
Jan 26, 2012 12:22:25 AM org.apache.cayenne.log.CommonsJdbcEventLogger logConnect
INFO: Opening connection: jdbc:hsqldb:mem:DEFAULT
	Login: 
	Password: *******
Jan 26, 2012 12:22:25 AM org.apache.cayenne.log.CommonsJdbcEventLogger logConnectFailure
INFO: *** Connecting: FAILURE.
java.sql.SQLException: User not found: 
	at org.hsqldb.jdbc.Util.sqlException(Unknown Source)
	at org.hsqldb.jdbc.jdbcConnection.<init>(Unknown Source)
	at org.hsqldb.jdbcDriver.getConnection(Unknown Source)
	at org.hsqldb.jdbcDriver.connect(Unknown Source)
	at org.apache.cayenne.conn.DriverDataSource.getConnection(DriverDataSource.java:157)
	at org.apache.cayenne.conn.PooledConnectionImpl.reconnect(PooledConnectionImpl.java:83)
	at org.apache.cayenne.conn.PooledConnectionImpl.getConnection(PooledConnectionImpl.java:120)
	at org.apache.cayenne.conn.PoolManager.uncheckConnection(PoolManager.java:397)
	at org.apache.cayenne.conn.PoolManager.getConnection(PoolManager.java:381)
	at org.apache.cayenne.conn.PoolManager.getConnection(PoolManager.java:354)
	at org.apache.cayenne.configuration.server.DefaultDbAdapterFactory.detectAdapter(DefaultDbAdapterFactory.java:98)
	at org.apache.cayenne.configuration.server.DefaultDbAdapterFactory$1.get(DefaultDbAdapterFactory.java:85)
	at org.apache.cayenne.configuration.server.DefaultDbAdapterFactory$1.get(DefaultDbAdapterFactory.java:82)
	at org.apache.cayenne.dba.AutoAdapter.loadAdapter(AutoAdapter.java:93)
	at org.apache.cayenne.dba.AutoAdapter.getAdapter(AutoAdapter.java:81)
	at org.apache.cayenne.dba.AutoAdapter.tableTypeForTable(AutoAdapter.java:186)
	at org.apache.cayenne.access.dbsync.CreateIfNoSchemaStrategy.getNameTablesInDB(CreateIfNoSchemaStrategy.java:94)
	at org.apache.cayenne.access.dbsync.CreateIfNoSchemaStrategy.processSchemaUpdate(CreateIfNoSchemaStrategy.java:47)
	at org.apache.cayenne.access.dbsync.BaseSchemaUpdateStrategy.updateSchema(BaseSchemaUpdateStrategy.java:48)
	at org.apache.cayenne.configuration.server.ServerRuntimeCase.setUp(ServerRuntimeCase.java:60)
	at junit.framework.TestCase.runBare(TestCase.java:125)
	at junit.framework.TestResult$1.protect(TestResult.java:106)
	at junit.framework.TestResult.runProtected(TestResult.java:124)
	at junit.framework.TestResult.run(TestResult.java:109)
	at junit.framework.TestCase.run(TestCase.java:118)
	at junit.framework.TestSuite.runTest(TestSuite.java:208)
	at junit.framework.TestSuite.run(TestSuite.java:203)
	at sun.reflect.NativeMethodAccessorImpl.invoke0(Native Method)
	at sun.reflect.NativeMethodAccessorImpl.invoke(NativeMethodAccessorImpl.java:39)
	at sun.reflect.DelegatingMethodAccessorImpl.invoke(DelegatingMethodAccessorImpl.java:25)
	at java.lang.reflect.Method.invoke(Method.java:597)
	at org.apache.maven.surefire.junit.JUnitTestSet.execute(JUnitTestSet.java:213)
	at org.apache.maven.surefire.suite.AbstractDirectoryTestSuite.executeTestSet(AbstractDirectoryTestSuite.java:115)
	at org.apache.maven.surefire.suite.AbstractDirectoryTestSuite.execute(AbstractDirectoryTestSuite.java:102)
	at org.apache.maven.surefire.Surefire.run(Surefire.java:180)
	at sun.reflect.NativeMethodAccessorImpl.invoke0(Native Method)
	at sun.reflect.NativeMethodAccessorImpl.invoke(NativeMethodAccessorImpl.java:39)
	at sun.reflect.DelegatingMethodAccessorImpl.invoke(DelegatingMethodAccessorImpl.java:25)
	at java.lang.reflect.Method.invoke(Method.java:597)
	at org.apache.maven.surefire.booter.SurefireBooter.runSuitesInProcess(SurefireBooter.java:350)
	at org.apache.maven.surefire.booter.SurefireBooter.main(SurefireBooter.java:1021)
Jan 26, 2012 12:22:25 AM org.apache.cayenne.configuration.XMLDataChannelDescriptorLoader load
INFO: Loading XML configuration resource from <https://builds.apache.org/job/Cayenne-doc/ws/trunk/itests/cayenne-runtime-itest/target/classes/cayenne-DEFAULT.xml>
Jan 26, 2012 12:22:25 AM org.apache.cayenne.configuration.XMLDataChannelDescriptorLoader$DataSourceChildrenHandler
createChildTagHandler
INFO: loading user name and password.
Jan 26, 2012 12:22:25 AM org.apache.cayenne.log.CommonsJdbcEventLogger logPoolCreated
INFO: Created connection pool: jdbc:hsqldb:mem:DEFAULT
	Driver class: org.hsqldb.jdbcDriver
	Min. connections in the pool: 1
	Max. connections in the pool: 1
Jan 26, 2012 12:22:25 AM org.apache.cayenne.log.CommonsJdbcEventLogger logConnect
INFO: Opening connection: jdbc:hsqldb:mem:DEFAULT
	Login: 
	Password: *******
Jan 26, 2012 12:22:25 AM org.apache.cayenne.log.CommonsJdbcEventLogger logConnectFailure
INFO: *** Connecting: FAILURE.
java.sql.SQLException: User not found: 
	at org.hsqldb.jdbc.Util.sqlException(Unknown Source)
	at org.hsqldb.jdbc.jdbcConnection.<init>(Unknown Source)
	at org.hsqldb.jdbcDriver.getConnection(Unknown Source)
	at org.hsqldb.jdbcDriver.connect(Unknown Source)
	at org.apache.cayenne.conn.DriverDataSource.getConnection(DriverDataSource.java:157)
	at org.apache.cayenne.conn.PooledConnectionImpl.reconnect(PooledConnectionImpl.java:83)
	at org.apache.cayenne.conn.PooledConnectionImpl.getConnection(PooledConnectionImpl.java:120)
	at org.apache.cayenne.conn.PoolManager.uncheckConnection(PoolManager.java:397)
	at org.apache.cayenne.conn.PoolManager.getConnection(PoolManager.java:368)
	at org.apache.cayenne.conn.PoolManager.getConnection(PoolManager.java:354)
	at org.apache.cayenne.configuration.server.DefaultDbAdapterFactory.detectAdapter(DefaultDbAdapterFactory.java:98)
	at org.apache.cayenne.configuration.server.DefaultDbAdapterFactory$1.get(DefaultDbAdapterFactory.java:85)
	at org.apache.cayenne.configuration.server.DefaultDbAdapterFactory$1.get(DefaultDbAdapterFactory.java:82)
	at org.apache.cayenne.dba.AutoAdapter.loadAdapter(AutoAdapter.java:93)
	at org.apache.cayenne.dba.AutoAdapter.getAdapter(AutoAdapter.java:81)
	at org.apache.cayenne.dba.AutoAdapter.tableTypeForTable(AutoAdapter.java:186)
	at org.apache.cayenne.access.dbsync.CreateIfNoSchemaStrategy.getNameTablesInDB(CreateIfNoSchemaStrategy.java:94)
	at org.apache.cayenne.access.dbsync.CreateIfNoSchemaStrategy.processSchemaUpdate(CreateIfNoSchemaStrategy.java:47)
	at org.apache.cayenne.access.dbsync.BaseSchemaUpdateStrategy.updateSchema(BaseSchemaUpdateStrategy.java:48)
	at org.apache.cayenne.configuration.server.ServerRuntimeCase.setUp(ServerRuntimeCase.java:60)
	at junit.framework.TestCase.runBare(TestCase.java:125)
	at junit.framework.TestResult$1.protect(TestResult.java:106)
	at junit.framework.TestResult.runProtected(TestResult.java:124)
	at junit.framework.TestResult.run(TestResult.java:109)
	at junit.framework.TestCase.run(TestCase.java:118)
	at junit.framework.TestSuite.runTest(TestSuite.java:208)
	at junit.framework.TestSuite.run(TestSuite.java:203)
	at sun.reflect.NativeMethodAccessorImpl.invoke0(Native Method)
	at sun.reflect.NativeMethodAccessorImpl.invoke(NativeMethodAccessorImpl.java:39)
	at sun.reflect.DelegatingMethodAccessorImpl.invoke(DelegatingMethodAccessorImpl.java:25)
	at java.lang.reflect.Method.invoke(Method.java:597)
	at org.apache.maven.surefire.junit.JUnitTestSet.execute(JUnitTestSet.java:213)
	at org.apache.maven.surefire.suite.AbstractDirectoryTestSuite.executeTestSet(AbstractDirectoryTestSuite.java:115)
	at org.apache.maven.surefire.suite.AbstractDirectoryTestSuite.execute(AbstractDirectoryTestSuite.java:102)
	at org.apache.maven.surefire.Surefire.run(Surefire.java:180)
	at sun.reflect.NativeMethodAccessorImpl.invoke0(Native Method)
	at sun.reflect.NativeMethodAccessorImpl.invoke(NativeMethodAccessorImpl.java:39)
	at sun.reflect.DelegatingMethodAccessorImpl.invoke(DelegatingMethodAccessorImpl.java:25)
	at java.lang.reflect.Method.invoke(Method.java:597)
	at org.apache.maven.surefire.booter.SurefireBooter.runSuitesInProcess(SurefireBooter.java:350)
	at org.apache.maven.surefire.booter.SurefireBooter.main(SurefireBooter.java:1021)
Jan 26, 2012 12:22:25 AM org.apache.cayenne.log.CommonsJdbcEventLogger logConnect
INFO: Opening connection: jdbc:hsqldb:mem:DEFAULT
	Login: 
	Password: *******
Jan 26, 2012 12:22:25 AM org.apache.cayenne.log.CommonsJdbcEventLogger logConnectFailure
INFO: *** Connecting: FAILURE.
java.sql.SQLException: User not found: 
	at org.hsqldb.jdbc.Util.sqlException(Unknown Source)
	at org.hsqldb.jdbc.jdbcConnection.<init>(Unknown Source)
	at org.hsqldb.jdbcDriver.getConnection(Unknown Source)
	at org.hsqldb.jdbcDriver.connect(Unknown Source)
	at org.apache.cayenne.conn.DriverDataSource.getConnection(DriverDataSource.java:157)
	at org.apache.cayenne.conn.PooledConnectionImpl.reconnect(PooledConnectionImpl.java:83)
	at org.apache.cayenne.conn.PooledConnectionImpl.getConnection(PooledConnectionImpl.java:120)
	at org.apache.cayenne.conn.PoolManager.uncheckConnection(PoolManager.java:397)
	at org.apache.cayenne.conn.PoolManager.getConnection(PoolManager.java:381)
	at org.apache.cayenne.conn.PoolManager.getConnection(PoolManager.java:354)
	at org.apache.cayenne.configuration.server.DefaultDbAdapterFactory.detectAdapter(DefaultDbAdapterFactory.java:98)
	at org.apache.cayenne.configuration.server.DefaultDbAdapterFactory$1.get(DefaultDbAdapterFactory.java:85)
	at org.apache.cayenne.configuration.server.DefaultDbAdapterFactory$1.get(DefaultDbAdapterFactory.java:82)
	at org.apache.cayenne.dba.AutoAdapter.loadAdapter(AutoAdapter.java:93)
	at org.apache.cayenne.dba.AutoAdapter.getAdapter(AutoAdapter.java:81)
	at org.apache.cayenne.dba.AutoAdapter.tableTypeForTable(AutoAdapter.java:186)
	at org.apache.cayenne.access.dbsync.CreateIfNoSchemaStrategy.getNameTablesInDB(CreateIfNoSchemaStrategy.java:94)
	at org.apache.cayenne.access.dbsync.CreateIfNoSchemaStrategy.processSchemaUpdate(CreateIfNoSchemaStrategy.java:47)
	at org.apache.cayenne.access.dbsync.BaseSchemaUpdateStrategy.updateSchema(BaseSchemaUpdateStrategy.java:48)
	at org.apache.cayenne.configuration.server.ServerRuntimeCase.setUp(ServerRuntimeCase.java:60)
	at junit.framework.TestCase.runBare(TestCase.java:125)
	at junit.framework.TestResult$1.protect(TestResult.java:106)
	at junit.framework.TestResult.runProtected(TestResult.java:124)
	at junit.framework.TestResult.run(TestResult.java:109)
	at junit.framework.TestCase.run(TestCase.java:118)
	at junit.framework.TestSuite.runTest(TestSuite.java:208)
	at junit.framework.TestSuite.run(TestSuite.java:203)
	at sun.reflect.NativeMethodAccessorImpl.invoke0(Native Method)
	at sun.reflect.NativeMethodAccessorImpl.invoke(NativeMethodAccessorImpl.java:39)
	at sun.reflect.DelegatingMethodAccessorImpl.invoke(DelegatingMethodAccessorImpl.java:25)
	at java.lang.reflect.Method.invoke(Method.java:597)
	at org.apache.maven.surefire.junit.JUnitTestSet.execute(JUnitTestSet.java:213)
	at org.apache.maven.surefire.suite.AbstractDirectoryTestSuite.executeTestSet(AbstractDirectoryTestSuite.java:115)
	at org.apache.maven.surefire.suite.AbstractDirectoryTestSuite.execute(AbstractDirectoryTestSuite.java:102)
	at org.apache.maven.surefire.Surefire.run(Surefire.java:180)
	at sun.reflect.NativeMethodAccessorImpl.invoke0(Native Method)
	at sun.reflect.NativeMethodAccessorImpl.invoke(NativeMethodAccessorImpl.java:39)
	at sun.reflect.DelegatingMethodAccessorImpl.invoke(DelegatingMethodAccessorImpl.java:25)
	at java.lang.reflect.Method.invoke(Method.java:597)
	at org.apache.maven.surefire.booter.SurefireBooter.runSuitesInProcess(SurefireBooter.java:350)
	at org.apache.maven.surefire.booter.SurefireBooter.main(SurefireBooter.java:1021)
Tests run: 4, Failures: 0, Errors: 4, Skipped: 0, Time elapsed: 0.464 sec <<< FAILURE!

Results :

Tests in error: 
  testGetDomain_singleton(org.apache.cayenne.configuration.server.ServerRuntimeIntegrationTest)
  testContext_notSingleton(org.apache.cayenne.configuration.server.ServerRuntimeIntegrationTest)
  testNewContext_separateObjects(org.apache.cayenne.configuration.server.ServerRuntimeIntegrationTest)
  testShutdown(org.apache.cayenne.configuration.server.ServerRuntimeIntegrationTest)

Tests run: 4, Failures: 0, Errors: 4, Skipped: 0

[INFO] ------------------------------------------------------------------------
[ERROR] BUILD FAILURE
[INFO] ------------------------------------------------------------------------
[INFO] There are test failures.

Please refer to <https://builds.apache.org/job/Cayenne-doc/ws/trunk/itests/cayenne-runtime-itest/target/surefire-reports>
for the individual test results.
[INFO] ------------------------------------------------------------------------
[INFO] For more information, run Maven with the -e switch
[INFO] ------------------------------------------------------------------------
[INFO] Total time: 2 minutes 25 seconds
[INFO] Finished at: Thu Jan 26 00:22:25 UTC 2012
[INFO] Final Memory: 123M/414M
[INFO] ------------------------------------------------------------------------
Build step 'Invoke top-level Maven targets' marked build as failure
Publishing Javadoc


Mime
View raw message