cayenne-commits mailing list archives

Site index · List index
Message view « Date » · « Thread »
Top « Date » · « Thread »
From Apache Jenkins Server <jenk...@builds.apache.org>
Subject Build failed in Jenkins: Cayenne-trunk » HSQLDB,false,JDK 1.6 (latest),Ubuntu #637
Date Sun, 22 Jan 2012 08:24:52 GMT
See <https://builds.apache.org/job/Cayenne-trunk/./cayenneTestConnection=HSQLDB,collationCi=false,jdk=JDK%201.6%20(latest),label=Ubuntu/637/changes>

Changes:

[aadamchik] CAY-1561 ObjectContext.localObject - defer FaultFailureExceptions on temporary
IDs

[aadamchik] CAY-1616 Remove internal dependencies on deprecated ObjectContext.localObject

[aadamchik] CAY-1616 Remove internal dependencies on deprecated ObjectContext.localObject

migrating unit tests

------------------------------------------
[...truncated 4505 lines...]
[WARNING]     @component role="<role>" roleHint="<roleHint>"
[WARNING]   instead.
[WARNING] org.apache.cayenne.maven.plugin.aggregator.BinAggregatorMojo#resolver:
[WARNING]   The syntax
[WARNING]     @parameter expression="${component.<role>#<roleHint>}"
[WARNING]   is deprecated, please use
[WARNING]     @component role="<role>" roleHint="<roleHint>"
[WARNING]   instead.
[INFO] Mojo extractor for language: java found 3 mojo descriptors.
[INFO] Applying mojo extractor for language: bsh
[INFO] Mojo extractor for language: bsh found 0 mojo descriptors.
[INFO] 
[INFO] --- maven-resources-plugin:2.4.3:resources (default-resources) @ maven-cayenne-build-plugin
---
[INFO] Using 'UTF-8' encoding to copy filtered resources.
[INFO] skip non existing resourceDirectory <https://builds.apache.org/job/Cayenne-trunk/./cayenneTestConnection=HSQLDB,collationCi=false,jdk=JDK%201.6%20(latest),label=Ubuntu/ws/trunk/build-tools/maven-cayenne-build-plugin/src/main/resources>
[INFO] 
[INFO] --- maven-compiler-plugin:2.3.2:compile (default-compile) @ maven-cayenne-build-plugin
---
[WARNING] File encoding has not been set, using platform encoding ANSI_X3.4-1968, i.e. build
is platform dependent!
[INFO] Compiling 6 source files to <https://builds.apache.org/job/Cayenne-trunk/./cayenneTestConnection=HSQLDB,collationCi=false,jdk=JDK%201.6%20(latest),label=Ubuntu/ws/trunk/build-tools/maven-cayenne-build-plugin/target/classes>
[INFO] 
[INFO] --- maven-resources-plugin:2.4.3:testResources (default-testResources) @ maven-cayenne-build-plugin
---
[INFO] Using 'UTF-8' encoding to copy filtered resources.
[INFO] skip non existing resourceDirectory <https://builds.apache.org/job/Cayenne-trunk/./cayenneTestConnection=HSQLDB,collationCi=false,jdk=JDK%201.6%20(latest),label=Ubuntu/ws/trunk/build-tools/maven-cayenne-build-plugin/src/test/resources>
[INFO] 
[INFO] --- maven-compiler-plugin:2.3.2:testCompile (default-testCompile) @ maven-cayenne-build-plugin
---
[INFO] No sources to compile
[INFO] 
[INFO] --- maven-surefire-plugin:2.5:test (default-test) @ maven-cayenne-build-plugin ---
[INFO] No tests to run.
[INFO] 
[INFO] --- maven-jar-plugin:2.3.1:jar (default-jar) @ maven-cayenne-build-plugin ---
[INFO] Building jar: <https://builds.apache.org/job/Cayenne-trunk/./cayenneTestConnection=HSQLDB,collationCi=false,jdk=JDK%201.6%20(latest),label=Ubuntu/ws/trunk/build-tools/maven-cayenne-build-plugin/target/maven-cayenne-build-plugin-3.1M4-SNAPSHOT.jar>
[INFO] 
[INFO] --- maven-plugin-plugin:2.7:addPluginArtifactMetadata (default-addPluginArtifactMetadata)
@ maven-cayenne-build-plugin ---
[INFO] 
[INFO] --- maven-install-plugin:2.3.1:install (default-install) @ maven-cayenne-build-plugin
---
[INFO] Installing <https://builds.apache.org/job/Cayenne-trunk/./cayenneTestConnection=HSQLDB,collationCi=false,jdk=JDK%201.6%20(latest),label=Ubuntu/ws/trunk/build-tools/maven-cayenne-build-plugin/target/maven-cayenne-build-plugin-3.1M4-SNAPSHOT.jar>
to /home/hudson/.m2/repository/org/apache/cayenne/build-tools/maven-cayenne-build-plugin/3.1M4-SNAPSHOT/maven-cayenne-build-plugin-3.1M4-SNAPSHOT.jar
[INFO] Installing <https://builds.apache.org/job/Cayenne-trunk/./cayenneTestConnection=HSQLDB,collationCi=false,jdk=JDK%201.6%20(latest),label=Ubuntu/ws/trunk/build-tools/maven-cayenne-build-plugin/pom.xml>
to /home/hudson/.m2/repository/org/apache/cayenne/build-tools/maven-cayenne-build-plugin/3.1M4-SNAPSHOT/maven-cayenne-build-plugin-3.1M4-SNAPSHOT.pom
[INFO]                                                                         
[INFO] ------------------------------------------------------------------------
[INFO] Building Cayenne Internal Documentation Build Plugin 3.1M4-SNAPSHOT
[INFO] ------------------------------------------------------------------------
[INFO] 
[INFO] --- maven-clean-plugin:2.4.1:clean (default-clean) @ maven-cayenne-doc-plugin ---
[INFO] 
[INFO] --- maven-plugin-plugin:2.7:descriptor (default-descriptor) @ maven-cayenne-doc-plugin
---
[WARNING] Using platform encoding (ANSI_X3.4-1968 actually) to read mojo metadata, i.e. build
is platform dependent!
[INFO] Applying mojo extractor for language: java
[INFO] Mojo extractor for language: java found 1 mojo descriptors.
[INFO] Applying mojo extractor for language: bsh
[INFO] Mojo extractor for language: bsh found 0 mojo descriptors.
[INFO] 
[INFO] --- maven-resources-plugin:2.4.3:resources (default-resources) @ maven-cayenne-doc-plugin
---
[INFO] Using 'UTF-8' encoding to copy filtered resources.
[INFO] Copying 1 resource
[INFO] 
[INFO] --- maven-compiler-plugin:2.3.2:compile (default-compile) @ maven-cayenne-doc-plugin
---
[WARNING] File encoding has not been set, using platform encoding ANSI_X3.4-1968, i.e. build
is platform dependent!
[INFO] Compiling 6 source files to <https://builds.apache.org/job/Cayenne-trunk/./cayenneTestConnection=HSQLDB,collationCi=false,jdk=JDK%201.6%20(latest),label=Ubuntu/ws/trunk/build-tools/maven-cayenne-doc-plugin/target/classes>
[INFO] 
[INFO] --- maven-resources-plugin:2.4.3:testResources (default-testResources) @ maven-cayenne-doc-plugin
---
[INFO] Using 'UTF-8' encoding to copy filtered resources.
[INFO] skip non existing resourceDirectory <https://builds.apache.org/job/Cayenne-trunk/./cayenneTestConnection=HSQLDB,collationCi=false,jdk=JDK%201.6%20(latest),label=Ubuntu/ws/trunk/build-tools/maven-cayenne-doc-plugin/src/test/resources>
[INFO] 
[INFO] --- maven-compiler-plugin:2.3.2:testCompile (default-testCompile) @ maven-cayenne-doc-plugin
---
[WARNING] File encoding has not been set, using platform encoding ANSI_X3.4-1968, i.e. build
is platform dependent!
[INFO] Compiling 1 source file to <https://builds.apache.org/job/Cayenne-trunk/./cayenneTestConnection=HSQLDB,collationCi=false,jdk=JDK%201.6%20(latest),label=Ubuntu/ws/trunk/build-tools/maven-cayenne-doc-plugin/target/test-classes>
[INFO] 
[INFO] --- maven-surefire-plugin:2.5:test (default-test) @ maven-cayenne-doc-plugin ---
[INFO] Surefire report directory: <https://builds.apache.org/job/Cayenne-trunk/./cayenneTestConnection=HSQLDB,collationCi=false,jdk=JDK%201.6%20(latest),label=Ubuntu/ws/trunk/build-tools/maven-cayenne-doc-plugin/target/surefire-reports>

-------------------------------------------------------
 T E S T S
-------------------------------------------------------
Running org.apache.cayenne.maven.plugin.confluence.DocPageTest
Tests run: 5, Failures: 0, Errors: 0, Skipped: 0, Time elapsed: 0.05 sec

Results :

Tests run: 5, Failures: 0, Errors: 0, Skipped: 0

[INFO] 
[INFO] --- maven-jar-plugin:2.3.1:jar (default-jar) @ maven-cayenne-doc-plugin ---
[INFO] Building jar: <https://builds.apache.org/job/Cayenne-trunk/./cayenneTestConnection=HSQLDB,collationCi=false,jdk=JDK%201.6%20(latest),label=Ubuntu/ws/trunk/build-tools/maven-cayenne-doc-plugin/target/maven-cayenne-doc-plugin-3.1M4-SNAPSHOT.jar>
[INFO] 
[INFO] --- maven-plugin-plugin:2.7:addPluginArtifactMetadata (default-addPluginArtifactMetadata)
@ maven-cayenne-doc-plugin ---
[INFO] 
[INFO] --- maven-install-plugin:2.3.1:install (default-install) @ maven-cayenne-doc-plugin
---
[INFO] Installing <https://builds.apache.org/job/Cayenne-trunk/./cayenneTestConnection=HSQLDB,collationCi=false,jdk=JDK%201.6%20(latest),label=Ubuntu/ws/trunk/build-tools/maven-cayenne-doc-plugin/target/maven-cayenne-doc-plugin-3.1M4-SNAPSHOT.jar>
to /home/hudson/.m2/repository/org/apache/cayenne/build-tools/maven-cayenne-doc-plugin/3.1M4-SNAPSHOT/maven-cayenne-doc-plugin-3.1M4-SNAPSHOT.jar
[INFO] Installing <https://builds.apache.org/job/Cayenne-trunk/./cayenneTestConnection=HSQLDB,collationCi=false,jdk=JDK%201.6%20(latest),label=Ubuntu/ws/trunk/build-tools/maven-cayenne-doc-plugin/pom.xml>
to /home/hudson/.m2/repository/org/apache/cayenne/build-tools/maven-cayenne-doc-plugin/3.1M4-SNAPSHOT/maven-cayenne-doc-plugin-3.1M4-SNAPSHOT.pom
[INFO]                                                                         
[INFO] ------------------------------------------------------------------------
[INFO] Building Cayenne Build Tools Parent 3.1M4-SNAPSHOT
[INFO] ------------------------------------------------------------------------
[INFO] 
[INFO] --- maven-clean-plugin:2.4.1:clean (default-clean) @ cayenne-build-tools ---
[INFO] 
[INFO] --- maven-install-plugin:2.3.1:install (default-install) @ cayenne-build-tools ---
[INFO] Installing <https://builds.apache.org/job/Cayenne-trunk/./cayenneTestConnection=HSQLDB,collationCi=false,jdk=JDK%201.6%20(latest),label=Ubuntu/ws/trunk/build-tools/pom.xml>
to /home/hudson/.m2/repository/org/apache/cayenne/parents/cayenne-build-tools/3.1M4-SNAPSHOT/cayenne-build-tools-3.1M4-SNAPSHOT.pom
[INFO]                                                                         
[INFO] ------------------------------------------------------------------------
[INFO] Building Cayenne License and Notice Bundle 3.1M4-SNAPSHOT
[INFO] ------------------------------------------------------------------------
[INFO] 
[INFO] --- maven-clean-plugin:2.4.1:clean (default-clean) @ cayenne-legal-unpublished ---
[INFO] 
[INFO] --- maven-cayenne-build-plugin:3.1M4-SNAPSHOT:date (date) @ cayenne-legal-unpublished
---
[INFO] 
[INFO] --- maven-remote-resources-plugin:1.0-alpha-1:bundle (default) @ cayenne-legal-unpublished
---
[INFO] 
[INFO] --- maven-resources-plugin:2.4.3:resources (default-resources) @ cayenne-legal-unpublished
---
[INFO] Using 'UTF-8' encoding to copy filtered resources.
[INFO] Copying 2 resources
[INFO] 
[INFO] --- maven-compiler-plugin:2.3.2:compile (default-compile) @ cayenne-legal-unpublished
---
[INFO] No sources to compile
[INFO] 
[INFO] --- maven-resources-plugin:2.4.3:testResources (default-testResources) @ cayenne-legal-unpublished
---
[INFO] Using 'UTF-8' encoding to copy filtered resources.
[INFO] skip non existing resourceDirectory <https://builds.apache.org/job/Cayenne-trunk/./cayenneTestConnection=HSQLDB,collationCi=false,jdk=JDK%201.6%20(latest),label=Ubuntu/ws/trunk/framework/cayenne-legal-unpublished/src/test/resources>
[INFO] 
[INFO] --- maven-compiler-plugin:2.3.2:testCompile (default-testCompile) @ cayenne-legal-unpublished
---
[INFO] No sources to compile
[INFO] 
[INFO] --- maven-surefire-plugin:2.5:test (default-test) @ cayenne-legal-unpublished ---
[INFO] No tests to run.
[INFO] 
[INFO] --- maven-jar-plugin:2.3.1:jar (default-jar) @ cayenne-legal-unpublished ---
[INFO] Building jar: <https://builds.apache.org/job/Cayenne-trunk/./cayenneTestConnection=HSQLDB,collationCi=false,jdk=JDK%201.6%20(latest),label=Ubuntu/ws/trunk/framework/cayenne-legal-unpublished/target/cayenne-legal-unpublished-3.1M4-SNAPSHOT.jar>
[INFO] 
[INFO] >>> maven-source-plugin:2.1.2:jar (bundle-source-jar) @ cayenne-legal-unpublished
>>>
[INFO] 
[INFO] --- maven-cayenne-build-plugin:3.1M4-SNAPSHOT:date (date) @ cayenne-legal-unpublished
---
[INFO] 
[INFO] <<< maven-source-plugin:2.1.2:jar (bundle-source-jar) @ cayenne-legal-unpublished
<<<
[INFO] 
[INFO] --- maven-source-plugin:2.1.2:jar (bundle-source-jar) @ cayenne-legal-unpublished ---
[INFO] Building jar: <https://builds.apache.org/job/Cayenne-trunk/./cayenneTestConnection=HSQLDB,collationCi=false,jdk=JDK%201.6%20(latest),label=Ubuntu/ws/trunk/framework/cayenne-legal-unpublished/target/cayenne-legal-unpublished-3.1M4-SNAPSHOT-sources.jar>
[INFO] 
[INFO] --- maven-install-plugin:2.3.1:install (default-install) @ cayenne-legal-unpublished
---
[INFO] Installing <https://builds.apache.org/job/Cayenne-trunk/./cayenneTestConnection=HSQLDB,collationCi=false,jdk=JDK%201.6%20(latest),label=Ubuntu/ws/trunk/framework/cayenne-legal-unpublished/target/cayenne-legal-unpublished-3.1M4-SNAPSHOT.jar>
to /home/hudson/.m2/repository/org/apache/cayenne/unpublished/cayenne-legal-unpublished/3.1M4-SNAPSHOT/cayenne-legal-unpublished-3.1M4-SNAPSHOT.jar
[INFO] Installing <https://builds.apache.org/job/Cayenne-trunk/./cayenneTestConnection=HSQLDB,collationCi=false,jdk=JDK%201.6%20(latest),label=Ubuntu/ws/trunk/framework/cayenne-legal-unpublished/pom.xml>
to /home/hudson/.m2/repository/org/apache/cayenne/unpublished/cayenne-legal-unpublished/3.1M4-SNAPSHOT/cayenne-legal-unpublished-3.1M4-SNAPSHOT.pom
[INFO] Installing <https://builds.apache.org/job/Cayenne-trunk/./cayenneTestConnection=HSQLDB,collationCi=false,jdk=JDK%201.6%20(latest),label=Ubuntu/ws/trunk/framework/cayenne-legal-unpublished/target/cayenne-legal-unpublished-3.1M4-SNAPSHOT-sources.jar>
to /home/hudson/.m2/repository/org/apache/cayenne/unpublished/cayenne-legal-unpublished/3.1M4-SNAPSHOT/cayenne-legal-unpublished-3.1M4-SNAPSHOT-sources.jar
[INFO] ------------------------------------------------------------------------
[INFO] Reactor Summary:
[INFO] 
[INFO] Cayenne ........................................... SUCCESS [0.413s]
[INFO] Common Unit Test Utilities ........................ SUCCESS [2.374s]
[INFO] Cayenne Internal Build Plugin ..................... SUCCESS [1.783s]
[INFO] Cayenne Internal Documentation Build Plugin ....... SUCCESS [7.451s]
[INFO] Cayenne Build Tools Parent ........................ SUCCESS [0.030s]
[INFO] Cayenne License and Notice Bundle ................. FAILURE [0.616s]
[INFO] Cayenne Dependency Injection Container ............ SKIPPED
[INFO] Cayenne Java 1.5 Unpublished ...................... SKIPPED
[INFO] Cayenne WebObjects Compatibility Library .......... SKIPPED
[INFO] Cayenne Aggregated Server Jar ..................... SKIPPED
[INFO] Cayenne Aggregated Client Jar ..................... SKIPPED
[INFO] Cayenne Project ................................... SKIPPED
[INFO] Cayenne Tools ..................................... SKIPPED
[INFO] Library: cayenne-lifecycle ........................ SKIPPED
[INFO] Cayenne Maven Plugin .............................. SKIPPED
[INFO] Cayenne Framework Aggregator Project .............. SKIPPED
[INFO] Cayenne Integration Tests Parent .................. SKIPPED
[INFO] Integration Tests - Cayenne Runtime ............... SKIPPED
[INFO] Integration Tests - Cayenne Tools ................. SKIPPED
[INFO] Cayenne Modeler ................................... SKIPPED
[INFO] Cayenne Modeler Maven Plugin ...................... SKIPPED
[INFO] Cayenne Modeler Parent ............................ SKIPPED
[INFO] Cayenne Tutorial .................................. SKIPPED
[INFO] Cayenne ROP Server Tutorial ....................... SKIPPED
[INFO] Cayenne ROP Client Tutorial ....................... SKIPPED
[INFO] Cayenne Tutorials ................................. SKIPPED
[INFO] Cayenne Documentation ............................. SKIPPED
[INFO] Cayenne Documenation Parent ....................... SKIPPED
[INFO] Cayenne Docbook Documenation ...................... SKIPPED
[INFO] Docbook: Cayenne Guide ............................ SKIPPED
[INFO] Docbook: Getting Started with Cayenne ............. SKIPPED
[INFO] Docbook: Getting Started with Cayenne ROP ......... SKIPPED
[INFO] Docbook: Cayenne New Features and Upgrade Guide ... SKIPPED
[INFO] ------------------------------------------------------------------------
[INFO] BUILD FAILURE
[INFO] ------------------------------------------------------------------------
[INFO] Total time: 13.689s
[INFO] Finished at: Sun Jan 22 08:24:45 UTC 2012
[INFO] Final Memory: 25M/254M
[INFO] ------------------------------------------------------------------------
[ERROR] Failed to execute goal org.apache.maven.plugins:maven-install-plugin:2.3.1:install
(default-install) on project cayenne-legal-unpublished: Failed to install metadata org.apache.cayenne.unpublished:cayenne-legal-unpublished/maven-metadata.xml:
Could not read metadata /home/hudson/.m2/repository/org/apache/cayenne/unpublished/cayenne-legal-unpublished/maven-metadata-local.xml:
input contained no data -> [Help 1]
org.apache.maven.lifecycle.LifecycleExecutionException: Failed to execute goal org.apache.maven.plugins:maven-install-plugin:2.3.1:install
(default-install) on project cayenne-legal-unpublished: Failed to install metadata org.apache.cayenne.unpublished:cayenne-legal-unpublished/maven-metadata.xml:
Could not read metadata /home/hudson/.m2/repository/org/apache/cayenne/unpublished/cayenne-legal-unpublished/maven-metadata-local.xml:
input contained no data
	at org.apache.maven.lifecycle.internal.MojoExecutor.execute(MojoExecutor.java:217)
	at org.apache.maven.lifecycle.internal.MojoExecutor.execute(MojoExecutor.java:153)
	at org.apache.maven.lifecycle.internal.MojoExecutor.execute(MojoExecutor.java:145)
	at org.apache.maven.lifecycle.internal.LifecycleModuleBuilder.buildProject(LifecycleModuleBuilder.java:84)
	at org.apache.maven.lifecycle.internal.LifecycleModuleBuilder.buildProject(LifecycleModuleBuilder.java:59)
	at org.apache.maven.lifecycle.internal.LifecycleStarter.singleThreadedBuild(LifecycleStarter.java:183)
	at org.apache.maven.lifecycle.internal.LifecycleStarter.execute(LifecycleStarter.java:161)
	at org.apache.maven.DefaultMaven.doExecute(DefaultMaven.java:319)
	at org.apache.maven.DefaultMaven.execute(DefaultMaven.java:156)
	at org.apache.maven.cli.MavenCli.execute(MavenCli.java:537)
	at org.apache.maven.cli.MavenCli.doMain(MavenCli.java:196)
	at org.apache.maven.cli.MavenCli.main(MavenCli.java:141)
	at sun.reflect.NativeMethodAccessorImpl.invoke0(Native Method)
	at sun.reflect.NativeMethodAccessorImpl.invoke(NativeMethodAccessorImpl.java:39)
	at sun.reflect.DelegatingMethodAccessorImpl.invoke(DelegatingMethodAccessorImpl.java:25)
	at java.lang.reflect.Method.invoke(Method.java:597)
	at org.codehaus.plexus.classworlds.launcher.Launcher.launchEnhanced(Launcher.java:290)
	at org.codehaus.plexus.classworlds.launcher.Launcher.launch(Launcher.java:230)
	at org.codehaus.plexus.classworlds.launcher.Launcher.mainWithExitCode(Launcher.java:409)
	at org.codehaus.plexus.classworlds.launcher.Launcher.main(Launcher.java:352)
Caused by: org.apache.maven.plugin.MojoExecutionException: Failed to install metadata org.apache.cayenne.unpublished:cayenne-legal-unpublished/maven-metadata.xml:
Could not read metadata /home/hudson/.m2/repository/org/apache/cayenne/unpublished/cayenne-legal-unpublished/maven-metadata-local.xml:
input contained no data
	at org.apache.maven.plugin.install.InstallMojo.execute(InstallMojo.java:139)
	at org.apache.maven.plugin.DefaultBuildPluginManager.executeMojo(DefaultBuildPluginManager.java:101)
	at org.apache.maven.lifecycle.internal.MojoExecutor.execute(MojoExecutor.java:209)
	... 19 more
Caused by: org.apache.maven.artifact.installer.ArtifactInstallationException: Failed to install
metadata org.apache.cayenne.unpublished:cayenne-legal-unpublished/maven-metadata.xml: Could
not read metadata /home/hudson/.m2/repository/org/apache/cayenne/unpublished/cayenne-legal-unpublished/maven-metadata-local.xml:
input contained no data
	at org.apache.maven.artifact.installer.DefaultArtifactInstaller.install(DefaultArtifactInstaller.java:111)
	at org.apache.maven.plugin.install.InstallMojo.execute(InstallMojo.java:133)
	... 21 more
Caused by: org.sonatype.aether.installation.InstallationException: Failed to install metadata
org.apache.cayenne.unpublished:cayenne-legal-unpublished/maven-metadata.xml: Could not read
metadata /home/hudson/.m2/repository/org/apache/cayenne/unpublished/cayenne-legal-unpublished/maven-metadata-local.xml:
input contained no data
	at org.sonatype.aether.impl.internal.DefaultInstaller.install(DefaultInstaller.java:317)
	at org.sonatype.aether.impl.internal.DefaultInstaller.install(DefaultInstaller.java:215)
	at org.sonatype.aether.impl.internal.DefaultInstaller.install(DefaultInstaller.java:162)
	at org.sonatype.aether.impl.internal.DefaultRepositorySystem.install(DefaultRepositorySystem.java:473)
	at org.apache.maven.artifact.installer.DefaultArtifactInstaller.install(DefaultArtifactInstaller.java:107)
	... 22 more
Caused by: org.sonatype.aether.RepositoryException: Could not read metadata /home/hudson/.m2/repository/org/apache/cayenne/unpublished/cayenne-legal-unpublished/maven-metadata-local.xml:
input contained no data
	at org.apache.maven.repository.internal.MavenMetadata.read(MavenMetadata.java:101)
	at org.apache.maven.repository.internal.MavenMetadata.merge(MavenMetadata.java:69)
	at org.sonatype.aether.impl.internal.DefaultInstaller.install(DefaultInstaller.java:305)
	... 26 more
Caused by: java.io.EOFException: input contained no data
	at org.codehaus.plexus.util.xml.pull.MXParser.fillBuf(MXParser.java:3005)
	at org.codehaus.plexus.util.xml.pull.MXParser.more(MXParser.java:3048)
	at org.codehaus.plexus.util.xml.pull.MXParser.parseProlog(MXParser.java:1422)
	at org.codehaus.plexus.util.xml.pull.MXParser.nextImpl(MXParser.java:1407)
	at org.codehaus.plexus.util.xml.pull.MXParser.next(MXParser.java:1105)
	at org.apache.maven.artifact.repository.metadata.io.xpp3.MetadataXpp3Reader.read(MetadataXpp3Reader.java:1193)
	at org.apache.maven.artifact.repository.metadata.io.xpp3.MetadataXpp3Reader.read(MetadataXpp3Reader.java:1122)
	at org.apache.maven.repository.internal.MavenMetadata.read(MavenMetadata.java:97)
	... 28 more
[ERROR] 
[ERROR] Re-run Maven using the -X switch to enable full debug logging.
[ERROR] 
[ERROR] For more information about the errors and possible solutions, please read the following
articles:
[ERROR] [Help 1] http://cwiki.apache.org/confluence/display/MAVEN/MojoExecutionException
[ERROR] 
[ERROR] After correcting the problems, you can resume the build with the command
[ERROR]   mvn <goals> -rf :cayenne-legal-unpublished
Build step 'Invoke top-level Maven targets' marked build as failure
Archiving artifacts


Mime
View raw message