cayenne-commits mailing list archives

Site index · List index
Message view « Date » · « Thread »
Top « Date » · « Thread »
From Apache Jenkins Server <jenk...@builds.apache.org>
Subject Build failed in Jenkins: Cayenne-trunk » HSQLDB,false,JDK 1.5 (latest),Ubuntu #619
Date Wed, 23 Nov 2011 08:44:07 GMT
See <https://builds.apache.org/job/Cayenne-trunk/./cayenneTestConnection=HSQLDB,collationCi=false,jdk=JDK%201.5%20(latest),label=Ubuntu/619/changes>

Changes:

[aadamchik] CAY-1607 [PATCH] add pluralize method to StringUtils for use in templates

patch by John Huss
changed static method to instance

------------------------------------------
[...truncated 81369 lines...]
[INFO] 
[INFO] --- maven-cayenne-build-plugin:3.1M4-SNAPSHOT:aggregate-sources (aggregate-all) @ cayenne-server
---
[INFO] Expanding: <https://builds.apache.org/job/Cayenne-trunk/./cayenneTestConnection=HSQLDB,collationCi=false,jdk=JDK%201.5%20(latest),label=Ubuntu/ws/trunk/framework/cayenne-di-unpublished/target/cayenne-di-unpublished-3.1M4-SNAPSHOT-sources.jar>
into <https://builds.apache.org/job/Cayenne-trunk/./cayenneTestConnection=HSQLDB,collationCi=false,jdk=JDK%201.5%20(latest),label=Ubuntu/ws/trunk/framework/cayenne-server/target/aggregate/unpack-sources>
[INFO] Expanding: <https://builds.apache.org/job/Cayenne-trunk/./cayenneTestConnection=HSQLDB,collationCi=false,jdk=JDK%201.5%20(latest),label=Ubuntu/ws/trunk/framework/cayenne-jdk1.5-unpublished/target/cayenne-jdk1.5-unpublished-3.1M4-SNAPSHOT-sources.jar>
into <https://builds.apache.org/job/Cayenne-trunk/./cayenneTestConnection=HSQLDB,collationCi=false,jdk=JDK%201.5%20(latest),label=Ubuntu/ws/trunk/framework/cayenne-server/target/aggregate/unpack-sources>
[INFO] Expanding: <https://builds.apache.org/job/Cayenne-trunk/./cayenneTestConnection=HSQLDB,collationCi=false,jdk=JDK%201.5%20(latest),label=Ubuntu/ws/trunk/framework/cayenne-legal-unpublished/target/cayenne-legal-unpublished-3.1M4-SNAPSHOT-sources.jar>
into <https://builds.apache.org/job/Cayenne-trunk/./cayenneTestConnection=HSQLDB,collationCi=false,jdk=JDK%201.5%20(latest),label=Ubuntu/ws/trunk/framework/cayenne-server/target/aggregate/unpack-sources>
[INFO] Building jar: <https://builds.apache.org/job/Cayenne-trunk/./cayenneTestConnection=HSQLDB,collationCi=false,jdk=JDK%201.5%20(latest),label=Ubuntu/619/artifact/trunk/framework/cayenne-server/target/cayenne-server-3.1M4-SNAPSHOT-sources.jar>
[INFO] 
[INFO] --- maven-install-plugin:2.3.1:install (default-install) @ cayenne-server ---
[INFO] Installing <https://builds.apache.org/job/Cayenne-trunk/./cayenneTestConnection=HSQLDB,collationCi=false,jdk=JDK%201.5%20(latest),label=Ubuntu/619/artifact/trunk/framework/cayenne-server/target/cayenne-server-3.1M4-SNAPSHOT.jar>
to /home/hudson/.m2/repository/org/apache/cayenne/cayenne-server/3.1M4-SNAPSHOT/cayenne-server-3.1M4-SNAPSHOT.jar
[INFO] Installing <https://builds.apache.org/job/Cayenne-trunk/./cayenneTestConnection=HSQLDB,collationCi=false,jdk=JDK%201.5%20(latest),label=Ubuntu/ws/trunk/framework/cayenne-server/pom.xml>
to /home/hudson/.m2/repository/org/apache/cayenne/cayenne-server/3.1M4-SNAPSHOT/cayenne-server-3.1M4-SNAPSHOT.pom
[INFO] Installing <https://builds.apache.org/job/Cayenne-trunk/./cayenneTestConnection=HSQLDB,collationCi=false,jdk=JDK%201.5%20(latest),label=Ubuntu/619/artifact/trunk/framework/cayenne-server/target/cayenne-server-3.1M4-SNAPSHOT-sources.jar>
to /home/hudson/.m2/repository/org/apache/cayenne/cayenne-server/3.1M4-SNAPSHOT/cayenne-server-3.1M4-SNAPSHOT-sources.jar
[INFO]                                                                         
[INFO] ------------------------------------------------------------------------
[INFO] Building Cayenne Aggregated Client Jar 3.1M4-SNAPSHOT
[INFO] ------------------------------------------------------------------------
[INFO] 
[INFO] --- maven-clean-plugin:2.4.1:clean (default-clean) @ cayenne-client ---
[INFO] 
[INFO] --- maven-resources-plugin:2.4.3:resources (default-resources) @ cayenne-client ---
[INFO] Using 'UTF-8' encoding to copy filtered resources.
[INFO] skip non existing resourceDirectory <https://builds.apache.org/job/Cayenne-trunk/./cayenneTestConnection=HSQLDB,collationCi=false,jdk=JDK%201.5%20(latest),label=Ubuntu/ws/trunk/framework/cayenne-client/src/main/resources>
[INFO] 
[INFO] --- maven-compiler-plugin:2.3.2:compile (default-compile) @ cayenne-client ---
[INFO] No sources to compile
[INFO] 
[INFO] --- maven-resources-plugin:2.4.3:testResources (default-testResources) @ cayenne-client
---
[INFO] Using 'UTF-8' encoding to copy filtered resources.
[INFO] skip non existing resourceDirectory <https://builds.apache.org/job/Cayenne-trunk/./cayenneTestConnection=HSQLDB,collationCi=false,jdk=JDK%201.5%20(latest),label=Ubuntu/ws/trunk/framework/cayenne-client/src/test/resources>
[INFO] 
[INFO] --- maven-compiler-plugin:2.3.2:testCompile (default-testCompile) @ cayenne-client
---
[INFO] No sources to compile
[INFO] 
[INFO] --- maven-surefire-plugin:2.5:test (default-test) @ cayenne-client ---
[INFO] No tests to run.
[INFO] 
[INFO] --- maven-jar-plugin:2.3.1:jar (default-jar) @ cayenne-client ---
[WARNING] JAR will be empty - no content was marked for inclusion!
[INFO] Building jar: <https://builds.apache.org/job/Cayenne-trunk/./cayenneTestConnection=HSQLDB,collationCi=false,jdk=JDK%201.5%20(latest),label=Ubuntu/619/artifact/trunk/framework/cayenne-client/target/cayenne-client-3.1M4-SNAPSHOT.jar>
[INFO] 
[INFO] --- maven-cayenne-build-plugin:3.1M4-SNAPSHOT:aggregate-bin (aggregate-all) @ cayenne-client
---
[INFO] Expanding: <https://builds.apache.org/job/Cayenne-trunk/./cayenneTestConnection=HSQLDB,collationCi=false,jdk=JDK%201.5%20(latest),label=Ubuntu/ws/trunk/framework/cayenne-di-unpublished/target/cayenne-di-unpublished-3.1M4-SNAPSHOT.jar>
into <https://builds.apache.org/job/Cayenne-trunk/./cayenneTestConnection=HSQLDB,collationCi=false,jdk=JDK%201.5%20(latest),label=Ubuntu/ws/trunk/framework/cayenne-client/target/aggregate/unpack-bin>
[INFO] Expanding: <https://builds.apache.org/job/Cayenne-trunk/./cayenneTestConnection=HSQLDB,collationCi=false,jdk=JDK%201.5%20(latest),label=Ubuntu/ws/trunk/framework/cayenne-jdk1.5-unpublished/target/cayenne-jdk1.5-unpublished-3.1M4-SNAPSHOT.jar>
into <https://builds.apache.org/job/Cayenne-trunk/./cayenneTestConnection=HSQLDB,collationCi=false,jdk=JDK%201.5%20(latest),label=Ubuntu/ws/trunk/framework/cayenne-client/target/aggregate/unpack-bin>
[INFO] Expanding: <https://builds.apache.org/job/Cayenne-trunk/./cayenneTestConnection=HSQLDB,collationCi=false,jdk=JDK%201.5%20(latest),label=Ubuntu/ws/trunk/framework/cayenne-legal-unpublished/target/cayenne-legal-unpublished-3.1M4-SNAPSHOT.jar>
into <https://builds.apache.org/job/Cayenne-trunk/./cayenneTestConnection=HSQLDB,collationCi=false,jdk=JDK%201.5%20(latest),label=Ubuntu/ws/trunk/framework/cayenne-client/target/aggregate/unpack-bin>
[INFO] Building jar: <https://builds.apache.org/job/Cayenne-trunk/./cayenneTestConnection=HSQLDB,collationCi=false,jdk=JDK%201.5%20(latest),label=Ubuntu/619/artifact/trunk/framework/cayenne-client/target/cayenne-client-3.1M4-SNAPSHOT.jar>
[INFO] 
[INFO] --- maven-cayenne-build-plugin:3.1M4-SNAPSHOT:aggregate-sources (aggregate-all) @ cayenne-client
---
[INFO] Expanding: <https://builds.apache.org/job/Cayenne-trunk/./cayenneTestConnection=HSQLDB,collationCi=false,jdk=JDK%201.5%20(latest),label=Ubuntu/ws/trunk/framework/cayenne-di-unpublished/target/cayenne-di-unpublished-3.1M4-SNAPSHOT-sources.jar>
into <https://builds.apache.org/job/Cayenne-trunk/./cayenneTestConnection=HSQLDB,collationCi=false,jdk=JDK%201.5%20(latest),label=Ubuntu/ws/trunk/framework/cayenne-client/target/aggregate/unpack-sources>
[INFO] Expanding: <https://builds.apache.org/job/Cayenne-trunk/./cayenneTestConnection=HSQLDB,collationCi=false,jdk=JDK%201.5%20(latest),label=Ubuntu/ws/trunk/framework/cayenne-jdk1.5-unpublished/target/cayenne-jdk1.5-unpublished-3.1M4-SNAPSHOT-sources.jar>
into <https://builds.apache.org/job/Cayenne-trunk/./cayenneTestConnection=HSQLDB,collationCi=false,jdk=JDK%201.5%20(latest),label=Ubuntu/ws/trunk/framework/cayenne-client/target/aggregate/unpack-sources>
[INFO] Expanding: <https://builds.apache.org/job/Cayenne-trunk/./cayenneTestConnection=HSQLDB,collationCi=false,jdk=JDK%201.5%20(latest),label=Ubuntu/ws/trunk/framework/cayenne-legal-unpublished/target/cayenne-legal-unpublished-3.1M4-SNAPSHOT-sources.jar>
into <https://builds.apache.org/job/Cayenne-trunk/./cayenneTestConnection=HSQLDB,collationCi=false,jdk=JDK%201.5%20(latest),label=Ubuntu/ws/trunk/framework/cayenne-client/target/aggregate/unpack-sources>
[INFO] Building jar: <https://builds.apache.org/job/Cayenne-trunk/./cayenneTestConnection=HSQLDB,collationCi=false,jdk=JDK%201.5%20(latest),label=Ubuntu/619/artifact/trunk/framework/cayenne-client/target/cayenne-client-3.1M4-SNAPSHOT-sources.jar>
[INFO] 
[INFO] --- maven-install-plugin:2.3.1:install (default-install) @ cayenne-client ---
[INFO] Installing <https://builds.apache.org/job/Cayenne-trunk/./cayenneTestConnection=HSQLDB,collationCi=false,jdk=JDK%201.5%20(latest),label=Ubuntu/619/artifact/trunk/framework/cayenne-client/target/cayenne-client-3.1M4-SNAPSHOT.jar>
to /home/hudson/.m2/repository/org/apache/cayenne/cayenne-client/3.1M4-SNAPSHOT/cayenne-client-3.1M4-SNAPSHOT.jar
[INFO] Installing <https://builds.apache.org/job/Cayenne-trunk/./cayenneTestConnection=HSQLDB,collationCi=false,jdk=JDK%201.5%20(latest),label=Ubuntu/ws/trunk/framework/cayenne-client/pom.xml>
to /home/hudson/.m2/repository/org/apache/cayenne/cayenne-client/3.1M4-SNAPSHOT/cayenne-client-3.1M4-SNAPSHOT.pom
[INFO] Installing <https://builds.apache.org/job/Cayenne-trunk/./cayenneTestConnection=HSQLDB,collationCi=false,jdk=JDK%201.5%20(latest),label=Ubuntu/619/artifact/trunk/framework/cayenne-client/target/cayenne-client-3.1M4-SNAPSHOT-sources.jar>
to /home/hudson/.m2/repository/org/apache/cayenne/cayenne-client/3.1M4-SNAPSHOT/cayenne-client-3.1M4-SNAPSHOT-sources.jar
[INFO]                                                                         
[INFO] ------------------------------------------------------------------------
[INFO] Building Cayenne Project 3.1M4-SNAPSHOT
[INFO] ------------------------------------------------------------------------
[INFO] 
[INFO] --- maven-clean-plugin:2.4.1:clean (default-clean) @ cayenne-project ---
[INFO] 
[INFO] --- maven-resources-plugin:2.4.3:resources (default-resources) @ cayenne-project ---
[INFO] Using 'UTF-8' encoding to copy filtered resources.
[INFO] skip non existing resourceDirectory <https://builds.apache.org/job/Cayenne-trunk/./cayenneTestConnection=HSQLDB,collationCi=false,jdk=JDK%201.5%20(latest),label=Ubuntu/ws/trunk/framework/cayenne-project/src/main/resources>
[INFO] 
[INFO] --- maven-compiler-plugin:2.3.2:compile (default-compile) @ cayenne-project ---
[WARNING] File encoding has not been set, using platform encoding ANSI_X3.4-1968, i.e. build
is platform dependent!
[INFO] Compiling 45 source files to <https://builds.apache.org/job/Cayenne-trunk/./cayenneTestConnection=HSQLDB,collationCi=false,jdk=JDK%201.5%20(latest),label=Ubuntu/ws/trunk/framework/cayenne-project/target/classes>
[INFO] 
[INFO] --- maven-resources-plugin:2.4.3:testResources (default-testResources) @ cayenne-project
---
[INFO] Using 'UTF-8' encoding to copy filtered resources.
[INFO] Copying 16 resources
[INFO] 
[INFO] --- maven-compiler-plugin:2.3.2:testCompile (default-testCompile) @ cayenne-project
---
[WARNING] File encoding has not been set, using platform encoding ANSI_X3.4-1968, i.e. build
is platform dependent!
[INFO] Compiling 7 source files to <https://builds.apache.org/job/Cayenne-trunk/./cayenneTestConnection=HSQLDB,collationCi=false,jdk=JDK%201.5%20(latest),label=Ubuntu/ws/trunk/framework/cayenne-project/target/test-classes>
[INFO] 
[INFO] --- maven-surefire-plugin:2.5:test (default-test) @ cayenne-project ---
[INFO] Surefire report directory: <https://builds.apache.org/job/Cayenne-trunk/./cayenneTestConnection=HSQLDB,collationCi=false,jdk=JDK%201.5%20(latest),label=Ubuntu/ws/trunk/framework/cayenne-project/target/surefire-reports>

-------------------------------------------------------
 T E S T S
-------------------------------------------------------
Running org.apache.cayenne.project.upgrade.v6.XMLDataChannelDescriptorLoader_V3_0_0_1Test
Tests run: 1, Failures: 0, Errors: 0, Skipped: 0, Time elapsed: 0.046 sec
Running org.apache.cayenne.project.ProjectTest
Tests run: 1, Failures: 0, Errors: 0, Skipped: 0, Time elapsed: 0.009 sec
Running org.apache.cayenne.project.upgrade.v6.ProjectUpgrader_V6Test
Tests run: 4, Failures: 0, Errors: 0, Skipped: 0, Time elapsed: 0.229 sec
Running org.apache.cayenne.project.DataChannelProjectSaverTest
Nov 23, 2011 8:43:44 AM org.apache.cayenne.configuration.XMLDataChannelDescriptorLoader load
INFO: Loading XML configuration resource from <https://builds.apache.org/job/Cayenne-trunk/./cayenneTestConnection=HSQLDB,collationCi=false,jdk=JDK%201.5%20(latest),label=Ubuntu/ws/trunk/framework/cayenne-project/target/test-classes/org/apache/cayenne/project/cayenne-PROJECT2.xml>
Nov 23, 2011 8:43:44 AM org.apache.cayenne.configuration.XMLDataChannelDescriptorLoader$DataSourceChildrenHandler
createChildTagHandler
INFO: loading user name and password.
Nov 23, 2011 8:43:44 AM org.apache.cayenne.configuration.XMLDataChannelDescriptorLoader load
INFO: Loading XML configuration resource from <https://builds.apache.org/job/Cayenne-trunk/./cayenneTestConnection=HSQLDB,collationCi=false,jdk=JDK%201.5%20(latest),label=Ubuntu/ws/trunk/framework/cayenne-project/target/test-classes/org/apache/cayenne/project/cayenne-PROJECT2.xml>
Nov 23, 2011 8:43:44 AM org.apache.cayenne.configuration.XMLDataChannelDescriptorLoader$DataSourceChildrenHandler
createChildTagHandler
INFO: loading user name and password.
Tests run: 2, Failures: 0, Errors: 0, Skipped: 0, Time elapsed: 0.054 sec
Running org.apache.cayenne.project.FileProjectSaverTest
Tests run: 1, Failures: 0, Errors: 0, Skipped: 0, Time elapsed: 0.022 sec
Running org.apache.cayenne.project.DataChannelProjectLoaderTest
Nov 23, 2011 8:43:44 AM org.apache.cayenne.configuration.XMLDataChannelDescriptorLoader load
INFO: Loading XML configuration resource from <https://builds.apache.org/job/Cayenne-trunk/./cayenneTestConnection=HSQLDB,collationCi=false,jdk=JDK%201.5%20(latest),label=Ubuntu/ws/trunk/framework/cayenne-project/target/test-classes/org/apache/cayenne/project/cayenne-PROJECT1.xml>
Nov 23, 2011 8:43:44 AM org.apache.cayenne.configuration.XMLDataChannelDescriptorLoader$DataSourceChildrenHandler
createChildTagHandler
INFO: loading user name and password.
Tests run: 1, Failures: 0, Errors: 0, Skipped: 0, Time elapsed: 0.011 sec

Results :

Tests run: 10, Failures: 0, Errors: 0, Skipped: 0

[INFO] 
[INFO] --- maven-jar-plugin:2.3.1:jar (default-jar) @ cayenne-project ---
[INFO] Building jar: <https://builds.apache.org/job/Cayenne-trunk/./cayenneTestConnection=HSQLDB,collationCi=false,jdk=JDK%201.5%20(latest),label=Ubuntu/ws/trunk/framework/cayenne-project/target/cayenne-project-3.1M4-SNAPSHOT.jar>
[INFO] 
[INFO] >>> maven-source-plugin:2.1.2:jar (bundle-source-jar) @ cayenne-project >>>
[INFO] 
[INFO] <<< maven-source-plugin:2.1.2:jar (bundle-source-jar) @ cayenne-project <<<
[INFO] 
[INFO] --- maven-source-plugin:2.1.2:jar (bundle-source-jar) @ cayenne-project ---
[INFO] Building jar: <https://builds.apache.org/job/Cayenne-trunk/./cayenneTestConnection=HSQLDB,collationCi=false,jdk=JDK%201.5%20(latest),label=Ubuntu/ws/trunk/framework/cayenne-project/target/cayenne-project-3.1M4-SNAPSHOT-sources.jar>
[INFO] 
[INFO] --- maven-install-plugin:2.3.1:install (default-install) @ cayenne-project ---
[INFO] Installing <https://builds.apache.org/job/Cayenne-trunk/./cayenneTestConnection=HSQLDB,collationCi=false,jdk=JDK%201.5%20(latest),label=Ubuntu/ws/trunk/framework/cayenne-project/target/cayenne-project-3.1M4-SNAPSHOT.jar>
to /home/hudson/.m2/repository/org/apache/cayenne/cayenne-project/3.1M4-SNAPSHOT/cayenne-project-3.1M4-SNAPSHOT.jar
[INFO] Installing <https://builds.apache.org/job/Cayenne-trunk/./cayenneTestConnection=HSQLDB,collationCi=false,jdk=JDK%201.5%20(latest),label=Ubuntu/ws/trunk/framework/cayenne-project/pom.xml>
to /home/hudson/.m2/repository/org/apache/cayenne/cayenne-project/3.1M4-SNAPSHOT/cayenne-project-3.1M4-SNAPSHOT.pom
[INFO] Installing <https://builds.apache.org/job/Cayenne-trunk/./cayenneTestConnection=HSQLDB,collationCi=false,jdk=JDK%201.5%20(latest),label=Ubuntu/ws/trunk/framework/cayenne-project/target/cayenne-project-3.1M4-SNAPSHOT-sources.jar>
to /home/hudson/.m2/repository/org/apache/cayenne/cayenne-project/3.1M4-SNAPSHOT/cayenne-project-3.1M4-SNAPSHOT-sources.jar
[INFO]                                                                         
[INFO] ------------------------------------------------------------------------
[INFO] Building Cayenne Tools 3.1M4-SNAPSHOT
[INFO] ------------------------------------------------------------------------
[INFO] 
[INFO] --- maven-clean-plugin:2.4.1:clean (default-clean) @ cayenne-tools ---
[INFO] 
[INFO] --- maven-resources-plugin:2.4.3:resources (default-resources) @ cayenne-tools ---
[INFO] Using 'UTF-8' encoding to copy filtered resources.
[INFO] Copying 16 resources
[INFO] 
[INFO] --- maven-remote-resources-plugin:1.2:process (default) @ cayenne-tools ---
[INFO] Setting property: classpath.resource.loader.class => 'org.codehaus.plexus.velocity.ContextClassLoaderResourceLoader'.
[INFO] Setting property: velocimacro.messages.on => 'false'.
[INFO] Setting property: resource.loader => 'classpath'.
[INFO] Setting property: resource.manager.logwhenfound => 'false'.
[INFO] 
[INFO] --- maven-compiler-plugin:2.3.2:compile (default-compile) @ cayenne-tools ---
[WARNING] File encoding has not been set, using platform encoding ANSI_X3.4-1968, i.e. build
is platform dependent!
[INFO] Compiling 28 source files to <https://builds.apache.org/job/Cayenne-trunk/./cayenneTestConnection=HSQLDB,collationCi=false,jdk=JDK%201.5%20(latest),label=Ubuntu/ws/trunk/framework/cayenne-tools/target/classes>
[INFO] -------------------------------------------------------------
[ERROR] COMPILATION ERROR : 
[INFO] -------------------------------------------------------------
[ERROR] <https://builds.apache.org/job/Cayenne-trunk/./cayenneTestConnection=HSQLDB,collationCi=false,jdk=JDK%201.5%20(latest),label=Ubuntu/ws/trunk/framework/cayenne-tools/src/main/java/org/apache/cayenne/gen/StringUtils.java>:[133,30]
cannot find symbol
symbol  : method isEmpty()
location: class java.lang.String
[INFO] 1 error
[INFO] -------------------------------------------------------------
[INFO] ------------------------------------------------------------------------
[INFO] Reactor Summary:
[INFO] 
[INFO] Cayenne ........................................... SUCCESS [0.244s]
[INFO] Common Unit Test Utilities ........................ SUCCESS [1.469s]
[INFO] Cayenne Internal Build Plugin ..................... SUCCESS [1.386s]
[INFO] Cayenne Internal Documentation Build Plugin ....... SUCCESS [1.457s]
[INFO] Cayenne Build Tools Parent ........................ SUCCESS [0.006s]
[INFO] Cayenne License and Notice Bundle ................. SUCCESS [0.708s]
[INFO] Cayenne Dependency Injection Container ............ SUCCESS [2.205s]
[INFO] Cayenne Java 1.5 Unpublished ...................... SUCCESS [1:24.648s]
[INFO] Cayenne WebObjects Compatibility Library .......... SUCCESS [2.795s]
[INFO] Cayenne Aggregated Server Jar ..................... SUCCESS [3.559s]
[INFO] Cayenne Aggregated Client Jar ..................... SUCCESS [2.172s]
[INFO] Cayenne Project ................................... SUCCESS [4.874s]
[INFO] Cayenne Tools ..................................... FAILURE [1.651s]
[INFO] Library: cayenne-lifecycle ........................ SKIPPED
[INFO] Cayenne Maven Plugin .............................. SKIPPED
[INFO] Cayenne Framework Aggregator Project .............. SKIPPED
[INFO] Cayenne Integration Tests Parent .................. SKIPPED
[INFO] Integration Tests - Cayenne Runtime ............... SKIPPED
[INFO] Integration Tests - Cayenne Tools ................. SKIPPED
[INFO] Cayenne Modeler ................................... SKIPPED
[INFO] Cayenne Modeler Maven Plugin ...................... SKIPPED
[INFO] Cayenne Modeler Parent ............................ SKIPPED
[INFO] Cayenne Tutorial .................................. SKIPPED
[INFO] Cayenne ROP Server Tutorial ....................... SKIPPED
[INFO] Cayenne ROP Client Tutorial ....................... SKIPPED
[INFO] Cayenne Tutorials ................................. SKIPPED
[INFO] Cayenne Documentation ............................. SKIPPED
[INFO] Cayenne Documenation Parent ....................... SKIPPED
[INFO] Cayenne Docbook Documenation ...................... SKIPPED
[INFO] Docbook: Cayenne Guide ............................ SKIPPED
[INFO] Docbook: Getting Started with Cayenne ............. SKIPPED
[INFO] Docbook: Getting Started with Cayenne ROP ......... SKIPPED
[INFO] Docbook: Cayenne New Features and Upgrade Guide ... SKIPPED
[INFO] ------------------------------------------------------------------------
[INFO] BUILD FAILURE
[INFO] ------------------------------------------------------------------------
[INFO] Total time: 1:48.501s
[INFO] Finished at: Wed Nov 23 08:43:47 UTC 2011
[INFO] Final Memory: 31M/173M
[INFO] ------------------------------------------------------------------------
[ERROR] Failed to execute goal org.apache.maven.plugins:maven-compiler-plugin:2.3.2:compile
(default-compile) on project cayenne-tools: Compilation failure
[ERROR] <https://builds.apache.org/job/Cayenne-trunk/./cayenneTestConnection=HSQLDB,collationCi=false,jdk=JDK%201.5%20(latest),label=Ubuntu/ws/trunk/framework/cayenne-tools/src/main/java/org/apache/cayenne/gen/StringUtils.java>:[133,30]
cannot find symbol
[ERROR] symbol  : method isEmpty()
[ERROR] location: class java.lang.String
[ERROR] -> [Help 1]
org.apache.maven.lifecycle.LifecycleExecutionException: Failed to execute goal org.apache.maven.plugins:maven-compiler-plugin:2.3.2:compile
(default-compile) on project cayenne-tools: Compilation failure
<https://builds.apache.org/job/Cayenne-trunk/./cayenneTestConnection=HSQLDB,collationCi=false,jdk=JDK%201.5%20(latest),label=Ubuntu/ws/trunk/framework/cayenne-tools/src/main/java/org/apache/cayenne/gen/StringUtils.java>:[133,30]
cannot find symbol
symbol  : method isEmpty()
location: class java.lang.String

	at org.apache.maven.lifecycle.internal.MojoExecutor.execute(MojoExecutor.java:213)
	at org.apache.maven.lifecycle.internal.MojoExecutor.execute(MojoExecutor.java:153)
	at org.apache.maven.lifecycle.internal.MojoExecutor.execute(MojoExecutor.java:145)
	at org.apache.maven.lifecycle.internal.LifecycleModuleBuilder.buildProject(LifecycleModuleBuilder.java:84)
	at org.apache.maven.lifecycle.internal.LifecycleModuleBuilder.buildProject(LifecycleModuleBuilder.java:59)
	at org.apache.maven.lifecycle.internal.LifecycleStarter.singleThreadedBuild(LifecycleStarter.java:183)
	at org.apache.maven.lifecycle.internal.LifecycleStarter.execute(LifecycleStarter.java:161)
	at org.apache.maven.DefaultMaven.doExecute(DefaultMaven.java:319)
	at org.apache.maven.DefaultMaven.execute(DefaultMaven.java:156)
	at org.apache.maven.cli.MavenCli.execute(MavenCli.java:537)
	at org.apache.maven.cli.MavenCli.doMain(MavenCli.java:196)
	at org.apache.maven.cli.MavenCli.main(MavenCli.java:141)
	at sun.reflect.NativeMethodAccessorImpl.invoke0(Native Method)
	at sun.reflect.NativeMethodAccessorImpl.invoke(NativeMethodAccessorImpl.java:39)
	at sun.reflect.DelegatingMethodAccessorImpl.invoke(DelegatingMethodAccessorImpl.java:25)
	at java.lang.reflect.Method.invoke(Method.java:592)
	at org.codehaus.plexus.classworlds.launcher.Launcher.launchEnhanced(Launcher.java:290)
	at org.codehaus.plexus.classworlds.launcher.Launcher.launch(Launcher.java:230)
	at org.codehaus.plexus.classworlds.launcher.Launcher.mainWithExitCode(Launcher.java:409)
	at org.codehaus.plexus.classworlds.launcher.Launcher.main(Launcher.java:352)
Caused by: org.apache.maven.plugin.CompilationFailureException: Compilation failure
<https://builds.apache.org/job/Cayenne-trunk/./cayenneTestConnection=HSQLDB,collationCi=false,jdk=JDK%201.5%20(latest),label=Ubuntu/ws/trunk/framework/cayenne-tools/src/main/java/org/apache/cayenne/gen/StringUtils.java>:[133,30]
cannot find symbol
symbol  : method isEmpty()
location: class java.lang.String

	at org.apache.maven.plugin.AbstractCompilerMojo.execute(AbstractCompilerMojo.java:656)
	at org.apache.maven.plugin.CompilerMojo.execute(CompilerMojo.java:128)
	at org.apache.maven.plugin.DefaultBuildPluginManager.executeMojo(DefaultBuildPluginManager.java:101)
	at org.apache.maven.lifecycle.internal.MojoExecutor.execute(MojoExecutor.java:209)
	... 19 more
[ERROR] 
[ERROR] Re-run Maven using the -X switch to enable full debug logging.
[ERROR] 
[ERROR] For more information about the errors and possible solutions, please read the following
articles:
[ERROR] [Help 1] http://cwiki.apache.org/confluence/display/MAVEN/MojoFailureException
[ERROR] 
[ERROR] After correcting the problems, you can resume the build with the command
[ERROR]   mvn <goals> -rf :cayenne-tools
Build step 'Invoke top-level Maven targets' marked build as failure
Archiving artifacts


Mime
View raw message