cayenne-commits mailing list archives

Site index · List index
Message view « Date » · « Thread »
Top « Date » · « Thread »
From Apache Jenkins Server <jenk...@builds.apache.org>
Subject Build failed in Jenkins: Cayenne-trunk » derby,false,JDK 1.5 (latest),Ubuntu #583
Date Thu, 15 Sep 2011 15:27:53 GMT
See <https://builds.apache.org/job/Cayenne-trunk/./cayenneTestConnection=derby,collationCi=false,jdk=JDK%201.5%20(latest),label=Ubuntu/583/>

------------------------------------------
[...truncated 86218 lines...]
INFO: === returned 1 row. - took 1 ms.
Sep 15, 2011 3:27:51 PM org.apache.cayenne.log.CommonsJdbcEventLogger logCommitTransaction
INFO: +++ transaction committed.
Sep 15, 2011 3:27:51 PM org.apache.cayenne.log.CommonsJdbcEventLogger logBeginTransaction
INFO: --- transaction started.
Sep 15, 2011 3:27:51 PM org.apache.cayenne.log.CommonsJdbcEventLogger logQuery
INFO: SELECT NEXT_ID FROM AUTO_PK_SUPPORT WHERE TABLE_NAME = 'E1'
Sep 15, 2011 3:27:51 PM org.apache.cayenne.log.CommonsJdbcEventLogger logSelectCount
INFO: === returned 1 row. - took 0 ms.
Sep 15, 2011 3:27:51 PM org.apache.cayenne.log.CommonsJdbcEventLogger logQuery
INFO: UPDATE AUTO_PK_SUPPORT SET NEXT_ID = NEXT_ID + 20 WHERE TABLE_NAME = 'E1'
Sep 15, 2011 3:27:51 PM org.apache.cayenne.log.CommonsJdbcEventLogger logUpdateCount
INFO: === updated 1 row.
Sep 15, 2011 3:27:51 PM org.apache.cayenne.log.CommonsJdbcEventLogger logQuery
INFO: INSERT INTO E1 (ID) VALUES (?)
Sep 15, 2011 3:27:51 PM org.apache.cayenne.log.CommonsJdbcEventLogger logQueryParameters
INFO: [bind: 1->ID:220]
Sep 15, 2011 3:27:51 PM org.apache.cayenne.log.CommonsJdbcEventLogger logUpdateCount
INFO: === updated 1 row.
Sep 15, 2011 3:27:51 PM org.apache.cayenne.log.CommonsJdbcEventLogger logQuery
INFO: UPDATE UUID_ROOT1 SET UUID = ? WHERE ID = ?
Sep 15, 2011 3:27:51 PM org.apache.cayenne.log.CommonsJdbcEventLogger logQueryParameters
INFO: [bind: 1->UUID:'E1:220', 2->ID:1]
Sep 15, 2011 3:27:51 PM org.apache.cayenne.log.CommonsJdbcEventLogger logUpdateCount
INFO: === updated 1 row.
Sep 15, 2011 3:27:51 PM org.apache.cayenne.log.CommonsJdbcEventLogger logCommitTransaction
INFO: +++ transaction committed.
Sep 15, 2011 3:27:51 PM org.apache.cayenne.test.jdbc.UtilityLogger log
INFO: select ID, UUID from UUID_ROOT1
Sep 15, 2011 3:27:51 PM org.apache.cayenne.log.CommonsJdbcEventLogger logBeginTransaction
INFO: --- transaction started.
Sep 15, 2011 3:27:51 PM org.apache.cayenne.log.CommonsJdbcEventLogger logQuery
INFO: SELECT t0.UUID, t0.ID FROM UUID_ROOT1 t0 WHERE t0.ID = ? [bind: 1->ID:1]
Sep 15, 2011 3:27:51 PM org.apache.cayenne.log.CommonsJdbcEventLogger logSelectCount
INFO: === returned 1 row. - took 1 ms.
Sep 15, 2011 3:27:51 PM org.apache.cayenne.log.CommonsJdbcEventLogger logCommitTransaction
INFO: +++ transaction committed.
Sep 15, 2011 3:27:51 PM org.apache.cayenne.log.CommonsJdbcEventLogger logBeginTransaction
INFO: --- transaction started.
Sep 15, 2011 3:27:51 PM org.apache.cayenne.log.CommonsJdbcEventLogger logQuery
INFO: SELECT t0.ID FROM E1 t0 WHERE t0.ID = ? [bind: 1->ID:220]
Sep 15, 2011 3:27:51 PM org.apache.cayenne.log.CommonsJdbcEventLogger logSelectCount
INFO: === returned 1 row. - took 0 ms.
Sep 15, 2011 3:27:51 PM org.apache.cayenne.log.CommonsJdbcEventLogger logCommitTransaction
INFO: +++ transaction committed.
Tests run: 3, Failures: 0, Errors: 0, Skipped: 0, Time elapsed: 0.72 sec
Running org.apache.cayenne.lifecycle.sort.WeightedAshwoodEntitySorterTest
Sep 15, 2011 3:27:51 PM org.apache.cayenne.configuration.XMLDataChannelDescriptorLoader load
INFO: Loading XML configuration resource from file:/x1/jenkins/jenkins-slave/workspace/Cayenne-trunk/cayenneTestConnection/derby/collationCi/false/jdk/JDK%201.5%20(latest)/label/Ubuntu/trunk/framework/cayenne-lifecycle/target/test-classes/cayenne-lifecycle.xml
Sep 15, 2011 3:27:51 PM org.apache.cayenne.configuration.XMLDataChannelDescriptorLoader$DataSourceChildrenHandler
createChildTagHandler
INFO: loading user name and password.
Sep 15, 2011 3:27:51 PM org.apache.cayenne.log.CommonsJdbcEventLogger logPoolCreated
INFO: Created connection pool: jdbc:hsqldb:mem:lifecycle
	Driver class: org.hsqldb.jdbcDriver
	Min. connections in the pool: 1
	Max. connections in the pool: 1
Tests run: 1, Failures: 0, Errors: 0, Skipped: 0, Time elapsed: 0.017 sec
Running org.apache.cayenne.lifecycle.ref.ReferenceableHandlerTest
Sep 15, 2011 3:27:51 PM org.apache.cayenne.configuration.XMLDataChannelDescriptorLoader load
INFO: Loading XML configuration resource from file:/x1/jenkins/jenkins-slave/workspace/Cayenne-trunk/cayenneTestConnection/derby/collationCi/false/jdk/JDK%201.5%20(latest)/label/Ubuntu/trunk/framework/cayenne-lifecycle/target/test-classes/cayenne-lifecycle.xml
Sep 15, 2011 3:27:51 PM org.apache.cayenne.configuration.XMLDataChannelDescriptorLoader$DataSourceChildrenHandler
createChildTagHandler
INFO: loading user name and password.
Sep 15, 2011 3:27:51 PM org.apache.cayenne.log.CommonsJdbcEventLogger logPoolCreated
INFO: Created connection pool: jdbc:hsqldb:mem:lifecycle
	Driver class: org.hsqldb.jdbcDriver
	Min. connections in the pool: 1
	Max. connections in the pool: 1
Sep 15, 2011 3:27:51 PM org.apache.cayenne.configuration.XMLDataChannelDescriptorLoader load
INFO: Loading XML configuration resource from file:/x1/jenkins/jenkins-slave/workspace/Cayenne-trunk/cayenneTestConnection/derby/collationCi/false/jdk/JDK%201.5%20(latest)/label/Ubuntu/trunk/framework/cayenne-lifecycle/target/test-classes/cayenne-lifecycle.xml
Sep 15, 2011 3:27:51 PM org.apache.cayenne.configuration.XMLDataChannelDescriptorLoader$DataSourceChildrenHandler
createChildTagHandler
INFO: loading user name and password.
Sep 15, 2011 3:27:51 PM org.apache.cayenne.log.CommonsJdbcEventLogger logPoolCreated
INFO: Created connection pool: jdbc:hsqldb:mem:lifecycle
	Driver class: org.hsqldb.jdbcDriver
	Min. connections in the pool: 1
	Max. connections in the pool: 1
Sep 15, 2011 3:27:51 PM org.apache.cayenne.configuration.XMLDataChannelDescriptorLoader load
INFO: Loading XML configuration resource from file:/x1/jenkins/jenkins-slave/workspace/Cayenne-trunk/cayenneTestConnection/derby/collationCi/false/jdk/JDK%201.5%20(latest)/label/Ubuntu/trunk/framework/cayenne-lifecycle/target/test-classes/cayenne-lifecycle.xml
Sep 15, 2011 3:27:51 PM org.apache.cayenne.configuration.XMLDataChannelDescriptorLoader$DataSourceChildrenHandler
createChildTagHandler
INFO: loading user name and password.
Sep 15, 2011 3:27:51 PM org.apache.cayenne.log.CommonsJdbcEventLogger logPoolCreated
INFO: Created connection pool: jdbc:hsqldb:mem:lifecycle
	Driver class: org.hsqldb.jdbcDriver
	Min. connections in the pool: 1
	Max. connections in the pool: 1
Tests run: 3, Failures: 0, Errors: 0, Skipped: 0, Time elapsed: 0.043 sec
Running org.apache.cayenne.lifecycle.audit.AuditableFilterTest
Tests run: 6, Failures: 0, Errors: 0, Skipped: 0, Time elapsed: 0.139 sec
Running org.apache.cayenne.lifecycle.uuid.UuidCoderTest
Tests run: 5, Failures: 0, Errors: 0, Skipped: 0, Time elapsed: 0.037 sec

Results :

Tests run: 18, Failures: 0, Errors: 0, Skipped: 0

[INFO] 
[INFO] --- maven-jar-plugin:2.3.1:jar (default-jar) @ cayenne-lifecycle ---
[INFO] Building jar: /x1/jenkins/jenkins-slave/workspace/Cayenne-trunk/cayenneTestConnection/derby/collationCi/false/jdk/JDK
1.5 (latest)/label/Ubuntu/trunk/framework/cayenne-lifecycle/target/cayenne-lifecycle-3.1M4-SNAPSHOT.jar
[INFO] 
[INFO] >>> maven-source-plugin:2.1.2:jar (bundle-source-jar) @ cayenne-lifecycle
>>>
[INFO] 
[INFO] <<< maven-source-plugin:2.1.2:jar (bundle-source-jar) @ cayenne-lifecycle
<<<
[INFO] 
[INFO] --- maven-source-plugin:2.1.2:jar (bundle-source-jar) @ cayenne-lifecycle ---
[INFO] org already added, skipping
[INFO] org/apache already added, skipping
[INFO] org/apache/cayenne already added, skipping
[INFO] org/apache/cayenne/lifecycle already added, skipping
[INFO] org/apache/cayenne/lifecycle/sort already added, skipping
[INFO] org/apache/cayenne/lifecycle/audit already added, skipping
[INFO] org/apache/cayenne/lifecycle/uuid already added, skipping
[INFO] org/apache/cayenne/lifecycle/relationship already added, skipping
[INFO] org/apache/cayenne/lifecycle/relationship/update already added, skipping
[INFO] org/apache/cayenne/lifecycle/ref already added, skipping
[INFO] org/apache/cayenne/lifecycle/changeset already added, skipping
[INFO] org/apache/cayenne/lifecycle/cache already added, skipping
[INFO] Building jar: /x1/jenkins/jenkins-slave/workspace/Cayenne-trunk/cayenneTestConnection/derby/collationCi/false/jdk/JDK
1.5 (latest)/label/Ubuntu/trunk/framework/cayenne-lifecycle/target/cayenne-lifecycle-3.1M4-SNAPSHOT-sources.jar
[INFO] org already added, skipping
[INFO] org/apache already added, skipping
[INFO] org/apache/cayenne already added, skipping
[INFO] org/apache/cayenne/lifecycle already added, skipping
[INFO] org/apache/cayenne/lifecycle/sort already added, skipping
[INFO] org/apache/cayenne/lifecycle/audit already added, skipping
[INFO] org/apache/cayenne/lifecycle/uuid already added, skipping
[INFO] org/apache/cayenne/lifecycle/relationship already added, skipping
[INFO] org/apache/cayenne/lifecycle/relationship/update already added, skipping
[INFO] org/apache/cayenne/lifecycle/ref already added, skipping
[INFO] org/apache/cayenne/lifecycle/changeset already added, skipping
[INFO] org/apache/cayenne/lifecycle/cache already added, skipping
[INFO] 
[INFO] --- maven-install-plugin:2.3.1:install (default-install) @ cayenne-lifecycle ---
[INFO] Installing /x1/jenkins/jenkins-slave/workspace/Cayenne-trunk/cayenneTestConnection/derby/collationCi/false/jdk/JDK
1.5 (latest)/label/Ubuntu/trunk/framework/cayenne-lifecycle/target/cayenne-lifecycle-3.1M4-SNAPSHOT.jar
to /home/jenkins/.m2/repository/org/apache/cayenne/cayenne-lifecycle/3.1M4-SNAPSHOT/cayenne-lifecycle-3.1M4-SNAPSHOT.jar
[INFO] Installing /x1/jenkins/jenkins-slave/workspace/Cayenne-trunk/cayenneTestConnection/derby/collationCi/false/jdk/JDK
1.5 (latest)/label/Ubuntu/trunk/framework/cayenne-lifecycle/pom.xml to /home/jenkins/.m2/repository/org/apache/cayenne/cayenne-lifecycle/3.1M4-SNAPSHOT/cayenne-lifecycle-3.1M4-SNAPSHOT.pom
[INFO] Installing /x1/jenkins/jenkins-slave/workspace/Cayenne-trunk/cayenneTestConnection/derby/collationCi/false/jdk/JDK
1.5 (latest)/label/Ubuntu/trunk/framework/cayenne-lifecycle/target/cayenne-lifecycle-3.1M4-SNAPSHOT-sources.jar
to /home/jenkins/.m2/repository/org/apache/cayenne/cayenne-lifecycle/3.1M4-SNAPSHOT/cayenne-lifecycle-3.1M4-SNAPSHOT-sources.jar
[INFO]                                                                         
[INFO] ------------------------------------------------------------------------
[INFO] Building Cayenne Maven Plugin 3.1M4-SNAPSHOT
[INFO] ------------------------------------------------------------------------
[INFO] 
[INFO] --- maven-clean-plugin:2.4.1:clean (default-clean) @ maven-cayenne-plugin ---
[INFO] 
[INFO] --- maven-plugin-plugin:2.6:descriptor (default-descriptor) @ maven-cayenne-plugin
---
[WARNING] Using platform encoding (ANSI_X3.4-1968 actually) to read mojo metadata, i.e. build
is platform dependent!
[INFO] Applying mojo extractor for language: java
[INFO] Mojo extractor for language: java found 3 mojo descriptors.
[INFO] Applying mojo extractor for language: bsh
[INFO] Mojo extractor for language: bsh found 0 mojo descriptors.
[INFO] 
[INFO] --- maven-resources-plugin:2.4.3:resources (default-resources) @ maven-cayenne-plugin
---
[INFO] Using 'UTF-8' encoding to copy filtered resources.
[INFO] skip non existing resourceDirectory /x1/jenkins/jenkins-slave/workspace/Cayenne-trunk/cayenneTestConnection/derby/collationCi/false/jdk/JDK
1.5 (latest)/label/Ubuntu/trunk/framework/maven-cayenne-plugin/src/main/resources
[INFO] 
[INFO] --- maven-compiler-plugin:2.3.2:compile (default-compile) @ maven-cayenne-plugin ---
[WARNING] File encoding has not been set, using platform encoding ANSI_X3.4-1968, i.e. build
is platform dependent!
[INFO] Compiling 4 source files to /x1/jenkins/jenkins-slave/workspace/Cayenne-trunk/cayenneTestConnection/derby/collationCi/false/jdk/JDK
1.5 (latest)/label/Ubuntu/trunk/framework/maven-cayenne-plugin/target/classes
[INFO] -------------------------------------------------------------
[ERROR] COMPILATION ERROR : 
[INFO] -------------------------------------------------------------
[ERROR] /x1/jenkins/jenkins-slave/workspace/Cayenne-trunk/cayenneTestConnection/derby/collationCi/false/jdk/JDK
1.5 (latest)/label/Ubuntu/trunk/framework/maven-cayenne-plugin/src/main/java/org/apache/cayenne/tools/DbGeneratorMojo.java:[150,60]
incompatible types
found   : java.lang.Object
required: org.apache.cayenne.dba.DbAdapter
[ERROR] /x1/jenkins/jenkins-slave/workspace/Cayenne-trunk/cayenneTestConnection/derby/collationCi/false/jdk/JDK
1.5 (latest)/label/Ubuntu/trunk/framework/maven-cayenne-plugin/src/main/java/org/apache/cayenne/tools/DbImporterMojo.java:[194,60]
incompatible types
found   : java.lang.Object
required: org.apache.cayenne.dba.DbAdapter
[INFO] 2 errors 
[INFO] -------------------------------------------------------------
[INFO] ------------------------------------------------------------------------
[INFO] Reactor Summary:
[INFO] 
[INFO] Cayenne ........................................... SUCCESS [0.182s]
[INFO] Common Unit Test Utilities ........................ SUCCESS [1.094s]
[INFO] Cayenne Internal Build Plugin ..................... SUCCESS [0.834s]
[INFO] Cayenne Internal Documentation Build Plugin ....... SUCCESS [1.133s]
[INFO] Cayenne Build Tools Parent ........................ SUCCESS [0.005s]
[INFO] Cayenne License and Notice Bundle ................. SUCCESS [0.571s]
[INFO] Cayenne Dependency Injection Container ............ SUCCESS [1.977s]
[INFO] Cayenne Java 1.5 Unpublished ...................... SUCCESS [57.500s]
[INFO] Cayenne WebObjects Compatibility Library .......... SUCCESS [1.935s]
[INFO] Cayenne Aggregated Server Jar ..................... SUCCESS [2.065s]
[INFO] Cayenne Aggregated Client Jar ..................... SUCCESS [1.540s]
[INFO] Cayenne Project ................................... SUCCESS [1.856s]
[INFO] Cayenne Tools ..................................... SUCCESS [3.942s]
[INFO] Library: cayenne-lifecycle ........................ SUCCESS [2.493s]
[INFO] Cayenne Maven Plugin .............................. FAILURE [0.460s]
[INFO] Cayenne Framework Aggregator Project .............. SKIPPED
[INFO] Cayenne Integration Tests Parent .................. SKIPPED
[INFO] Integration Tests - Cayenne Runtime ............... SKIPPED
[INFO] Integration Tests - Cayenne Tools ................. SKIPPED
[INFO] Cayenne Modeler ................................... SKIPPED
[INFO] Cayenne Modeler Maven Plugin ...................... SKIPPED
[INFO] Cayenne Modeler Parent ............................ SKIPPED
[INFO] Cayenne Tutorial .................................. SKIPPED
[INFO] Cayenne ROP Server Tutorial ....................... SKIPPED
[INFO] Cayenne ROP Client Tutorial ....................... SKIPPED
[INFO] Cayenne Tutorials ................................. SKIPPED
[INFO] Cayenne Documentation ............................. SKIPPED
[INFO] Cayenne Documenation Parent ....................... SKIPPED
[INFO] ------------------------------------------------------------------------
[INFO] BUILD FAILURE
[INFO] ------------------------------------------------------------------------
[INFO] Total time: 1:18.168s
[INFO] Finished at: Thu Sep 15 15:27:52 GMT 2011
[INFO] Final Memory: 38M/419M
[INFO] ------------------------------------------------------------------------
[ERROR] Failed to execute goal org.apache.maven.plugins:maven-compiler-plugin:2.3.2:compile
(default-compile) on project maven-cayenne-plugin: Compilation failure: Compilation failure:
[ERROR] /x1/jenkins/jenkins-slave/workspace/Cayenne-trunk/cayenneTestConnection/derby/collationCi/false/jdk/JDK
1.5 (latest)/label/Ubuntu/trunk/framework/maven-cayenne-plugin/src/main/java/org/apache/cayenne/tools/DbGeneratorMojo.java:[150,60]
incompatible types
[ERROR] found   : java.lang.Object
[ERROR] required: org.apache.cayenne.dba.DbAdapter
[ERROR] /x1/jenkins/jenkins-slave/workspace/Cayenne-trunk/cayenneTestConnection/derby/collationCi/false/jdk/JDK
1.5 (latest)/label/Ubuntu/trunk/framework/maven-cayenne-plugin/src/main/java/org/apache/cayenne/tools/DbImporterMojo.java:[194,60]
incompatible types
[ERROR] found   : java.lang.Object
[ERROR] required: org.apache.cayenne.dba.DbAdapter
[ERROR] -> [Help 1]
org.apache.maven.lifecycle.LifecycleExecutionException: Failed to execute goal org.apache.maven.plugins:maven-compiler-plugin:2.3.2:compile
(default-compile) on project maven-cayenne-plugin: Compilation failure
	at org.apache.maven.lifecycle.internal.MojoExecutor.execute(MojoExecutor.java:213)
	at org.apache.maven.lifecycle.internal.MojoExecutor.execute(MojoExecutor.java:153)
	at org.apache.maven.lifecycle.internal.MojoExecutor.execute(MojoExecutor.java:145)
	at org.apache.maven.lifecycle.internal.LifecycleModuleBuilder.buildProject(LifecycleModuleBuilder.java:84)
	at org.apache.maven.lifecycle.internal.LifecycleModuleBuilder.buildProject(LifecycleModuleBuilder.java:59)
	at org.apache.maven.lifecycle.internal.LifecycleStarter.singleThreadedBuild(LifecycleStarter.java:183)
	at org.apache.maven.lifecycle.internal.LifecycleStarter.execute(LifecycleStarter.java:161)
	at org.apache.maven.DefaultMaven.doExecute(DefaultMaven.java:319)
	at org.apache.maven.DefaultMaven.execute(DefaultMaven.java:156)
	at org.apache.maven.cli.MavenCli.execute(MavenCli.java:534)
	at org.apache.maven.cli.MavenCli.doMain(MavenCli.java:196)
	at org.apache.maven.cli.MavenCli.main(MavenCli.java:141)
	at sun.reflect.NativeMethodAccessorImpl.invoke0(Native Method)
	at sun.reflect.NativeMethodAccessorImpl.invoke(NativeMethodAccessorImpl.java:39)
	at sun.reflect.DelegatingMethodAccessorImpl.invoke(DelegatingMethodAccessorImpl.java:25)
	at java.lang.reflect.Method.invoke(Method.java:592)
	at org.codehaus.plexus.classworlds.launcher.Launcher.launchEnhanced(Launcher.java:290)
	at org.codehaus.plexus.classworlds.launcher.Launcher.launch(Launcher.java:230)
	at org.codehaus.plexus.classworlds.launcher.Launcher.mainWithExitCode(Launcher.java:409)
	at org.codehaus.plexus.classworlds.launcher.Launcher.main(Launcher.java:352)
Caused by: org.apache.maven.plugin.CompilationFailureException: Compilation failure
	at org.apache.maven.plugin.AbstractCompilerMojo.execute(AbstractCompilerMojo.java:656)
	at org.apache.maven.plugin.CompilerMojo.execute(CompilerMojo.java:128)
	at org.apache.maven.plugin.DefaultBuildPluginManager.executeMojo(DefaultBuildPluginManager.java:107)
	at org.apache.maven.lifecycle.internal.MojoExecutor.execute(MojoExecutor.java:209)
	... 19 more
[ERROR] 
[ERROR] Re-run Maven using the -X switch to enable full debug logging.
[ERROR] 
[ERROR] For more information about the errors and possible solutions, please read the following
articles:
[ERROR] [Help 1] http://cwiki.apache.org/confluence/display/MAVEN/MojoFailureException
[ERROR] 
[ERROR] After correcting the problems, you can resume the build with the command
[ERROR]   mvn <goals> -rf :maven-cayenne-plugin
Build step 'Invoke top-level Maven targets' marked build as failure
Archiving artifacts


Mime
View raw message