cayenne-commits mailing list archives

Site index · List index
Message view « Date » · « Thread »
Top « Date » · « Thread »
From Apache Jenkins Server <jenk...@builds.apache.org>
Subject Build failed in Jenkins: Cayenne-trunk » derby,JDK 1.5 (latest),Ubuntu #545
Date Mon, 01 Aug 2011 15:30:16 GMT
See <https://builds.apache.org/job/Cayenne-trunk/./cayenneTestConnection=derby,jdk=JDK%201.5%20(latest),label=Ubuntu/545/changes>

Changes:

[dkazimirchyk] CAY-1594 DI extension point: turning on/off cross-ObjectContext synchronization

added ObjectStoreFactory which decides turn sync on or off basing on RuntimeProperties

[aadamchik] CAY-1266 Joint prefetches with fetch limit and offset do not work on Oracle

------------------------------------------
[...truncated 80941 lines...]
[INFO] org/apache/cayenne/dba/sqlserver already added, skipping
[INFO] org/apache/cayenne/dba/openbase already added, skipping
[INFO] org/apache/cayenne/dba/postgres already added, skipping
[INFO] org/apache/cayenne/dba/db2 already added, skipping
[INFO] org/apache/cayenne/dba/h2 already added, skipping
[INFO] org/apache/cayenne/dba/derby already added, skipping
[INFO] org/apache/cayenne/dba/ingres already added, skipping
[INFO] org/apache/cayenne/dba/sqlite already added, skipping
[INFO] org/apache/cayenne/dba/oracle already added, skipping
[INFO] Building jar: /x1/jenkins/jenkins-slave/workspace/Cayenne-trunk/cayenneTestConnection/derby/jdk/JDK
1.5 (latest)/label/Ubuntu/trunk/framework/cayenne-jdk1.5-unpublished/target/cayenne-jdk1.5-unpublished-3.1-SNAPSHOT-sources.jar
[INFO] org already added, skipping
[INFO] org/apache already added, skipping
[INFO] org/apache/cayenne already added, skipping
[INFO] org/apache/cayenne/ejbql already added, skipping
[INFO] org/apache/cayenne/ejbql/parser already added, skipping
[INFO] org already added, skipping
[INFO] org/apache already added, skipping
[INFO] org/apache/cayenne already added, skipping
[INFO] org/apache/cayenne/ejbql already added, skipping
[INFO] org/apache/cayenne/ejbql/parser already added, skipping
[INFO] org already added, skipping
[INFO] org/apache already added, skipping
[INFO] org/apache/cayenne already added, skipping
[INFO] org/apache/cayenne/dba already added, skipping
[INFO] org/apache/cayenne/dba/sybase already added, skipping
[INFO] org/apache/cayenne/dba/hsqldb already added, skipping
[INFO] org/apache/cayenne/dba/mysql already added, skipping
[INFO] org/apache/cayenne/dba/frontbase already added, skipping
[INFO] org/apache/cayenne/dba/sqlserver already added, skipping
[INFO] org/apache/cayenne/dba/openbase already added, skipping
[INFO] org/apache/cayenne/dba/postgres already added, skipping
[INFO] org/apache/cayenne/dba/db2 already added, skipping
[INFO] org/apache/cayenne/dba/h2 already added, skipping
[INFO] org/apache/cayenne/dba/derby already added, skipping
[INFO] org/apache/cayenne/dba/ingres already added, skipping
[INFO] org/apache/cayenne/dba/sqlite already added, skipping
[INFO] org/apache/cayenne/dba/oracle already added, skipping
[INFO] 
[INFO] --- maven-install-plugin:2.3.1:install (default-install) @ cayenne-jdk1.5-unpublished
---
[INFO] Installing /x1/jenkins/jenkins-slave/workspace/Cayenne-trunk/cayenneTestConnection/derby/jdk/JDK
1.5 (latest)/label/Ubuntu/trunk/framework/cayenne-jdk1.5-unpublished/target/cayenne-jdk1.5-unpublished-3.1-SNAPSHOT.jar
to /home/jenkins/.m2/repository/org/apache/cayenne/unpublished/cayenne-jdk1.5-unpublished/3.1-SNAPSHOT/cayenne-jdk1.5-unpublished-3.1-SNAPSHOT.jar
[INFO] Installing /x1/jenkins/jenkins-slave/workspace/Cayenne-trunk/cayenneTestConnection/derby/jdk/JDK
1.5 (latest)/label/Ubuntu/trunk/framework/cayenne-jdk1.5-unpublished/pom.xml to /home/jenkins/.m2/repository/org/apache/cayenne/unpublished/cayenne-jdk1.5-unpublished/3.1-SNAPSHOT/cayenne-jdk1.5-unpublished-3.1-SNAPSHOT.pom
[INFO] Installing /x1/jenkins/jenkins-slave/workspace/Cayenne-trunk/cayenneTestConnection/derby/jdk/JDK
1.5 (latest)/label/Ubuntu/trunk/framework/cayenne-jdk1.5-unpublished/target/cayenne-jdk1.5-unpublished-3.1-SNAPSHOT-sources.jar
to /home/jenkins/.m2/repository/org/apache/cayenne/unpublished/cayenne-jdk1.5-unpublished/3.1-SNAPSHOT/cayenne-jdk1.5-unpublished-3.1-SNAPSHOT-sources.jar
[INFO]                                                                         
[INFO] ------------------------------------------------------------------------
[INFO] Building Cayenne WebObjects Compatibility Library 3.1-SNAPSHOT
[INFO] ------------------------------------------------------------------------
[INFO] 
[INFO] --- maven-clean-plugin:2.4.1:clean (default-clean) @ cayenne-wocompat-unpublished ---
[INFO] 
[INFO] --- maven-resources-plugin:2.4.3:resources (default-resources) @ cayenne-wocompat-unpublished
---
[INFO] Using 'UTF-8' encoding to copy filtered resources.
[INFO] skip non existing resourceDirectory /x1/jenkins/jenkins-slave/workspace/Cayenne-trunk/cayenneTestConnection/derby/jdk/JDK
1.5 (latest)/label/Ubuntu/trunk/framework/cayenne-wocompat-unpublished/src/main/resources
[INFO] 
[INFO] --- maven-compiler-plugin:2.3.2:compile (default-compile) @ cayenne-wocompat-unpublished
---
[WARNING] File encoding has not been set, using platform encoding ANSI_X3.4-1968, i.e. build
is platform dependent!
[INFO] Compiling 17 source files to /x1/jenkins/jenkins-slave/workspace/Cayenne-trunk/cayenneTestConnection/derby/jdk/JDK
1.5 (latest)/label/Ubuntu/trunk/framework/cayenne-wocompat-unpublished/target/classes
[INFO] 
[INFO] --- maven-resources-plugin:2.4.3:testResources (default-testResources) @ cayenne-wocompat-unpublished
---
[INFO] Using 'UTF-8' encoding to copy filtered resources.
[INFO] Copying 57 resources
[INFO] 
[INFO] --- maven-compiler-plugin:2.3.2:testCompile (default-testCompile) @ cayenne-wocompat-unpublished
---
[WARNING] File encoding has not been set, using platform encoding ANSI_X3.4-1968, i.e. build
is platform dependent!
[INFO] Compiling 8 source files to /x1/jenkins/jenkins-slave/workspace/Cayenne-trunk/cayenneTestConnection/derby/jdk/JDK
1.5 (latest)/label/Ubuntu/trunk/framework/cayenne-wocompat-unpublished/target/test-classes
[INFO] 
[INFO] --- maven-surefire-plugin:2.5:test (default-test) @ cayenne-wocompat-unpublished ---
[INFO] Surefire report directory: /x1/jenkins/jenkins-slave/workspace/Cayenne-trunk/cayenneTestConnection/derby/jdk/JDK
1.5 (latest)/label/Ubuntu/trunk/framework/cayenne-wocompat-unpublished/target/surefire-reports

-------------------------------------------------------
 T E S T S
-------------------------------------------------------
Running org.apache.cayenne.wocompat.EOModelProcessorTest
Tests run: 3, Failures: 0, Errors: 0, Skipped: 0, Time elapsed: 0.173 sec
Running org.apache.cayenne.wocompat.EOModelPrototypesTest
Tests run: 4, Failures: 0, Errors: 0, Skipped: 0, Time elapsed: 0.03 sec
Running org.apache.cayenne.wocompat.PropertyListSerializationTest
Tests run: 11, Failures: 0, Errors: 0, Skipped: 0, Time elapsed: 0.012 sec
Running org.apache.cayenne.wocompat.EOQueryTest
Tests run: 1, Failures: 0, Errors: 0, Skipped: 0, Time elapsed: 0.008 sec
Running org.apache.cayenne.wocompat.EOModelHelperTest
Tests run: 6, Failures: 0, Errors: 0, Skipped: 0, Time elapsed: 0.036 sec
Running org.apache.cayenne.wocompat.parser.PropertyListParserTest
Tests run: 18, Failures: 0, Errors: 0, Skipped: 0, Time elapsed: 0.008 sec
Running org.apache.cayenne.wocompat.EOModelProcessorInheritanceTest
Tests run: 3, Failures: 0, Errors: 0, Skipped: 0, Time elapsed: 0.017 sec

Results :

Tests run: 46, Failures: 0, Errors: 0, Skipped: 0

[INFO] 
[INFO] --- maven-jar-plugin:2.3.1:jar (default-jar) @ cayenne-wocompat-unpublished ---
[INFO] Building jar: /x1/jenkins/jenkins-slave/workspace/Cayenne-trunk/cayenneTestConnection/derby/jdk/JDK
1.5 (latest)/label/Ubuntu/trunk/framework/cayenne-wocompat-unpublished/target/cayenne-wocompat-unpublished-3.1-SNAPSHOT.jar
[INFO] 
[INFO] >>> maven-source-plugin:2.1.2:jar (bundle-source-jar) @ cayenne-wocompat-unpublished
>>>
[INFO] 
[INFO] <<< maven-source-plugin:2.1.2:jar (bundle-source-jar) @ cayenne-wocompat-unpublished
<<<
[INFO] 
[INFO] --- maven-source-plugin:2.1.2:jar (bundle-source-jar) @ cayenne-wocompat-unpublished
---
[INFO] Building jar: /x1/jenkins/jenkins-slave/workspace/Cayenne-trunk/cayenneTestConnection/derby/jdk/JDK
1.5 (latest)/label/Ubuntu/trunk/framework/cayenne-wocompat-unpublished/target/cayenne-wocompat-unpublished-3.1-SNAPSHOT-sources.jar
[INFO] 
[INFO] --- maven-install-plugin:2.3.1:install (default-install) @ cayenne-wocompat-unpublished
---
[INFO] Installing /x1/jenkins/jenkins-slave/workspace/Cayenne-trunk/cayenneTestConnection/derby/jdk/JDK
1.5 (latest)/label/Ubuntu/trunk/framework/cayenne-wocompat-unpublished/target/cayenne-wocompat-unpublished-3.1-SNAPSHOT.jar
to /home/jenkins/.m2/repository/org/apache/cayenne/unpublished/cayenne-wocompat-unpublished/3.1-SNAPSHOT/cayenne-wocompat-unpublished-3.1-SNAPSHOT.jar
[INFO] Installing /x1/jenkins/jenkins-slave/workspace/Cayenne-trunk/cayenneTestConnection/derby/jdk/JDK
1.5 (latest)/label/Ubuntu/trunk/framework/cayenne-wocompat-unpublished/pom.xml to /home/jenkins/.m2/repository/org/apache/cayenne/unpublished/cayenne-wocompat-unpublished/3.1-SNAPSHOT/cayenne-wocompat-unpublished-3.1-SNAPSHOT.pom
[INFO] Installing /x1/jenkins/jenkins-slave/workspace/Cayenne-trunk/cayenneTestConnection/derby/jdk/JDK
1.5 (latest)/label/Ubuntu/trunk/framework/cayenne-wocompat-unpublished/target/cayenne-wocompat-unpublished-3.1-SNAPSHOT-sources.jar
to /home/jenkins/.m2/repository/org/apache/cayenne/unpublished/cayenne-wocompat-unpublished/3.1-SNAPSHOT/cayenne-wocompat-unpublished-3.1-SNAPSHOT-sources.jar
[INFO]                                                                         
[INFO] ------------------------------------------------------------------------
[INFO] Building Cayenne Aggregated Server Jar 3.1-SNAPSHOT
[INFO] ------------------------------------------------------------------------
[INFO] 
[INFO] --- maven-clean-plugin:2.4.1:clean (default-clean) @ cayenne-server ---
[INFO] 
[INFO] --- maven-resources-plugin:2.4.3:resources (default-resources) @ cayenne-server ---
[INFO] Using 'UTF-8' encoding to copy filtered resources.
[INFO] skip non existing resourceDirectory /x1/jenkins/jenkins-slave/workspace/Cayenne-trunk/cayenneTestConnection/derby/jdk/JDK
1.5 (latest)/label/Ubuntu/trunk/framework/cayenne-server/src/main/resources
[INFO] 
[INFO] --- maven-compiler-plugin:2.3.2:compile (default-compile) @ cayenne-server ---
[INFO] No sources to compile
[INFO] 
[INFO] --- maven-resources-plugin:2.4.3:testResources (default-testResources) @ cayenne-server
---
[INFO] Using 'UTF-8' encoding to copy filtered resources.
[INFO] skip non existing resourceDirectory /x1/jenkins/jenkins-slave/workspace/Cayenne-trunk/cayenneTestConnection/derby/jdk/JDK
1.5 (latest)/label/Ubuntu/trunk/framework/cayenne-server/src/test/resources
[INFO] 
[INFO] --- maven-compiler-plugin:2.3.2:testCompile (default-testCompile) @ cayenne-server
---
[INFO] No sources to compile
[INFO] 
[INFO] --- maven-surefire-plugin:2.5:test (default-test) @ cayenne-server ---
[INFO] No tests to run.
[INFO] 
[INFO] --- maven-jar-plugin:2.3.1:jar (default-jar) @ cayenne-server ---
[WARNING] JAR will be empty - no content was marked for inclusion!
[INFO] Building jar: /x1/jenkins/jenkins-slave/workspace/Cayenne-trunk/cayenneTestConnection/derby/jdk/JDK
1.5 (latest)/label/Ubuntu/trunk/framework/cayenne-server/target/cayenne-server-3.1-SNAPSHOT.jar
[INFO] 
[INFO] --- maven-cayenne-build-plugin:3.1-SNAPSHOT:aggregate-bin (aggregate-all) @ cayenne-server
---
[INFO] Expanding: /x1/jenkins/jenkins-slave/workspace/Cayenne-trunk/cayenneTestConnection/derby/jdk/JDK
1.5 (latest)/label/Ubuntu/trunk/framework/cayenne-di-unpublished/target/cayenne-di-unpublished-3.1-SNAPSHOT.jar
into /x1/jenkins/jenkins-slave/workspace/Cayenne-trunk/cayenneTestConnection/derby/jdk/JDK
1.5 (latest)/label/Ubuntu/trunk/framework/cayenne-server/target/aggregate/unpack-bin
[INFO] Expanding: /x1/jenkins/jenkins-slave/workspace/Cayenne-trunk/cayenneTestConnection/derby/jdk/JDK
1.5 (latest)/label/Ubuntu/trunk/framework/cayenne-jdk1.5-unpublished/target/cayenne-jdk1.5-unpublished-3.1-SNAPSHOT.jar
into /x1/jenkins/jenkins-slave/workspace/Cayenne-trunk/cayenneTestConnection/derby/jdk/JDK
1.5 (latest)/label/Ubuntu/trunk/framework/cayenne-server/target/aggregate/unpack-bin
[INFO] Expanding: /x1/jenkins/jenkins-slave/workspace/Cayenne-trunk/cayenneTestConnection/derby/jdk/JDK
1.5 (latest)/label/Ubuntu/trunk/framework/cayenne-legal-unpublished/target/cayenne-legal-unpublished-3.1-SNAPSHOT.jar
into /x1/jenkins/jenkins-slave/workspace/Cayenne-trunk/cayenneTestConnection/derby/jdk/JDK
1.5 (latest)/label/Ubuntu/trunk/framework/cayenne-server/target/aggregate/unpack-bin
[INFO] Building jar: /x1/jenkins/jenkins-slave/workspace/Cayenne-trunk/cayenneTestConnection/derby/jdk/JDK
1.5 (latest)/label/Ubuntu/trunk/framework/cayenne-server/target/cayenne-server-3.1-SNAPSHOT.jar
[INFO] 
[INFO] --- maven-cayenne-build-plugin:3.1-SNAPSHOT:aggregate-sources (aggregate-all) @ cayenne-server
---
[INFO] Expanding: /x1/jenkins/jenkins-slave/workspace/Cayenne-trunk/cayenneTestConnection/derby/jdk/JDK
1.5 (latest)/label/Ubuntu/trunk/framework/cayenne-di-unpublished/target/cayenne-di-unpublished-3.1-SNAPSHOT-sources.jar
into /x1/jenkins/jenkins-slave/workspace/Cayenne-trunk/cayenneTestConnection/derby/jdk/JDK
1.5 (latest)/label/Ubuntu/trunk/framework/cayenne-server/target/aggregate/unpack-sources
[INFO] Expanding: /x1/jenkins/jenkins-slave/workspace/Cayenne-trunk/cayenneTestConnection/derby/jdk/JDK
1.5 (latest)/label/Ubuntu/trunk/framework/cayenne-jdk1.5-unpublished/target/cayenne-jdk1.5-unpublished-3.1-SNAPSHOT-sources.jar
into /x1/jenkins/jenkins-slave/workspace/Cayenne-trunk/cayenneTestConnection/derby/jdk/JDK
1.5 (latest)/label/Ubuntu/trunk/framework/cayenne-server/target/aggregate/unpack-sources
[INFO] Expanding: /x1/jenkins/jenkins-slave/workspace/Cayenne-trunk/cayenneTestConnection/derby/jdk/JDK
1.5 (latest)/label/Ubuntu/trunk/framework/cayenne-legal-unpublished/target/cayenne-legal-unpublished-3.1-SNAPSHOT-sources.jar
into /x1/jenkins/jenkins-slave/workspace/Cayenne-trunk/cayenneTestConnection/derby/jdk/JDK
1.5 (latest)/label/Ubuntu/trunk/framework/cayenne-server/target/aggregate/unpack-sources
[INFO] Building jar: /x1/jenkins/jenkins-slave/workspace/Cayenne-trunk/cayenneTestConnection/derby/jdk/JDK
1.5 (latest)/label/Ubuntu/trunk/framework/cayenne-server/target/cayenne-server-3.1-SNAPSHOT-sources.jar
[INFO] 
[INFO] --- maven-install-plugin:2.3.1:install (default-install) @ cayenne-server ---
[INFO] Installing /x1/jenkins/jenkins-slave/workspace/Cayenne-trunk/cayenneTestConnection/derby/jdk/JDK
1.5 (latest)/label/Ubuntu/trunk/framework/cayenne-server/target/cayenne-server-3.1-SNAPSHOT.jar
to /home/jenkins/.m2/repository/org/apache/cayenne/cayenne-server/3.1-SNAPSHOT/cayenne-server-3.1-SNAPSHOT.jar
[INFO] Installing /x1/jenkins/jenkins-slave/workspace/Cayenne-trunk/cayenneTestConnection/derby/jdk/JDK
1.5 (latest)/label/Ubuntu/trunk/framework/cayenne-server/pom.xml to /home/jenkins/.m2/repository/org/apache/cayenne/cayenne-server/3.1-SNAPSHOT/cayenne-server-3.1-SNAPSHOT.pom
[INFO] Installing /x1/jenkins/jenkins-slave/workspace/Cayenne-trunk/cayenneTestConnection/derby/jdk/JDK
1.5 (latest)/label/Ubuntu/trunk/framework/cayenne-server/target/cayenne-server-3.1-SNAPSHOT-sources.jar
to /home/jenkins/.m2/repository/org/apache/cayenne/cayenne-server/3.1-SNAPSHOT/cayenne-server-3.1-SNAPSHOT-sources.jar
[INFO] ------------------------------------------------------------------------
[INFO] Reactor Summary:
[INFO] 
[INFO] Cayenne ........................................... SUCCESS [0.197s]
[INFO] Common Unit Test Utilities ........................ SUCCESS [1.272s]
[INFO] Cayenne Internal Build Plugin ..................... SUCCESS [0.859s]
[INFO] Cayenne Internal Documentation Build Plugin ....... SUCCESS [3.217s]
[INFO] Cayenne Build Tools Parent ........................ SUCCESS [0.018s]
[INFO] Cayenne License and Notice Bundle ................. SUCCESS [0.601s]
[INFO] Cayenne Dependency Injection Container ............ SUCCESS [1.991s]
[INFO] Cayenne Java 1.5 Unpublished ...................... SUCCESS [1:06.950s]
[INFO] Cayenne WebObjects Compatibility Library .......... SUCCESS [2.219s]
[INFO] Cayenne Aggregated Server Jar ..................... FAILURE [2.141s]
[INFO] Cayenne Aggregated Client Jar ..................... SKIPPED
[INFO] Cayenne Project ................................... SKIPPED
[INFO] Cayenne Tools ..................................... SKIPPED
[INFO] Library: cayenne-lifecycle ........................ SKIPPED
[INFO] Cayenne Maven Plugin .............................. SKIPPED
[INFO] Cayenne Framework Aggregator Project .............. SKIPPED
[INFO] Cayenne Integration Tests Parent .................. SKIPPED
[INFO] Integration Tests - Cayenne Runtime ............... SKIPPED
[INFO] Integration Tests - Cayenne Tools ................. SKIPPED
[INFO] Cayenne Modeler ................................... SKIPPED
[INFO] Cayenne Modeler Maven Plugin ...................... SKIPPED
[INFO] Cayenne Modeler Parent ............................ SKIPPED
[INFO] Cayenne Tutorial .................................. SKIPPED
[INFO] Cayenne ROP Server Tutorial ....................... SKIPPED
[INFO] Cayenne ROP Client Tutorial ....................... SKIPPED
[INFO] Cayenne Tutorials ................................. SKIPPED
[INFO] Cayenne Documentation ............................. SKIPPED
[INFO] Cayenne Documenation Parent ....................... SKIPPED
[INFO] ------------------------------------------------------------------------
[INFO] BUILD FAILURE
[INFO] ------------------------------------------------------------------------
[INFO] Total time: 1:20.342s
[INFO] Finished at: Mon Aug 01 15:20:13 GMT 2011
[INFO] Final Memory: 33M/409M
[INFO] ------------------------------------------------------------------------
[ERROR] Failed to execute goal org.apache.maven.plugins:maven-install-plugin:2.3.1:install
(default-install) on project cayenne-server: Failed to install metadata org.apache.cayenne:cayenne-server/maven-metadata.xml:
Could not read metadata /home/jenkins/.m2/repository/org/apache/cayenne/cayenne-server/maven-metadata-local.xml:
input contained no data -> [Help 1]
org.apache.maven.lifecycle.LifecycleExecutionException: Failed to execute goal org.apache.maven.plugins:maven-install-plugin:2.3.1:install
(default-install) on project cayenne-server: Failed to install metadata org.apache.cayenne:cayenne-server/maven-metadata.xml:
Could not read metadata /home/jenkins/.m2/repository/org/apache/cayenne/cayenne-server/maven-metadata-local.xml:
input contained no data
	at org.apache.maven.lifecycle.internal.MojoExecutor.execute(MojoExecutor.java:217)
	at org.apache.maven.lifecycle.internal.MojoExecutor.execute(MojoExecutor.java:153)
	at org.apache.maven.lifecycle.internal.MojoExecutor.execute(MojoExecutor.java:145)
	at org.apache.maven.lifecycle.internal.LifecycleModuleBuilder.buildProject(LifecycleModuleBuilder.java:84)
	at org.apache.maven.lifecycle.internal.LifecycleModuleBuilder.buildProject(LifecycleModuleBuilder.java:59)
	at org.apache.maven.lifecycle.internal.LifecycleStarter.singleThreadedBuild(LifecycleStarter.java:183)
	at org.apache.maven.lifecycle.internal.LifecycleStarter.execute(LifecycleStarter.java:161)
	at org.apache.maven.DefaultMaven.doExecute(DefaultMaven.java:319)
	at org.apache.maven.DefaultMaven.execute(DefaultMaven.java:156)
	at org.apache.maven.cli.MavenCli.execute(MavenCli.java:537)
	at org.apache.maven.cli.MavenCli.doMain(MavenCli.java:196)
	at org.apache.maven.cli.MavenCli.main(MavenCli.java:141)
	at sun.reflect.NativeMethodAccessorImpl.invoke0(Native Method)
	at sun.reflect.NativeMethodAccessorImpl.invoke(NativeMethodAccessorImpl.java:39)
	at sun.reflect.DelegatingMethodAccessorImpl.invoke(DelegatingMethodAccessorImpl.java:25)
	at java.lang.reflect.Method.invoke(Method.java:592)
	at org.codehaus.plexus.classworlds.launcher.Launcher.launchEnhanced(Launcher.java:290)
	at org.codehaus.plexus.classworlds.launcher.Launcher.launch(Launcher.java:230)
	at org.codehaus.plexus.classworlds.launcher.Launcher.mainWithExitCode(Launcher.java:409)
	at org.codehaus.plexus.classworlds.launcher.Launcher.main(Launcher.java:352)
Caused by: org.apache.maven.plugin.MojoExecutionException: Failed to install metadata org.apache.cayenne:cayenne-server/maven-metadata.xml:
Could not read metadata /home/jenkins/.m2/repository/org/apache/cayenne/cayenne-server/maven-metadata-local.xml:
input contained no data
	at org.apache.maven.plugin.install.InstallMojo.execute(InstallMojo.java:139)
	at org.apache.maven.plugin.DefaultBuildPluginManager.executeMojo(DefaultBuildPluginManager.java:101)
	at org.apache.maven.lifecycle.internal.MojoExecutor.execute(MojoExecutor.java:209)
	... 19 more
Caused by: org.apache.maven.artifact.installer.ArtifactInstallationException: Failed to install
metadata org.apache.cayenne:cayenne-server/maven-metadata.xml: Could not read metadata /home/jenkins/.m2/repository/org/apache/cayenne/cayenne-server/maven-metadata-local.xml:
input contained no data
	at org.apache.maven.artifact.installer.DefaultArtifactInstaller.install(DefaultArtifactInstaller.java:111)
	at org.apache.maven.plugin.install.InstallMojo.execute(InstallMojo.java:133)
	... 21 more
Caused by: org.sonatype.aether.installation.InstallationException: Failed to install metadata
org.apache.cayenne:cayenne-server/maven-metadata.xml: Could not read metadata /home/jenkins/.m2/repository/org/apache/cayenne/cayenne-server/maven-metadata-local.xml:
input contained no data
	at org.sonatype.aether.impl.internal.DefaultInstaller.install(DefaultInstaller.java:317)
	at org.sonatype.aether.impl.internal.DefaultInstaller.install(DefaultInstaller.java:215)
	at org.sonatype.aether.impl.internal.DefaultInstaller.install(DefaultInstaller.java:162)
	at org.sonatype.aether.impl.internal.DefaultRepositorySystem.install(DefaultRepositorySystem.java:473)
	at org.apache.maven.artifact.installer.DefaultArtifactInstaller.install(DefaultArtifactInstaller.java:107)
	... 22 more
Caused by: org.sonatype.aether.RepositoryException: Could not read metadata /home/jenkins/.m2/repository/org/apache/cayenne/cayenne-server/maven-metadata-local.xml:
input contained no data
	at org.apache.maven.repository.internal.MavenMetadata.read(MavenMetadata.java:101)
	at org.apache.maven.repository.internal.MavenMetadata.merge(MavenMetadata.java:69)
	at org.sonatype.aether.impl.internal.DefaultInstaller.install(DefaultInstaller.java:305)
	... 26 more
Caused by: java.io.EOFException: input contained no data
	at org.codehaus.plexus.util.xml.pull.MXParser.fillBuf(MXParser.java:3005)
	at org.codehaus.plexus.util.xml.pull.MXParser.more(MXParser.java:3048)
	at org.codehaus.plexus.util.xml.pull.MXParser.parseProlog(MXParser.java:1422)
	at org.codehaus.plexus.util.xml.pull.MXParser.nextImpl(MXParser.java:1407)
	at org.codehaus.plexus.util.xml.pull.MXParser.next(MXParser.java:1105)
	at org.apache.maven.artifact.repository.metadata.io.xpp3.MetadataXpp3Reader.read(MetadataXpp3Reader.java:1193)
	at org.apache.maven.artifact.repository.metadata.io.xpp3.MetadataXpp3Reader.read(MetadataXpp3Reader.java:1122)
	at org.apache.maven.repository.internal.MavenMetadata.read(MavenMetadata.java:97)
	... 28 more
[ERROR] 
[ERROR] Re-run Maven using the -X switch to enable full debug logging.
[ERROR] 
[ERROR] For more information about the errors and possible solutions, please read the following
articles:
[ERROR] [Help 1] http://cwiki.apache.org/confluence/display/MAVEN/MojoExecutionException
[ERROR] 
[ERROR] After correcting the problems, you can resume the build with the command
[ERROR]   mvn <goals> -rf :cayenne-server
Archiving artifacts


Mime
View raw message