cayenne-commits mailing list archives

Site index · List index
Message view « Date » · « Thread »
Top « Date » · « Thread »
From Apache Jenkins Server <hud...@hudson.apache.org>
Subject Build failed in Jenkins: Cayenne-trunk » HSQLDB,JDK 1.6 (latest),Ubuntu #473
Date Tue, 03 May 2011 10:47:30 GMT
See <https://builds.apache.org/hudson/job/Cayenne-trunk/./cayenneTestConnection=HSQLDB,jdk=JDK%201.6%20(latest),label=Ubuntu/473/>

------------------------------------------
Started by upstream project "Cayenne-trunk" build number 473
Building remotely on ubuntu2
hudson.util.IOException2: remote file operation failed: <https://builds.apache.org/hudson/job/Cayenne-trunk/./cayenneTestConnection=HSQLDB,jdk=JDK%201.6%20(latest),label=Ubuntu/ws/>
at hudson.remoting.Channel@3685b834:ubuntu2
	at hudson.FilePath.act(FilePath.java:753)
	at hudson.FilePath.act(FilePath.java:739)
	at hudson.scm.SubversionSCM.checkout(SubversionSCM.java:684)
	at hudson.scm.SubversionSCM.checkout(SubversionSCM.java:633)
	at hudson.model.AbstractProject.checkout(AbstractProject.java:1174)
	at hudson.model.AbstractBuild$AbstractRunner.checkout(AbstractBuild.java:523)
	at hudson.model.AbstractBuild$AbstractRunner.run(AbstractBuild.java:418)
	at hudson.model.Run.run(Run.java:1362)
	at hudson.matrix.MatrixRun.run(MatrixRun.java:137)
	at hudson.model.ResourceController.execute(ResourceController.java:88)
	at hudson.model.Executor.run(Executor.java:145)
Caused by: java.io.IOException: Remote call on ubuntu2 failed
	at hudson.remoting.Channel.call(Channel.java:652)
	at hudson.FilePath.act(FilePath.java:746)
	... 10 more
Caused by: java.lang.Error: Failed to deserialize the Callable object.
	at hudson.remoting.UserRequest.perform(UserRequest.java:104)
	at hudson.remoting.UserRequest.perform(UserRequest.java:48)
	at hudson.remoting.Request$2.run(Request.java:270)
	at java.util.concurrent.Executors$RunnableAdapter.call(Executors.java:471)
	at java.util.concurrent.FutureTask$Sync.innerRun(FutureTask.java:334)
	at java.util.concurrent.FutureTask.run(FutureTask.java:166)
	at java.util.concurrent.ThreadPoolExecutor.runWorker(ThreadPoolExecutor.java:1110)
	at java.util.concurrent.ThreadPoolExecutor$Worker.run(ThreadPoolExecutor.java:603)
	at java.lang.Thread.run(Thread.java:636)
Caused by: java.lang.IllegalStateException: Unable to call fetch2. Invalid object ID 1728
	at hudson.remoting.RemoteInvocationHandler$RPCRequest.perform(RemoteInvocationHandler.java:268)
	at hudson.remoting.Request$2.run(Request.java:270)
	at java.util.concurrent.Executors$RunnableAdapter.call(Executors.java:441)
	at java.util.concurrent.FutureTask$Sync.innerRun(FutureTask.java:303)
	at java.util.concurrent.FutureTask.run(FutureTask.java:138)
	at java.util.concurrent.ThreadPoolExecutor$Worker.runTask(ThreadPoolExecutor.java:886)
	at java.util.concurrent.ThreadPoolExecutor$Worker.run(ThreadPoolExecutor.java:908)
	at java.lang.Thread.run(Thread.java:662)
Archiving artifacts
ERROR: Failed to archive artifacts: trunk/framework/cayenne-client/target/cayenne-client-3.1-*.jar,trunk/framework/cayenne-server/target/cayenne-server-3.1-*.jar,trunk/framework/cayenne-lifecycle/target/cayenne-lifecycle-3.1-*.jar
hudson.util.IOException2: Failed to extract <https://builds.apache.org/hudson/job/Cayenne-trunk/./cayenneTestConnection=HSQLDB,jdk=JDK%201.6%20(latest),label=Ubuntu/ws/trunk/framework/cayenne-client/target/cayenne-client-3.1-*.jar,trunk/framework/cayenne-server/target/cayenne-server-3.1-*.jar,trunk/framework/cayenne-lifecycle/target/cayenne-lifecycle-3.1-*.jar>
	at hudson.FilePath.readFromTar(FilePath.java:1625)
	at hudson.FilePath.copyRecursiveTo(FilePath.java:1543)
	at hudson.tasks.ArtifactArchiver.perform(ArtifactArchiver.java:117)
	at hudson.tasks.BuildStepMonitor$1.perform(BuildStepMonitor.java:19)
	at hudson.model.AbstractBuild$AbstractRunner.perform(AbstractBuild.java:649)
	at hudson.model.AbstractBuild$AbstractRunner.performAllBuildSteps(AbstractBuild.java:625)
	at hudson.model.AbstractBuild$AbstractRunner.performAllBuildSteps(AbstractBuild.java:603)
	at hudson.model.Build$RunnerImpl.post2(Build.java:161)
	at hudson.model.AbstractBuild$AbstractRunner.post(AbstractBuild.java:572)
	at hudson.model.Run.run(Run.java:1386)
	at hudson.matrix.MatrixRun.run(MatrixRun.java:137)
	at hudson.model.ResourceController.execute(ResourceController.java:88)
	at hudson.model.Executor.run(Executor.java:145)
Caused by: java.util.zip.ZipException: invalid stored block lengths
	at java.util.zip.InflaterInputStream.read(InflaterInputStream.java:147)
	at java.util.zip.GZIPInputStream.read(GZIPInputStream.java:92)
	at org.apache.tools.tar.TarBuffer.readBlock(TarBuffer.java:257)
	at org.apache.tools.tar.TarBuffer.readRecord(TarBuffer.java:223)
	at hudson.org.apache.tools.tar.TarInputStream.read(TarInputStream.java:345)
	at java.io.FilterInputStream.read(FilterInputStream.java:90)
	at org.apache.commons.io.IOUtils.copyLarge(IOUtils.java:1025)
	at org.apache.commons.io.IOUtils.copy(IOUtils.java:999)
	at hudson.util.IOUtils.copy(IOUtils.java:33)
	at hudson.FilePath.readFromTar(FilePath.java:1617)
	... 12 more


Mime
View raw message