cayenne-commits mailing list archives

Site index · List index
Message view « Date » · « Thread »
Top « Date » · « Thread »
From Apache Jenkins Server <hud...@hudson.apache.org>
Subject Build failed in Jenkins: Cayenne-trunk » derby,JDK 1.6 (latest),Ubuntu #472
Date Mon, 02 May 2011 21:28:40 GMT
See <https://builds.apache.org/hudson/job/Cayenne-trunk/./cayenneTestConnection=derby,jdk=JDK%201.6%20(latest),label=Ubuntu/472/changes>

Changes:

[aadamchik] CAY-1562 CayenneCase unit tests conversion

patches by Dzmitry Kazimirchyk:
DataContextCharPKTest

[aadamchik] CAY-1562 CayenneCase unit tests conversion

patches by Dzmitry Kazimirchyk:
DateTimeTypesTest

[aadamchik] CAY-1562 CayenneCase unit tests conversion

patches by Dzmitry Kazimirchyk:
DataContextCallbacksTest

[aadamchik] CAY-1562 CayenneCase unit tests conversion

patches by Dzmitry Kazimirchyk:
DataContextBinaryPKTest + refactoring

[aadamchik] CAY-1562 CayenneCase unit tests conversion

patches by Dzmitry Kazimirchyk:
CompoundPkChangeTest

[aadamchik] CAY-1562 CayenneCase unit tests conversion

patches by Dzmitry Kazimirchyk:
CDOQualifiedEntitiesTest + refactoring

------------------------------------------
[...truncated 59533 lines...]
INFO: added runtime complimentary ObjRelationship from Artist to CompoundPaintingLongNames
May 2, 2011 9:28:37 PM org.apache.cayenne.map.EntityResolver applyObjectLayerDefaults
INFO: added runtime complimentary ObjRelationship from ROArtist to CompoundPaintingLongNames
May 2, 2011 9:28:37 PM org.apache.cayenne.map.EntityResolver applyObjectLayerDefaults
INFO: added runtime complimentary ObjRelationship from Gallery to CompoundPaintingLongNames
May 2, 2011 9:28:37 PM org.apache.cayenne.map.EntityResolver applyObjectLayerDefaults
INFO: added runtime complimentary ObjRelationship from PaintingInfo to CompoundPaintingLongNames
May 2, 2011 9:28:37 PM org.apache.cayenne.map.EntityResolver applyObjectLayerDefaults
INFO: added runtime complimentary ObjRelationship from Artist to Painting1
May 2, 2011 9:28:37 PM org.apache.cayenne.map.EntityResolver applyObjectLayerDefaults
INFO: added runtime complimentary ObjRelationship from Painting to ROArtist
May 2, 2011 9:28:37 PM org.apache.cayenne.map.EntityResolver applyObjectLayerDefaults
INFO: added runtime complimentary ObjRelationship from Artist to ROPainting
May 2, 2011 9:28:37 PM org.apache.cayenne.test.jdbc.UtilityLogger log
INFO: delete from ARTIST
May 2, 2011 9:28:37 PM org.apache.cayenne.test.jdbc.UtilityLogger log
INFO: delete from PAINTING
May 2, 2011 9:28:37 PM org.apache.cayenne.configuration.XMLDataChannelDescriptorLoader load
INFO: Loading XML configuration resource from <https://builds.apache.org/hudson/job/Cayenne-trunk/./cayenneTestConnection=derby,jdk=JDK%201.6%20(latest),label=Ubuntu/ws/trunk/framework/cayenne-jdk1.5-unpublished/target/test-classes/cayenne-testmap.xml>
May 2, 2011 9:28:37 PM org.apache.cayenne.map.EntityResolver applyDBLayerDefaults
INFO: added runtime complimentary DbRelationship from ARTIST to PAINTING1
May 2, 2011 9:28:37 PM org.apache.cayenne.map.EntityResolver applyObjectLayerDefaults
INFO: added runtime complimentary ObjRelationship from Artist to CompoundPainting
May 2, 2011 9:28:37 PM org.apache.cayenne.map.EntityResolver applyObjectLayerDefaults
INFO: added runtime complimentary ObjRelationship from Gallery to CompoundPainting
May 2, 2011 9:28:37 PM org.apache.cayenne.map.EntityResolver applyObjectLayerDefaults
INFO: added runtime complimentary ObjRelationship from PaintingInfo to CompoundPainting
May 2, 2011 9:28:37 PM org.apache.cayenne.map.EntityResolver applyObjectLayerDefaults
INFO: added runtime complimentary ObjRelationship from Artist to CompoundPaintingLongNames
May 2, 2011 9:28:37 PM org.apache.cayenne.map.EntityResolver applyObjectLayerDefaults
INFO: added runtime complimentary ObjRelationship from ROArtist to CompoundPaintingLongNames
May 2, 2011 9:28:37 PM org.apache.cayenne.map.EntityResolver applyObjectLayerDefaults
INFO: added runtime complimentary ObjRelationship from Gallery to CompoundPaintingLongNames
May 2, 2011 9:28:37 PM org.apache.cayenne.map.EntityResolver applyObjectLayerDefaults
INFO: added runtime complimentary ObjRelationship from PaintingInfo to CompoundPaintingLongNames
May 2, 2011 9:28:37 PM org.apache.cayenne.map.EntityResolver applyObjectLayerDefaults
INFO: added runtime complimentary ObjRelationship from Artist to Painting1
May 2, 2011 9:28:37 PM org.apache.cayenne.map.EntityResolver applyObjectLayerDefaults
INFO: added runtime complimentary ObjRelationship from Painting to ROArtist
May 2, 2011 9:28:37 PM org.apache.cayenne.map.EntityResolver applyObjectLayerDefaults
INFO: added runtime complimentary ObjRelationship from Artist to ROPainting
May 2, 2011 9:28:37 PM org.apache.cayenne.test.jdbc.UtilityLogger log
INFO: delete from ARTIST
May 2, 2011 9:28:37 PM org.apache.cayenne.test.jdbc.UtilityLogger log
INFO: delete from PAINTING
May 2, 2011 9:28:37 PM org.apache.cayenne.test.jdbc.UtilityLogger log
INFO: INSERT INTO ARTIST (ARTIST_ID, ARTIST_NAME) VALUES (?, ?)
May 2, 2011 9:28:37 PM org.apache.cayenne.test.jdbc.UtilityLogger log
INFO: INSERT INTO PAINTING (PAINTING_ID, PAINTING_TITLE, ARTIST_ID, ESTIMATED_PRICE) VALUES
(?, ?, ?, ?)
May 2, 2011 9:28:37 PM org.apache.cayenne.log.CommonsJdbcEventLogger logBeginTransaction
INFO: --- transaction started.
May 2, 2011 9:28:37 PM org.apache.cayenne.log.CommonsJdbcEventLogger logQuery
INFO: SELECT t0.DATE_OF_BIRTH, t0.ARTIST_ID, t0.ARTIST_NAME FROM ARTIST t0
May 2, 2011 9:28:37 PM org.apache.cayenne.log.CommonsJdbcEventLogger logSelectCount
INFO: === returned 1 row. - took 2 ms.
May 2, 2011 9:28:37 PM org.apache.cayenne.log.CommonsJdbcEventLogger logCommitTransaction
INFO: +++ transaction committed.
May 2, 2011 9:28:37 PM org.apache.cayenne.test.jdbc.UtilityLogger log
INFO: update ARTIST set ARTIST_NAME = ? where ARTIST_ID = ?
May 2, 2011 9:28:37 PM org.apache.cayenne.log.CommonsJdbcEventLogger logBeginTransaction
INFO: --- transaction started.
May 2, 2011 9:28:37 PM org.apache.cayenne.log.CommonsJdbcEventLogger logQuery
INFO: SELECT t0.DATE_OF_BIRTH, t0.ARTIST_ID, t0.ARTIST_NAME FROM ARTIST t0
May 2, 2011 9:28:37 PM org.apache.cayenne.log.CommonsJdbcEventLogger logSelectCount
INFO: === returned 1 row. - took 0 ms.
May 2, 2011 9:28:37 PM org.apache.cayenne.log.CommonsJdbcEventLogger logCommitTransaction
INFO: +++ transaction committed.
Tests run: 4, Failures: 0, Errors: 0, Skipped: 0, Time elapsed: 0.107 sec
Running org.apache.cayenne.access.NestedDataContextParentPeerEventsTest
May 2, 2011 9:28:37 PM org.apache.cayenne.log.CommonsJdbcEventLogger logBeginTransaction
INFO: --- transaction started.
May 2, 2011 9:28:37 PM org.apache.cayenne.log.CommonsJdbcEventLogger logQuery
INFO: INSERT INTO ARTIST (ARTIST_ID, ARTIST_NAME, DATE_OF_BIRTH) VALUES (?, ?, ?)
May 2, 2011 9:28:37 PM org.apache.cayenne.log.CommonsJdbcEventLogger logQueryParameters
INFO: [batch bind: 1->ARTIST_ID:352, 2->ARTIST_NAME:'X', 3->DATE_OF_BIRTH:NULL]
May 2, 2011 9:28:37 PM org.apache.cayenne.log.CommonsJdbcEventLogger logUpdateCount
INFO: === updated 1 row.
May 2, 2011 9:28:37 PM org.apache.cayenne.log.CommonsJdbcEventLogger logCommitTransaction
INFO: +++ transaction committed.
May 2, 2011 9:28:37 PM org.apache.cayenne.log.CommonsJdbcEventLogger logBeginTransaction
INFO: --- transaction started.
May 2, 2011 9:28:37 PM org.apache.cayenne.log.CommonsJdbcEventLogger logQuery
INFO: UPDATE ARTIST SET ARTIST_NAME = ? WHERE ARTIST_ID = ?
May 2, 2011 9:28:37 PM org.apache.cayenne.log.CommonsJdbcEventLogger logQueryParameters
INFO: [batch bind: 1->ARTIST_NAME:'Y', 2->ARTIST_ID:352]
May 2, 2011 9:28:37 PM org.apache.cayenne.log.CommonsJdbcEventLogger logUpdateCount
INFO: === updated 1 row.
May 2, 2011 9:28:37 PM org.apache.cayenne.log.CommonsJdbcEventLogger logCommitTransaction
INFO: +++ transaction committed.
May 2, 2011 9:28:38 PM org.apache.cayenne.log.CommonsJdbcEventLogger logBeginTransaction
INFO: --- transaction started.
May 2, 2011 9:28:38 PM org.apache.cayenne.log.CommonsJdbcEventLogger logQuery
INFO: INSERT INTO ARTIST (ARTIST_ID, ARTIST_NAME, DATE_OF_BIRTH) VALUES (?, ?, ?)
May 2, 2011 9:28:38 PM org.apache.cayenne.log.CommonsJdbcEventLogger logQueryParameters
INFO: [batch bind: 1->ARTIST_ID:353, 2->ARTIST_NAME:'X', 3->DATE_OF_BIRTH:NULL]
May 2, 2011 9:28:38 PM org.apache.cayenne.log.CommonsJdbcEventLogger logQueryParameters
INFO: [batch bind: 1->ARTIST_ID:354, 2->ARTIST_NAME:'Y', 3->DATE_OF_BIRTH:NULL]
May 2, 2011 9:28:38 PM org.apache.cayenne.log.CommonsJdbcEventLogger logUpdateCount
INFO: === updated 2 rows.
May 2, 2011 9:28:38 PM org.apache.cayenne.log.CommonsJdbcEventLogger logQuery
INFO: INSERT INTO PAINTING (ARTIST_ID, ESTIMATED_PRICE, GALLERY_ID, PAINTING_DESCRIPTION,
PAINTING_ID, PAINTING_TITLE) VALUES (?, ?, ?, ?, ?, ?)
May 2, 2011 9:28:38 PM org.apache.cayenne.log.CommonsJdbcEventLogger logQueryParameters
INFO: [batch bind: 1->ARTIST_ID:353, 2->ESTIMATED_PRICE:NULL, 3->GALLERY_ID:NULL,
4->PAINTING_DESCRIPTION:NULL, 5->PAINTING_ID:243, 6->PAINTING_TITLE:'PPP']
May 2, 2011 9:28:38 PM org.apache.cayenne.log.CommonsJdbcEventLogger logUpdateCount
INFO: === updated 1 row.
May 2, 2011 9:28:38 PM org.apache.cayenne.log.CommonsJdbcEventLogger logCommitTransaction
INFO: +++ transaction committed.
May 2, 2011 9:28:38 PM org.apache.cayenne.log.CommonsJdbcEventLogger logBeginTransaction
INFO: --- transaction started.
May 2, 2011 9:28:38 PM org.apache.cayenne.log.CommonsJdbcEventLogger logQuery
INFO: UPDATE PAINTING SET ARTIST_ID = ? WHERE PAINTING_ID = ?
May 2, 2011 9:28:38 PM org.apache.cayenne.log.CommonsJdbcEventLogger logQueryParameters
INFO: [batch bind: 1->ARTIST_ID:354, 2->PAINTING_ID:243]
May 2, 2011 9:28:38 PM org.apache.cayenne.log.CommonsJdbcEventLogger logUpdateCount
INFO: === updated 1 row.
May 2, 2011 9:28:38 PM org.apache.cayenne.log.CommonsJdbcEventLogger logCommitTransaction
INFO: +++ transaction committed.
May 2, 2011 9:28:38 PM org.apache.cayenne.log.CommonsJdbcEventLogger logBeginTransaction
INFO: --- transaction started.
May 2, 2011 9:28:38 PM org.apache.cayenne.log.CommonsJdbcEventLogger logQuery
INFO: INSERT INTO ARTIST (ARTIST_ID, ARTIST_NAME, DATE_OF_BIRTH) VALUES (?, ?, ?)
May 2, 2011 9:28:38 PM org.apache.cayenne.log.CommonsJdbcEventLogger logQueryParameters
INFO: [batch bind: 1->ARTIST_ID:355, 2->ARTIST_NAME:'X', 3->DATE_OF_BIRTH:NULL]
May 2, 2011 9:28:38 PM org.apache.cayenne.log.CommonsJdbcEventLogger logUpdateCount
INFO: === updated 1 row.
May 2, 2011 9:28:38 PM org.apache.cayenne.log.CommonsJdbcEventLogger logQuery
INFO: INSERT INTO PAINTING (ARTIST_ID, ESTIMATED_PRICE, GALLERY_ID, PAINTING_DESCRIPTION,
PAINTING_ID, PAINTING_TITLE) VALUES (?, ?, ?, ?, ?, ?)
May 2, 2011 9:28:38 PM org.apache.cayenne.log.CommonsJdbcEventLogger logQueryParameters
INFO: [batch bind: 1->ARTIST_ID:355, 2->ESTIMATED_PRICE:NULL, 3->GALLERY_ID:NULL,
4->PAINTING_DESCRIPTION:NULL, 5->PAINTING_ID:244, 6->PAINTING_TITLE:'PX']
May 2, 2011 9:28:38 PM org.apache.cayenne.log.CommonsJdbcEventLogger logQueryParameters
INFO: [batch bind: 1->ARTIST_ID:NULL, 2->ESTIMATED_PRICE:NULL, 3->GALLERY_ID:NULL,
4->PAINTING_DESCRIPTION:NULL, 5->PAINTING_ID:245, 6->PAINTING_TITLE:'PY']
May 2, 2011 9:28:38 PM org.apache.cayenne.log.CommonsJdbcEventLogger logUpdateCount
INFO: === updated 2 rows.
May 2, 2011 9:28:38 PM org.apache.cayenne.log.CommonsJdbcEventLogger logCommitTransaction
INFO: +++ transaction committed.
May 2, 2011 9:28:38 PM org.apache.cayenne.log.CommonsJdbcEventLogger logBeginTransaction
INFO: --- transaction started.
May 2, 2011 9:28:38 PM org.apache.cayenne.log.CommonsJdbcEventLogger logQuery
INFO: UPDATE PAINTING SET ARTIST_ID = ? WHERE PAINTING_ID = ?
May 2, 2011 9:28:38 PM org.apache.cayenne.log.CommonsJdbcEventLogger logQueryParameters
INFO: [batch bind: 1->ARTIST_ID:355, 2->PAINTING_ID:245]
May 2, 2011 9:28:38 PM org.apache.cayenne.log.CommonsJdbcEventLogger logUpdateCount
INFO: === updated 1 row.
May 2, 2011 9:28:38 PM org.apache.cayenne.log.CommonsJdbcEventLogger logCommitTransaction
INFO: +++ transaction committed.
May 2, 2011 9:28:38 PM org.apache.cayenne.log.CommonsJdbcEventLogger logBeginTransaction
INFO: --- transaction started.
May 2, 2011 9:28:38 PM org.apache.cayenne.log.CommonsJdbcEventLogger logQuery
INFO: SELECT t0.ARTIST_ID, t0.PAINTING_ID, t0.GALLERY_ID, t0.PAINTING_DESCRIPTION, t0.ESTIMATED_PRICE,
t0.PAINTING_TITLE FROM PAINTING t0 WHERE t0.ARTIST_ID = ? [bind: 1->ARTIST_ID:355]
May 2, 2011 9:28:38 PM org.apache.cayenne.log.CommonsJdbcEventLogger logSelectCount
INFO: === returned 2 rows. - took 1 ms.
May 2, 2011 9:28:38 PM org.apache.cayenne.log.CommonsJdbcEventLogger logCommitTransaction
INFO: +++ transaction committed.
Tests run: 3, Failures: 0, Errors: 0, Skipped: 0, Time elapsed: 1.003 sec
Running org.apache.cayenne.DataRowTest
Tests run: 2, Failures: 0, Errors: 0, Skipped: 0, Time elapsed: 0.002 sec
Running org.apache.cayenne.access.types.EnumTypeTest
Tests run: 7, Failures: 0, Errors: 0, Skipped: 0, Time elapsed: 0.002 sec

Results :

Tests in error: 
  testInsertBinaryPK(org.apache.cayenne.access.DataContextBinaryPKTest)
  testFetchRelationshipBinaryPK(org.apache.cayenne.access.DataContextBinaryPKTest)
  testDecimalPK1(org.apache.cayenne.access.NumericTypesTest)

Tests run: 2082, Failures: 0, Errors: 3, Skipped: 0

[INFO] ------------------------------------------------------------------------
[INFO] Reactor Summary:
[INFO] 
[INFO] Cayenne ........................................... SUCCESS [0.468s]
[INFO] Common Unit Test Utilities ........................ SUCCESS [2.297s]
[INFO] Cayenne Internal Build Plugin ..................... SUCCESS [2.126s]
[INFO] Cayenne Internal Documentation Build Plugin ....... SUCCESS [1.868s]
[INFO] Cayenne Build Tools Parent ........................ SUCCESS [0.037s]
[INFO] Cayenne License and Notice Bundle ................. SUCCESS [0.885s]
[INFO] Cayenne Dependency Injection Container ............ SUCCESS [2.709s]
[INFO] Cayenne Java 1.5 Unpublished ...................... FAILURE [3:13.165s]
[INFO] Cayenne WebObjects Compatibility Library .......... SKIPPED
[INFO] Cayenne Aggregated Server Jar ..................... SKIPPED
[INFO] Cayenne Aggregated Client Jar ..................... SKIPPED
[INFO] Cayenne Project ................................... SKIPPED
[INFO] Cayenne Tools ..................................... SKIPPED
[INFO] Library: cayenne-lifecycle ........................ SKIPPED
[INFO] Cayenne Maven Plugin .............................. SKIPPED
[INFO] Cayenne Framework Aggregator Project .............. SKIPPED
[INFO] Cayenne Integration Tests Parent .................. SKIPPED
[INFO] Integration Tests - Cayenne Runtime ............... SKIPPED
[INFO] Integration Tests - Cayenne Tools ................. SKIPPED
[INFO] Cayenne Modeler ................................... SKIPPED
[INFO] Cayenne Modeler Maven Plugin ...................... SKIPPED
[INFO] Cayenne Modeler Parent ............................ SKIPPED
[INFO] Cayenne Tutorial .................................. SKIPPED
[INFO] Cayenne ROP Server Tutorial ....................... SKIPPED
[INFO] Cayenne ROP Client Tutorial ....................... SKIPPED
[INFO] Cayenne Tutorials ................................. SKIPPED
[INFO] Cayenne Documentation ............................. SKIPPED
[INFO] Cayenne Documenation Parent ....................... SKIPPED
[INFO] ------------------------------------------------------------------------
[INFO] BUILD FAILURE
[INFO] ------------------------------------------------------------------------
[INFO] Total time: 3:24.226s
[INFO] Finished at: Mon May 02 21:28:39 UTC 2011
[INFO] Final Memory: 45M/381M
[INFO] ------------------------------------------------------------------------
[ERROR] Failed to execute goal org.apache.maven.plugins:maven-surefire-plugin:2.5:test (default-test)
on project cayenne-jdk1.5-unpublished: There are test failures.
[ERROR] 
[ERROR] Please refer to <https://builds.apache.org/hudson/job/Cayenne-trunk/./cayenneTestConnection=derby,jdk=JDK%201.6%20(latest),label=Ubuntu/ws/trunk/framework/cayenne-jdk1.5-unpublished/target/surefire-reports>
for the individual test results.
[ERROR] -> [Help 1]
org.apache.maven.lifecycle.LifecycleExecutionException: Failed to execute goal org.apache.maven.plugins:maven-surefire-plugin:2.5:test
(default-test) on project cayenne-jdk1.5-unpublished: There are test failures.

Please refer to <https://builds.apache.org/hudson/job/Cayenne-trunk/./cayenneTestConnection=derby,jdk=JDK%201.6%20(latest),label=Ubuntu/ws/trunk/framework/cayenne-jdk1.5-unpublished/target/surefire-reports>
for the individual test results.
	at org.apache.maven.lifecycle.internal.MojoExecutor.execute(MojoExecutor.java:213)
	at org.apache.maven.lifecycle.internal.MojoExecutor.execute(MojoExecutor.java:153)
	at org.apache.maven.lifecycle.internal.MojoExecutor.execute(MojoExecutor.java:145)
	at org.apache.maven.lifecycle.internal.LifecycleModuleBuilder.buildProject(LifecycleModuleBuilder.java:84)
	at org.apache.maven.lifecycle.internal.LifecycleModuleBuilder.buildProject(LifecycleModuleBuilder.java:59)
	at org.apache.maven.lifecycle.internal.LifecycleStarter.singleThreadedBuild(LifecycleStarter.java:183)
	at org.apache.maven.lifecycle.internal.LifecycleStarter.execute(LifecycleStarter.java:161)
	at org.apache.maven.DefaultMaven.doExecute(DefaultMaven.java:319)
	at org.apache.maven.DefaultMaven.execute(DefaultMaven.java:156)
	at org.apache.maven.cli.MavenCli.execute(MavenCli.java:537)
	at org.apache.maven.cli.MavenCli.doMain(MavenCli.java:196)
	at org.apache.maven.cli.MavenCli.main(MavenCli.java:141)
	at sun.reflect.NativeMethodAccessorImpl.invoke0(Native Method)
	at sun.reflect.NativeMethodAccessorImpl.invoke(NativeMethodAccessorImpl.java:39)
	at sun.reflect.DelegatingMethodAccessorImpl.invoke(DelegatingMethodAccessorImpl.java:25)
	at java.lang.reflect.Method.invoke(Method.java:597)
	at org.codehaus.plexus.classworlds.launcher.Launcher.launchEnhanced(Launcher.java:290)
	at org.codehaus.plexus.classworlds.launcher.Launcher.launch(Launcher.java:230)
	at org.codehaus.plexus.classworlds.launcher.Launcher.mainWithExitCode(Launcher.java:409)
	at org.codehaus.plexus.classworlds.launcher.Launcher.main(Launcher.java:352)
Caused by: org.apache.maven.plugin.MojoFailureException: There are test failures.

Please refer to <https://builds.apache.org/hudson/job/Cayenne-trunk/./cayenneTestConnection=derby,jdk=JDK%201.6%20(latest),label=Ubuntu/ws/trunk/framework/cayenne-jdk1.5-unpublished/target/surefire-reports>
for the individual test results.
	at org.apache.maven.plugin.surefire.SurefirePlugin.execute(SurefirePlugin.java:629)
	at org.apache.maven.plugin.DefaultBuildPluginManager.executeMojo(DefaultBuildPluginManager.java:101)
	at org.apache.maven.lifecycle.internal.MojoExecutor.execute(MojoExecutor.java:209)
	... 19 more
[ERROR] 
[ERROR] Re-run Maven using the -X switch to enable full debug logging.
[ERROR] 
[ERROR] For more information about the errors and possible solutions, please read the following
articles:
[ERROR] [Help 1] http://cwiki.apache.org/confluence/display/MAVEN/MojoFailureException
[ERROR] 
[ERROR] After correcting the problems, you can resume the build with the command
[ERROR]   mvn <goals> -rf :cayenne-jdk1.5-unpublished
Archiving artifacts


Mime
View raw message