cayenne-commits mailing list archives

Site index · List index
Message view « Date » · « Thread »
Top « Date » · « Thread »
From Apache Hudson Server <hud...@hudson.apache.org>
Subject Build failed in Jenkins: Cayenne-trunk » derby,JDK 1.6 (latest),Ubuntu #457
Date Tue, 12 Apr 2011 12:32:52 GMT
See <https://hudson.apache.org/hudson/job/Cayenne-trunk/./cayenneTestConnection=derby,jdk=JDK%201.6%20(latest),label=Ubuntu/457/changes>

Changes:

[amaniatis] We only need to define plugin settings once in the parent pom and not in every
pom.

[amaniatis] Remove uneeded profile and push repository definition into the master pom.

------------------------------------------
[...truncated 58064 lines...]
INFO: [batch bind: 1->ID:1790, 2->ID_CLOB:229, 3->VALUE:100]
Apr 12, 2011 12:32:48 PM org.apache.cayenne.log.CommonsJdbcEventLogger logQueryParameters
INFO: [batch bind: 1->ID:1791, 2->ID_CLOB:280, 3->VALUE:100]
Apr 12, 2011 12:32:48 PM org.apache.cayenne.log.CommonsJdbcEventLogger logQueryParameters
INFO: [batch bind: 1->ID:1792, 2->ID_CLOB:248, 3->VALUE:100]
Apr 12, 2011 12:32:48 PM org.apache.cayenne.log.CommonsJdbcEventLogger logQueryParameters
INFO: [batch bind: 1->ID:1793, 2->ID_CLOB:250, 3->VALUE:100]
Apr 12, 2011 12:32:48 PM org.apache.cayenne.log.CommonsJdbcEventLogger logQueryParameters
INFO: [batch bind: 1->ID:1794, 2->ID_CLOB:294, 3->VALUE:100]
Apr 12, 2011 12:32:48 PM org.apache.cayenne.log.CommonsJdbcEventLogger logQueryParameters
INFO: [batch bind: 1->ID:1795, 2->ID_CLOB:274, 3->VALUE:100]
Apr 12, 2011 12:32:48 PM org.apache.cayenne.log.CommonsJdbcEventLogger logQueryParameters
INFO: [batch bind: 1->ID:1796, 2->ID_CLOB:283, 3->VALUE:100]
Apr 12, 2011 12:32:48 PM org.apache.cayenne.log.CommonsJdbcEventLogger logQueryParameters
INFO: [batch bind: 1->ID:1797, 2->ID_CLOB:275, 3->VALUE:100]
Apr 12, 2011 12:32:48 PM org.apache.cayenne.log.CommonsJdbcEventLogger logQueryParameters
INFO: [batch bind: 1->ID:1798, 2->ID_CLOB:262, 3->VALUE:100]
Apr 12, 2011 12:32:48 PM org.apache.cayenne.log.CommonsJdbcEventLogger logQueryParameters
INFO: [batch bind: 1->ID:1799, 2->ID_CLOB:265, 3->VALUE:100]
Apr 12, 2011 12:32:49 PM org.apache.cayenne.log.CommonsJdbcEventLogger logUpdateCount
INFO: === updated 1600 rows.
Apr 12, 2011 12:32:49 PM org.apache.cayenne.log.CommonsJdbcEventLogger logCommitTransaction
INFO: +++ transaction committed.
Apr 12, 2011 12:32:49 PM org.apache.cayenne.log.CommonsJdbcEventLogger logBeginTransaction
INFO: --- transaction started.
Apr 12, 2011 12:32:49 PM org.apache.cayenne.log.CommonsJdbcEventLogger logQuery
INFO: SELECT t0.CLOB_TEST_ID, t0.CLOB_COL FROM CLOB_TEST t0 JOIN CLOB_TEST_RELATION t1 ON
(t0.CLOB_TEST_ID = t1.ID_CLOB) WHERE t1.VALUE = ? [bind: 1->VALUE:100]
Apr 12, 2011 12:32:49 PM org.apache.cayenne.log.CommonsJdbcEventLogger logSelectCount
INFO: === returned 25 rows. - took 6 ms.
Apr 12, 2011 12:32:49 PM org.apache.cayenne.log.CommonsJdbcEventLogger logCommitTransaction
INFO: +++ transaction committed.
Tests run: 1, Failures: 0, Errors: 0, Skipped: 0, Time elapsed: 2.198 sec
Running org.apache.cayenne.access.DataContextQueryCachingTest
Apr 12, 2011 12:32:49 PM org.apache.cayenne.log.CommonsJdbcEventLogger logBeginTransaction
INFO: --- transaction started.
Apr 12, 2011 12:32:49 PM org.apache.cayenne.log.CommonsJdbcEventLogger logQuery
INFO: insert into ARTIST (ARTIST_ID, ARTIST_NAME) values (33001, 'aaa')
Apr 12, 2011 12:32:49 PM org.apache.cayenne.log.CommonsJdbcEventLogger logUpdateCount
INFO: === updated 1 row.
Apr 12, 2011 12:32:49 PM org.apache.cayenne.log.CommonsJdbcEventLogger logQuery
INFO: INSERT INTO PAINTING (PAINTING_ID, PAINTING_TITLE, ARTIST_ID, ESTIMATED_PRICE) VALUES
(33001, 'P', 33001, 4000)
Apr 12, 2011 12:32:49 PM org.apache.cayenne.log.CommonsJdbcEventLogger logUpdateCount
INFO: === updated 1 row.
Apr 12, 2011 12:32:49 PM org.apache.cayenne.log.CommonsJdbcEventLogger logCommitTransaction
INFO: +++ transaction committed.
Apr 12, 2011 12:32:49 PM org.apache.cayenne.log.CommonsJdbcEventLogger logBeginTransaction
INFO: --- transaction started.
Apr 12, 2011 12:32:49 PM org.apache.cayenne.log.CommonsJdbcEventLogger logQuery
INFO: SELECT t0.DATE_OF_BIRTH, t0.ARTIST_ID, t0.ARTIST_NAME FROM ARTIST t0
Apr 12, 2011 12:32:49 PM org.apache.cayenne.log.CommonsJdbcEventLogger logSelectCount
INFO: === returned 1 row. - took 27 ms.
Apr 12, 2011 12:32:49 PM org.apache.cayenne.log.CommonsJdbcEventLogger logCommitTransaction
INFO: +++ transaction committed.
Apr 12, 2011 12:32:49 PM org.apache.cayenne.log.CommonsJdbcEventLogger logBeginTransaction
INFO: --- transaction started.
Apr 12, 2011 12:32:49 PM org.apache.cayenne.log.CommonsJdbcEventLogger logQuery
INFO: update ARTIST set ARTIST_NAME = 'bbb' where ARTIST_ID = 33001
Apr 12, 2011 12:32:49 PM org.apache.cayenne.log.CommonsJdbcEventLogger logUpdateCount
INFO: === updated 1 row.
Apr 12, 2011 12:32:49 PM org.apache.cayenne.log.CommonsJdbcEventLogger logCommitTransaction
INFO: +++ transaction committed.
Apr 12, 2011 12:32:49 PM org.apache.cayenne.log.CommonsJdbcEventLogger logBeginTransaction
INFO: --- transaction started.
Apr 12, 2011 12:32:49 PM org.apache.cayenne.log.CommonsJdbcEventLogger logQuery
INFO: SELECT t0.DATE_OF_BIRTH, t0.ARTIST_ID, t0.ARTIST_NAME FROM ARTIST t0
Apr 12, 2011 12:32:49 PM org.apache.cayenne.log.CommonsJdbcEventLogger logSelectCount
INFO: === returned 1 row. - took 0 ms.
Apr 12, 2011 12:32:49 PM org.apache.cayenne.log.CommonsJdbcEventLogger logCommitTransaction
INFO: +++ transaction committed.
Tests run: 4, Failures: 0, Errors: 0, Skipped: 0, Time elapsed: 0.484 sec
Running org.apache.cayenne.access.NestedDataContextParentPeerEventsTest
Apr 12, 2011 12:32:49 PM org.apache.cayenne.log.CommonsJdbcEventLogger logBeginTransaction
INFO: --- transaction started.
Apr 12, 2011 12:32:49 PM org.apache.cayenne.log.CommonsJdbcEventLogger logQuery
INFO: INSERT INTO ARTIST (ARTIST_ID, ARTIST_NAME, DATE_OF_BIRTH) VALUES (?, ?, ?)
Apr 12, 2011 12:32:49 PM org.apache.cayenne.log.CommonsJdbcEventLogger logQueryParameters
INFO: [batch bind: 1->ARTIST_ID:352, 2->ARTIST_NAME:'X', 3->DATE_OF_BIRTH:NULL]
Apr 12, 2011 12:32:49 PM org.apache.cayenne.log.CommonsJdbcEventLogger logUpdateCount
INFO: === updated 1 row.
Apr 12, 2011 12:32:49 PM org.apache.cayenne.log.CommonsJdbcEventLogger logCommitTransaction
INFO: +++ transaction committed.
Apr 12, 2011 12:32:49 PM org.apache.cayenne.log.CommonsJdbcEventLogger logBeginTransaction
INFO: --- transaction started.
Apr 12, 2011 12:32:49 PM org.apache.cayenne.log.CommonsJdbcEventLogger logQuery
INFO: UPDATE ARTIST SET ARTIST_NAME = ? WHERE ARTIST_ID = ?
Apr 12, 2011 12:32:49 PM org.apache.cayenne.log.CommonsJdbcEventLogger logQueryParameters
INFO: [batch bind: 1->ARTIST_NAME:'Y', 2->ARTIST_ID:352]
Apr 12, 2011 12:32:49 PM org.apache.cayenne.log.CommonsJdbcEventLogger logUpdateCount
INFO: === updated 1 row.
Apr 12, 2011 12:32:49 PM org.apache.cayenne.log.CommonsJdbcEventLogger logCommitTransaction
INFO: +++ transaction committed.
Apr 12, 2011 12:32:50 PM org.apache.cayenne.log.CommonsJdbcEventLogger logBeginTransaction
INFO: --- transaction started.
Apr 12, 2011 12:32:50 PM org.apache.cayenne.log.CommonsJdbcEventLogger logQuery
INFO: INSERT INTO ARTIST (ARTIST_ID, ARTIST_NAME, DATE_OF_BIRTH) VALUES (?, ?, ?)
Apr 12, 2011 12:32:50 PM org.apache.cayenne.log.CommonsJdbcEventLogger logQueryParameters
INFO: [batch bind: 1->ARTIST_ID:353, 2->ARTIST_NAME:'X', 3->DATE_OF_BIRTH:NULL]
Apr 12, 2011 12:32:50 PM org.apache.cayenne.log.CommonsJdbcEventLogger logQueryParameters
INFO: [batch bind: 1->ARTIST_ID:354, 2->ARTIST_NAME:'Y', 3->DATE_OF_BIRTH:NULL]
Apr 12, 2011 12:32:50 PM org.apache.cayenne.log.CommonsJdbcEventLogger logUpdateCount
INFO: === updated 2 rows.
Apr 12, 2011 12:32:50 PM org.apache.cayenne.log.CommonsJdbcEventLogger logQuery
INFO: INSERT INTO PAINTING (ARTIST_ID, ESTIMATED_PRICE, GALLERY_ID, PAINTING_DESCRIPTION,
PAINTING_ID, PAINTING_TITLE) VALUES (?, ?, ?, ?, ?, ?)
Apr 12, 2011 12:32:50 PM org.apache.cayenne.log.CommonsJdbcEventLogger logQueryParameters
INFO: [batch bind: 1->ARTIST_ID:353, 2->ESTIMATED_PRICE:NULL, 3->GALLERY_ID:NULL,
4->PAINTING_DESCRIPTION:NULL, 5->PAINTING_ID:243, 6->PAINTING_TITLE:'PPP']
Apr 12, 2011 12:32:50 PM org.apache.cayenne.log.CommonsJdbcEventLogger logUpdateCount
INFO: === updated 1 row.
Apr 12, 2011 12:32:50 PM org.apache.cayenne.log.CommonsJdbcEventLogger logCommitTransaction
INFO: +++ transaction committed.
Apr 12, 2011 12:32:50 PM org.apache.cayenne.log.CommonsJdbcEventLogger logBeginTransaction
INFO: --- transaction started.
Apr 12, 2011 12:32:50 PM org.apache.cayenne.log.CommonsJdbcEventLogger logQuery
INFO: UPDATE PAINTING SET ARTIST_ID = ? WHERE PAINTING_ID = ?
Apr 12, 2011 12:32:50 PM org.apache.cayenne.log.CommonsJdbcEventLogger logQueryParameters
INFO: [batch bind: 1->ARTIST_ID:354, 2->PAINTING_ID:243]
Apr 12, 2011 12:32:50 PM org.apache.cayenne.log.CommonsJdbcEventLogger logUpdateCount
INFO: === updated 1 row.
Apr 12, 2011 12:32:50 PM org.apache.cayenne.log.CommonsJdbcEventLogger logCommitTransaction
INFO: +++ transaction committed.
Apr 12, 2011 12:32:50 PM org.apache.cayenne.log.CommonsJdbcEventLogger logBeginTransaction
INFO: --- transaction started.
Apr 12, 2011 12:32:50 PM org.apache.cayenne.log.CommonsJdbcEventLogger logQuery
INFO: INSERT INTO ARTIST (ARTIST_ID, ARTIST_NAME, DATE_OF_BIRTH) VALUES (?, ?, ?)
Apr 12, 2011 12:32:50 PM org.apache.cayenne.log.CommonsJdbcEventLogger logQueryParameters
INFO: [batch bind: 1->ARTIST_ID:355, 2->ARTIST_NAME:'X', 3->DATE_OF_BIRTH:NULL]
Apr 12, 2011 12:32:50 PM org.apache.cayenne.log.CommonsJdbcEventLogger logUpdateCount
INFO: === updated 1 row.
Apr 12, 2011 12:32:50 PM org.apache.cayenne.log.CommonsJdbcEventLogger logQuery
INFO: INSERT INTO PAINTING (ARTIST_ID, ESTIMATED_PRICE, GALLERY_ID, PAINTING_DESCRIPTION,
PAINTING_ID, PAINTING_TITLE) VALUES (?, ?, ?, ?, ?, ?)
Apr 12, 2011 12:32:50 PM org.apache.cayenne.log.CommonsJdbcEventLogger logQueryParameters
INFO: [batch bind: 1->ARTIST_ID:355, 2->ESTIMATED_PRICE:NULL, 3->GALLERY_ID:NULL,
4->PAINTING_DESCRIPTION:NULL, 5->PAINTING_ID:244, 6->PAINTING_TITLE:'PX']
Apr 12, 2011 12:32:50 PM org.apache.cayenne.log.CommonsJdbcEventLogger logQueryParameters
INFO: [batch bind: 1->ARTIST_ID:NULL, 2->ESTIMATED_PRICE:NULL, 3->GALLERY_ID:NULL,
4->PAINTING_DESCRIPTION:NULL, 5->PAINTING_ID:245, 6->PAINTING_TITLE:'PY']
Apr 12, 2011 12:32:50 PM org.apache.cayenne.log.CommonsJdbcEventLogger logUpdateCount
INFO: === updated 2 rows.
Apr 12, 2011 12:32:50 PM org.apache.cayenne.log.CommonsJdbcEventLogger logCommitTransaction
INFO: +++ transaction committed.
Apr 12, 2011 12:32:50 PM org.apache.cayenne.log.CommonsJdbcEventLogger logBeginTransaction
INFO: --- transaction started.
Apr 12, 2011 12:32:50 PM org.apache.cayenne.log.CommonsJdbcEventLogger logQuery
INFO: UPDATE PAINTING SET ARTIST_ID = ? WHERE PAINTING_ID = ?
Apr 12, 2011 12:32:50 PM org.apache.cayenne.log.CommonsJdbcEventLogger logQueryParameters
INFO: [batch bind: 1->ARTIST_ID:355, 2->PAINTING_ID:245]
Apr 12, 2011 12:32:50 PM org.apache.cayenne.log.CommonsJdbcEventLogger logUpdateCount
INFO: === updated 1 row.
Apr 12, 2011 12:32:50 PM org.apache.cayenne.log.CommonsJdbcEventLogger logCommitTransaction
INFO: +++ transaction committed.
Apr 12, 2011 12:32:50 PM org.apache.cayenne.log.CommonsJdbcEventLogger logBeginTransaction
INFO: --- transaction started.
Apr 12, 2011 12:32:50 PM org.apache.cayenne.log.CommonsJdbcEventLogger logQuery
INFO: SELECT t0.ARTIST_ID, t0.PAINTING_ID, t0.GALLERY_ID, t0.PAINTING_DESCRIPTION, t0.ESTIMATED_PRICE,
t0.PAINTING_TITLE FROM PAINTING t0 WHERE t0.ARTIST_ID = ? [bind: 1->ARTIST_ID:355]
Apr 12, 2011 12:32:50 PM org.apache.cayenne.log.CommonsJdbcEventLogger logSelectCount
INFO: === returned 2 rows. - took 4 ms.
Apr 12, 2011 12:32:50 PM org.apache.cayenne.log.CommonsJdbcEventLogger logCommitTransaction
INFO: +++ transaction committed.
Tests run: 3, Failures: 0, Errors: 0, Skipped: 0, Time elapsed: 1.091 sec
Running org.apache.cayenne.DataRowTest
Tests run: 2, Failures: 0, Errors: 0, Skipped: 0, Time elapsed: 0.016 sec
Running org.apache.cayenne.access.types.EnumTypeTest
Tests run: 7, Failures: 0, Errors: 0, Skipped: 0, Time elapsed: 0.002 sec

Results :

Failed tests: 
  testNewAdd(org.apache.cayenne.CDOOne2ManyTest)

Tests run: 2082, Failures: 1, Errors: 0, Skipped: 0

[INFO] ------------------------------------------------------------------------
[INFO] Reactor Summary:
[INFO] 
[INFO] Cayenne ........................................... SUCCESS [0.291s]
[INFO] Common Unit Test Utilities ........................ SUCCESS [1.540s]
[INFO] Cayenne Internal Build Plugin ..................... SUCCESS [1.382s]
[INFO] Cayenne Internal Documentation Build Plugin ....... SUCCESS [1.771s]
[INFO] Cayenne Build Tools Parent ........................ SUCCESS [0.005s]
[INFO] Cayenne License and Notice Bundle ................. SUCCESS [0.759s]
[INFO] Cayenne Dependency Injection Container ............ SUCCESS [2.633s]
[INFO] Cayenne Java 1.5 Unpublished ...................... FAILURE [3:36.022s]
[INFO] Cayenne Project ................................... SKIPPED
[INFO] Cayenne WebObjects Compatibility Library .......... SKIPPED
[INFO] Cayenne Aggregated Server Jar ..................... SKIPPED
[INFO] Cayenne Aggregated Client Jar ..................... SKIPPED
[INFO] Cayenne Tools ..................................... SKIPPED
[INFO] Library: cayenne-lifecycle ........................ SKIPPED
[INFO] Cayenne Maven Plugin .............................. SKIPPED
[INFO] Cayenne Framework Aggregator Project .............. SKIPPED
[INFO] Cayenne Integration Tests Parent .................. SKIPPED
[INFO] Integration Tests - Cayenne Runtime ............... SKIPPED
[INFO] Integration Tests - Cayenne Tools ................. SKIPPED
[INFO] Cayenne Modeler ................................... SKIPPED
[INFO] Cayenne Modeler Maven Plugin ...................... SKIPPED
[INFO] Cayenne Modeler Parent ............................ SKIPPED
[INFO] Cayenne Tutorial .................................. SKIPPED
[INFO] Cayenne ROP Server Tutorial ....................... SKIPPED
[INFO] Cayenne ROP Client Tutorial ....................... SKIPPED
[INFO] Cayenne Tutorials ................................. SKIPPED
[INFO] Cayenne Documentation ............................. SKIPPED
[INFO] Cayenne Documenation Parent ....................... SKIPPED
[INFO] ------------------------------------------------------------------------
[INFO] BUILD FAILURE
[INFO] ------------------------------------------------------------------------
[INFO] Total time: 3:45.922s
[INFO] Finished at: Tue Apr 12 12:32:51 UTC 2011
[INFO] Final Memory: 46M/411M
[INFO] ------------------------------------------------------------------------
[ERROR] Failed to execute goal org.apache.maven.plugins:maven-surefire-plugin:2.5:test (default-test)
on project cayenne-jdk1.5-unpublished: There are test failures.
[ERROR] 
[ERROR] Please refer to <https://hudson.apache.org/hudson/job/Cayenne-trunk/./cayenneTestConnection=derby,jdk=JDK%201.6%20(latest),label=Ubuntu/ws/trunk/framework/cayenne-jdk1.5-unpublished/target/surefire-reports>
for the individual test results.
[ERROR] -> [Help 1]
org.apache.maven.lifecycle.LifecycleExecutionException: Failed to execute goal org.apache.maven.plugins:maven-surefire-plugin:2.5:test
(default-test) on project cayenne-jdk1.5-unpublished: There are test failures.

Please refer to <https://hudson.apache.org/hudson/job/Cayenne-trunk/./cayenneTestConnection=derby,jdk=JDK%201.6%20(latest),label=Ubuntu/ws/trunk/framework/cayenne-jdk1.5-unpublished/target/surefire-reports>
for the individual test results.
	at org.apache.maven.lifecycle.internal.MojoExecutor.execute(MojoExecutor.java:213)
	at org.apache.maven.lifecycle.internal.MojoExecutor.execute(MojoExecutor.java:153)
	at org.apache.maven.lifecycle.internal.MojoExecutor.execute(MojoExecutor.java:145)
	at org.apache.maven.lifecycle.internal.LifecycleModuleBuilder.buildProject(LifecycleModuleBuilder.java:84)
	at org.apache.maven.lifecycle.internal.LifecycleModuleBuilder.buildProject(LifecycleModuleBuilder.java:59)
	at org.apache.maven.lifecycle.internal.LifecycleStarter.singleThreadedBuild(LifecycleStarter.java:183)
	at org.apache.maven.lifecycle.internal.LifecycleStarter.execute(LifecycleStarter.java:161)
	at org.apache.maven.DefaultMaven.doExecute(DefaultMaven.java:319)
	at org.apache.maven.DefaultMaven.execute(DefaultMaven.java:156)
	at org.apache.maven.cli.MavenCli.execute(MavenCli.java:537)
	at org.apache.maven.cli.MavenCli.doMain(MavenCli.java:196)
	at org.apache.maven.cli.MavenCli.main(MavenCli.java:141)
	at sun.reflect.NativeMethodAccessorImpl.invoke0(Native Method)
	at sun.reflect.NativeMethodAccessorImpl.invoke(NativeMethodAccessorImpl.java:39)
	at sun.reflect.DelegatingMethodAccessorImpl.invoke(DelegatingMethodAccessorImpl.java:25)
	at java.lang.reflect.Method.invoke(Method.java:597)
	at org.codehaus.plexus.classworlds.launcher.Launcher.launchEnhanced(Launcher.java:290)
	at org.codehaus.plexus.classworlds.launcher.Launcher.launch(Launcher.java:230)
	at org.codehaus.plexus.classworlds.launcher.Launcher.mainWithExitCode(Launcher.java:409)
	at org.codehaus.plexus.classworlds.launcher.Launcher.main(Launcher.java:352)
Caused by: org.apache.maven.plugin.MojoFailureException: There are test failures.

Please refer to <https://hudson.apache.org/hudson/job/Cayenne-trunk/./cayenneTestConnection=derby,jdk=JDK%201.6%20(latest),label=Ubuntu/ws/trunk/framework/cayenne-jdk1.5-unpublished/target/surefire-reports>
for the individual test results.
	at org.apache.maven.plugin.surefire.SurefirePlugin.execute(SurefirePlugin.java:629)
	at org.apache.maven.plugin.DefaultBuildPluginManager.executeMojo(DefaultBuildPluginManager.java:101)
	at org.apache.maven.lifecycle.internal.MojoExecutor.execute(MojoExecutor.java:209)
	... 19 more
[ERROR] 
[ERROR] Re-run Maven using the -X switch to enable full debug logging.
[ERROR] 
[ERROR] For more information about the errors and possible solutions, please read the following
articles:
[ERROR] [Help 1] http://cwiki.apache.org/confluence/display/MAVEN/MojoFailureException
[ERROR] 
[ERROR] After correcting the problems, you can resume the build with the command
[ERROR]   mvn <goals> -rf :cayenne-jdk1.5-unpublished
Archiving artifacts


Mime
View raw message