cayenne-commits mailing list archives

Site index · List index
Message view « Date » · « Thread »
Top « Date » · « Thread »
From Apache Hudson Server <hud...@hudson.apache.org>
Subject Build failed in Hudson: Cayenne-trunk » HSQLDB,JDK 1.6 (latest),Ubuntu #420
Date Sun, 30 Jan 2011 13:26:47 GMT
See <https://hudson.apache.org/hudson/job/Cayenne-trunk/./cayenneTestConnection=HSQLDB,jdk=JDK%201.6%20(latest),label=Ubuntu/420/>

------------------------------------------
[...truncated 4329 lines...]
A         framework/cayenne-jdk1.5-unpublished/src/main/resources
A         framework/cayenne-jdk1.5-unpublished/src/main/resources/org
A         framework/cayenne-jdk1.5-unpublished/src/main/resources/org/apache
A         framework/cayenne-jdk1.5-unpublished/src/main/resources/org/apache/cayenne
A         framework/cayenne-jdk1.5-unpublished/src/main/resources/org/apache/cayenne/schema
A         framework/cayenne-jdk1.5-unpublished/src/main/resources/org/apache/cayenne/schema/3.0
A         framework/cayenne-jdk1.5-unpublished/src/main/resources/org/apache/cayenne/schema/3.0/driver.xsd
A         framework/cayenne-jdk1.5-unpublished/src/main/resources/org/apache/cayenne/schema/3.0/modelMap.xsd
A         framework/cayenne-jdk1.5-unpublished/src/main/resources/org/apache/cayenne/dba
A         framework/cayenne-jdk1.5-unpublished/src/main/resources/org/apache/cayenne/dba/sqlite
A         framework/cayenne-jdk1.5-unpublished/src/main/resources/org/apache/cayenne/dba/sqlite/types.xml
A         framework/cayenne-jdk1.5-unpublished/src/main/resources/org/apache/cayenne/dba/frontbase
AU        framework/cayenne-jdk1.5-unpublished/src/main/resources/org/apache/cayenne/dba/frontbase/types.xml
AU        framework/cayenne-jdk1.5-unpublished/src/main/resources/org/apache/cayenne/dba/types.xml
A         framework/cayenne-jdk1.5-unpublished/src/main/resources/org/apache/cayenne/dba/derby
AU        framework/cayenne-jdk1.5-unpublished/src/main/resources/org/apache/cayenne/dba/derby/types.xml
A         framework/cayenne-jdk1.5-unpublished/src/main/resources/org/apache/cayenne/dba/mysql
AU        framework/cayenne-jdk1.5-unpublished/src/main/resources/org/apache/cayenne/dba/mysql/types.xml
A         framework/cayenne-jdk1.5-unpublished/src/main/resources/org/apache/cayenne/dba/oracle
AU        framework/cayenne-jdk1.5-unpublished/src/main/resources/org/apache/cayenne/dba/oracle/types.xml
AU        framework/cayenne-jdk1.5-unpublished/src/main/resources/org/apache/cayenne/dba/oracle/types-oracle8.xml
A         framework/cayenne-jdk1.5-unpublished/src/main/resources/org/apache/cayenne/dba/postgres
AU        framework/cayenne-jdk1.5-unpublished/src/main/resources/org/apache/cayenne/dba/postgres/types.xml
A         framework/cayenne-jdk1.5-unpublished/src/main/resources/org/apache/cayenne/dba/sqlserver
AU        framework/cayenne-jdk1.5-unpublished/src/main/resources/org/apache/cayenne/dba/sqlserver/types.xml
A         framework/cayenne-jdk1.5-unpublished/src/main/resources/org/apache/cayenne/dba/sybase
AU        framework/cayenne-jdk1.5-unpublished/src/main/resources/org/apache/cayenne/dba/sybase/types.xml
A         framework/cayenne-jdk1.5-unpublished/src/main/resources/org/apache/cayenne/dba/db2
AU        framework/cayenne-jdk1.5-unpublished/src/main/resources/org/apache/cayenne/dba/db2/types.xml
A         framework/cayenne-jdk1.5-unpublished/src/main/resources/org/apache/cayenne/dba/ingres
AU        framework/cayenne-jdk1.5-unpublished/src/main/resources/org/apache/cayenne/dba/ingres/types.xml
A         framework/cayenne-jdk1.5-unpublished/src/main/resources/org/apache/cayenne/dba/h2
A         framework/cayenne-jdk1.5-unpublished/src/main/resources/org/apache/cayenne/dba/h2/types.xml
A         framework/cayenne-jdk1.5-unpublished/src/main/resources/org/apache/cayenne/dba/openbase
AU        framework/cayenne-jdk1.5-unpublished/src/main/resources/org/apache/cayenne/dba/openbase/types.xml
A         framework/cayenne-jdk1.5-unpublished/src/main/resources/org/apache/cayenne/dba/hsqldb
AU        framework/cayenne-jdk1.5-unpublished/src/main/resources/org/apache/cayenne/dba/hsqldb/types.xml
A         framework/cayenne-jdk1.5-unpublished/pom.xml
A         framework/cayenne-jdk1.5-unpublished/.settings
A         framework/cayenne-jdk1.5-unpublished/.settings/org.eclipse.jdt.core.prefs
A         framework/cayenne-jdk1.5-unpublished/.settings/org.eclipse.jdt.ui.prefs
A         framework/cayenne-jdk1.6-unpublished
A         framework/cayenne-jdk1.6-unpublished/.classpath
A         framework/cayenne-jdk1.6-unpublished/.project
A         framework/cayenne-jdk1.6-unpublished/src
A         framework/cayenne-jdk1.6-unpublished/src/test
A         framework/cayenne-jdk1.6-unpublished/src/test/java
A         framework/cayenne-jdk1.6-unpublished/src/test/resources
A         framework/cayenne-jdk1.6-unpublished/src/main
A         framework/cayenne-jdk1.6-unpublished/src/main/java
A         framework/cayenne-jdk1.6-unpublished/src/main/java/org
A         framework/cayenne-jdk1.6-unpublished/src/main/java/org/apache
A         framework/cayenne-jdk1.6-unpublished/src/main/java/org/apache/cayenne
A         framework/cayenne-jdk1.6-unpublished/src/main/java/org/apache/cayenne/Placeholder16.java
A         framework/cayenne-jdk1.6-unpublished/src/main/resources
A         framework/cayenne-jdk1.6-unpublished/pom.xml
A         framework/cayenne-jdk1.6-unpublished/.settings
A         framework/cayenne-jdk1.6-unpublished/.settings/org.eclipse.jdt.core.prefs
A         framework/cayenne-jdk1.6-unpublished/.settings/org.eclipse.jdt.ui.prefs
A         framework/cayenne-client
A         framework/cayenne-client/src
A         framework/cayenne-client/src/main
A         framework/cayenne-client/src/main/aggregator
AU        framework/cayenne-client/src/main/aggregator/excludes.txt
A         framework/cayenne-client/pom.xml
 U        .
At revision 1065264
no change for http://svn.apache.org/repos/asf/cayenne/main/trunk since the previous build
[trunk] $ /home/hudson/tools/maven/apache-maven-2.2.1/bin/mvn -Dlabel=Ubuntu "-Djdk=JDK 1.6
(latest)" -DcayenneTestConnection=HSQLDB -e clean install
[INFO] Error stacktraces are turned on.
[INFO] Scanning for projects...
[ERROR] The build could not read 2 projects -> [Help 1]
org.apache.maven.project.ProjectBuildingException: Some problems were encountered while processing
the POMs:
[WARNING] 'build.plugins.plugin.version' for org.apache.maven.plugins:maven-deploy-plugin
is missing. @ line 59, column 12
[WARNING] 'build.plugins.plugin.version' for org.apache.maven.plugins:maven-compiler-plugin
is missing. @ line 52, column 12
[WARNING] 'reporting.plugins.plugin.version' for com.atlassian.maven.plugins:maven-clover2-plugin
is missing. @ 
[WARNING] 'reporting.plugins.plugin.version' for org.apache.maven.plugins:maven-javadoc-plugin
is missing. @ 
[WARNING] 'build.plugins.plugin.version' for org.apache.maven.plugins:maven-deploy-plugin
is missing. @ line 100, column 12
[WARNING] 'reporting.plugins.plugin.version' for com.atlassian.maven.plugins:maven-clover2-plugin
is missing. @ 
[WARNING] 'reporting.plugins.plugin.version' for org.apache.maven.plugins:maven-javadoc-plugin
is missing. @ 
[WARNING] 'build.plugins.plugin.version' for org.apache.maven.plugins:maven-deploy-plugin
is missing. @ line 73, column 12
[WARNING] 'build.plugins.plugin.version' for org.apache.maven.plugins:maven-compiler-plugin
is missing. @ line 65, column 12
[WARNING] 'reporting.plugins.plugin.version' for com.atlassian.maven.plugins:maven-clover2-plugin
is missing. @ 
[WARNING] 'reporting.plugins.plugin.version' for org.apache.maven.plugins:maven-javadoc-plugin
is missing. @ 
[WARNING] 'build.plugins.plugin.version' for org.apache.maven.plugins:maven-deploy-plugin
is missing. @ line 45, column 12
[WARNING] 'reporting.plugins.plugin.version' for com.atlassian.maven.plugins:maven-clover2-plugin
is missing. @ 
[WARNING] 'reporting.plugins.plugin.version' for org.apache.maven.plugins:maven-javadoc-plugin
is missing. @ 
[WARNING] 'build.plugins.plugin.version' for org.apache.maven.plugins:maven-deploy-plugin
is missing. @ line 84, column 12
[WARNING] 'build.plugins.plugin.version' for org.apache.cayenne.build-tools:maven-cayenne-build-plugin
is missing. @ line 48, column 12
[WARNING] 'build.plugins.plugin.version' for org.apache.maven.plugins:maven-source-plugin
is missing. @ line 72, column 12
[WARNING] 'reporting.plugins.plugin.version' for com.atlassian.maven.plugins:maven-clover2-plugin
is missing. @ 
[WARNING] 'reporting.plugins.plugin.version' for org.apache.maven.plugins:maven-javadoc-plugin
is missing. @ 
[WARNING] 'build.plugins.plugin.version' for org.apache.cayenne.build-tools:maven-cayenne-build-plugin
is missing. @ line 49, column 12
[WARNING] 'build.plugins.plugin.version' for org.apache.maven.plugins:maven-compiler-plugin
is missing. @ line 28, column 12
[WARNING] 'build.plugins.plugin.version' for org.apache.maven.plugins:maven-source-plugin
is missing. @ line 36, column 12
[WARNING] 'reporting.plugins.plugin.version' for com.atlassian.maven.plugins:maven-clover2-plugin
is missing. @ 
[WARNING] 'reporting.plugins.plugin.version' for org.apache.maven.plugins:maven-javadoc-plugin
is missing. @ 
[WARNING] 'build.plugins.plugin.version' for org.apache.cayenne.build-tools:maven-cayenne-build-plugin
is missing. @ line 249, column 12
[WARNING] 'build.plugins.plugin.version' for org.apache.maven.plugins:maven-deploy-plugin
is missing. @ line 231, column 12
[WARNING] 'build.plugins.plugin.version' for org.apache.maven.plugins:maven-source-plugin
is missing. @ line 218, column 12
[WARNING] 'build.plugins.plugin.version' for org.apache.maven.plugins:maven-jar-plugin is
missing. @ line 238, column 12
[WARNING] 'build.plugins.plugin.version' for org.apache.maven.plugins:maven-compiler-plugin
is missing. @ line 129, column 12
[ERROR] 'dependencies.dependency.version' for org.mockito:mockito-all:jar is missing. @ line
34, column 15
[WARNING] 'reporting.plugins.plugin.version' for com.atlassian.maven.plugins:maven-clover2-plugin
is missing. @ 
[WARNING] 'reporting.plugins.plugin.version' for org.apache.maven.plugins:maven-javadoc-plugin
is missing. @ 
[WARNING] 'build.plugins.plugin.version' for org.apache.maven.plugins:maven-deploy-plugin
is missing. @ line 85, column 12
[WARNING] 'build.plugins.plugin.version' for org.apache.cayenne.build-tools:maven-cayenne-build-plugin
is missing. @ line 73, column 12
[WARNING] 'build.plugins.plugin.version' for org.apache.maven.plugins:maven-compiler-plugin
is missing. @ line 52, column 12
[WARNING] 'build.plugins.plugin.version' for org.apache.maven.plugins:maven-source-plugin
is missing. @ line 60, column 12
[WARNING] The expression ${version} is deprecated. Please use ${project.version} instead.
@ 
[WARNING] 'reporting.plugins.plugin.version' for com.atlassian.maven.plugins:maven-clover2-plugin
is missing. @ 
[WARNING] 'reporting.plugins.plugin.version' for org.apache.maven.plugins:maven-javadoc-plugin
is missing. @ 
[WARNING] 'build.plugins.plugin.version' for org.apache.maven.plugins:maven-deploy-plugin
is missing. @ line 83, column 12
[WARNING] 'build.plugins.plugin.version' for org.apache.maven.plugins:maven-compiler-plugin
is missing. @ line 62, column 12
[WARNING] 'build.plugins.plugin.version' for org.apache.maven.plugins:maven-source-plugin
is missing. @ line 70, column 12
[WARNING] 'reporting.plugins.plugin.version' for com.atlassian.maven.plugins:maven-clover2-plugin
is missing. @ 
[WARNING] 'reporting.plugins.plugin.version' for org.apache.maven.plugins:maven-javadoc-plugin
is missing. @ 
[WARNING] 'build.plugins.plugin.version' for org.apache.maven.plugins:maven-deploy-plugin
is missing. @ line 77, column 12
[WARNING] 'build.plugins.plugin.version' for org.apache.maven.plugins:maven-compiler-plugin
is missing. @ line 56, column 12
[WARNING] 'build.plugins.plugin.version' for org.apache.maven.plugins:maven-source-plugin
is missing. @ line 64, column 12
[WARNING] 'reporting.plugins.plugin.version' for com.atlassian.maven.plugins:maven-clover2-plugin
is missing. @ 
[WARNING] 'reporting.plugins.plugin.version' for org.apache.maven.plugins:maven-javadoc-plugin
is missing. @ 
[WARNING] 'build.plugins.plugin.version' for org.apache.cayenne.build-tools:maven-cayenne-build-plugin
is missing. @ line 66, column 12
[WARNING] The expression ${version} is deprecated. Please use ${project.version} instead.
@ 
[WARNING] The expression ${version} is deprecated. Please use ${project.version} instead.
@ 
[WARNING] The expression ${version} is deprecated. Please use ${project.version} instead.
@ 
[WARNING] The expression ${version} is deprecated. Please use ${project.version} instead.
@ 
[WARNING] The expression ${version} is deprecated. Please use ${project.version} instead.
@ 
[WARNING] The expression ${version} is deprecated. Please use ${project.version} instead.
@ 
[WARNING] The expression ${version} is deprecated. Please use ${project.version} instead.
@ 
[WARNING] The expression ${version} is deprecated. Please use ${project.version} instead.
@ 
[WARNING] The expression ${version} is deprecated. Please use ${project.version} instead.
@ 
[WARNING] The expression ${version} is deprecated. Please use ${project.version} instead.
@ 
[WARNING] The expression ${version} is deprecated. Please use ${project.version} instead.
@ 
[WARNING] The expression ${version} is deprecated. Please use ${project.version} instead.
@ 
[WARNING] The expression ${version} is deprecated. Please use ${project.version} instead.
@ 
[WARNING] 'reporting.plugins.plugin.version' for com.atlassian.maven.plugins:maven-clover2-plugin
is missing. @ 
[WARNING] 'reporting.plugins.plugin.version' for org.apache.maven.plugins:maven-javadoc-plugin
is missing. @ 
[WARNING] 'build.plugins.plugin.version' for org.apache.cayenne.build-tools:maven-cayenne-build-plugin
is missing. @ line 67, column 12
[WARNING] The expression ${version} is deprecated. Please use ${project.version} instead.
@ 
[WARNING] The expression ${version} is deprecated. Please use ${project.version} instead.
@ 
[WARNING] The expression ${version} is deprecated. Please use ${project.version} instead.
@ 
[WARNING] The expression ${version} is deprecated. Please use ${project.version} instead.
@ 
[WARNING] The expression ${version} is deprecated. Please use ${project.version} instead.
@ 
[WARNING] The expression ${version} is deprecated. Please use ${project.version} instead.
@ 
[WARNING] The expression ${version} is deprecated. Please use ${project.version} instead.
@ 
[WARNING] The expression ${version} is deprecated. Please use ${project.version} instead.
@ 
[WARNING] The expression ${version} is deprecated. Please use ${project.version} instead.
@ 
[WARNING] The expression ${version} is deprecated. Please use ${project.version} instead.
@ 
[WARNING] The expression ${version} is deprecated. Please use ${project.version} instead.
@ 
[WARNING] The expression ${version} is deprecated. Please use ${project.version} instead.
@ 
[WARNING] The expression ${version} is deprecated. Please use ${project.version} instead.
@ 
[WARNING] 'reporting.plugins.plugin.version' for com.atlassian.maven.plugins:maven-clover2-plugin
is missing. @ 
[WARNING] 'reporting.plugins.plugin.version' for org.apache.maven.plugins:maven-javadoc-plugin
is missing. @ 
[WARNING] 'build.plugins.plugin.version' for org.apache.maven.plugins:maven-compiler-plugin
is missing. @ line 138, column 21
[WARNING] 'build.plugins.plugin.version' for org.apache.maven.plugins:maven-source-plugin
is missing. @ line 146, column 21
[WARNING] 'build.plugins.plugin.version' for org.apache.maven.plugins:maven-remote-resources-plugin
is missing. @ line 116, column 21
[WARNING] 'reporting.plugins.plugin.version' for com.atlassian.maven.plugins:maven-clover2-plugin
is missing. @ 
[WARNING] 'reporting.plugins.plugin.version' for org.apache.maven.plugins:maven-javadoc-plugin
is missing. @ 
[WARNING] 'build.plugins.plugin.version' for org.apache.maven.plugins:maven-remote-resources-plugin
is missing. @ line 50, column 12
[WARNING] 'build.plugins.plugin.version' for org.apache.maven.plugins:maven-source-plugin
is missing. @ line 37, column 12
[WARNING] The expression ${version} is deprecated. Please use ${project.version} instead.
@ 
[WARNING] The expression ${version} is deprecated. Please use ${project.version} instead.
@ 
[WARNING] The expression ${version} is deprecated. Please use ${project.version} instead.
@ 
[ERROR] 'dependencies.dependency.version' for org.mockito:mockito-all:jar is missing. @ line
18, column 15
[WARNING] 'reporting.plugins.plugin.version' for com.atlassian.maven.plugins:maven-clover2-plugin
is missing. @ 
[WARNING] 'reporting.plugins.plugin.version' for org.apache.maven.plugins:maven-javadoc-plugin
is missing. @ 
[WARNING] 'build.plugins.plugin.version' for org.apache.maven.plugins:maven-compiler-plugin
is missing. @ line 113, column 12
[WARNING] 'reporting.plugins.plugin.version' for com.atlassian.maven.plugins:maven-clover2-plugin
is missing. @ 
[WARNING] 'reporting.plugins.plugin.version' for org.apache.maven.plugins:maven-javadoc-plugin
is missing. @ 
[WARNING] 'build.plugins.plugin.version' for org.apache.maven.plugins:maven-deploy-plugin
is missing. @ line 35, column 12
[WARNING] 'reporting.plugins.plugin.version' for com.atlassian.maven.plugins:maven-clover2-plugin
is missing. @ 
[WARNING] 'reporting.plugins.plugin.version' for org.apache.maven.plugins:maven-javadoc-plugin
is missing. @ 
[WARNING] 'build.plugins.plugin.version' for org.apache.maven.plugins:maven-compiler-plugin
is missing. @ line 69, column 12
[WARNING] 'build.plugins.plugin.version' for org.apache.maven.plugins:maven-deploy-plugin
is missing. @ line 77, column 12
[WARNING] 'reporting.plugins.plugin.version' for com.atlassian.maven.plugins:maven-clover2-plugin
is missing. @ 
[WARNING] 'reporting.plugins.plugin.version' for org.apache.maven.plugins:maven-javadoc-plugin
is missing. @ 
[WARNING] 'build.plugins.plugin.version' for org.apache.maven.plugins:maven-compiler-plugin
is missing. @ line 79, column 12
[WARNING] 'build.plugins.plugin.version' for org.apache.maven.plugins:maven-deploy-plugin
is missing. @ line 87, column 12
[WARNING] 'build.plugins.plugin.version' for org.apache.cayenne.plugins:maven-cayenne-plugin
is missing. @ line 95, column 12
[WARNING] 'reporting.plugins.plugin.version' for com.atlassian.maven.plugins:maven-clover2-plugin
is missing. @ 
[WARNING] 'reporting.plugins.plugin.version' for org.apache.maven.plugins:maven-javadoc-plugin
is missing. @ 
[WARNING] 'build.plugins.plugin.version' for org.apache.maven.plugins:maven-deploy-plugin
is missing. @ line 45, column 12
[WARNING] 'reporting.plugins.plugin.version' for com.atlassian.maven.plugins:maven-clover2-plugin
is missing. @ 
[WARNING] 'reporting.plugins.plugin.version' for org.apache.maven.plugins:maven-javadoc-plugin
is missing. @ 
[WARNING] 'build.plugins.plugin.version' for org.apache.maven.plugins:maven-compiler-plugin
is missing. @ line 155, column 12
[WARNING] 'build.plugins.plugin.version' for org.apache.maven.plugins:maven-source-plugin
is missing. @ line 163, column 12
[WARNING] 'build.plugins.plugin.version' for org.apache.maven.plugins:maven-remote-resources-plugin
is missing. @ line 133, column 12
[WARNING] 'reporting.plugins.plugin.version' for com.atlassian.maven.plugins:maven-clover2-plugin
is missing. @ 
[WARNING] 'reporting.plugins.plugin.version' for org.apache.maven.plugins:maven-javadoc-plugin
is missing. @ 
[WARNING] 'build.plugins.plugin.version' for org.apache.maven.plugins:maven-compiler-plugin
is missing. @ line 88, column 12
[WARNING] The expression ${version} is deprecated. Please use ${project.version} instead.
@ 
[WARNING] The expression ${version} is deprecated. Please use ${project.version} instead.
@ 
[WARNING] The expression ${version} is deprecated. Please use ${project.version} instead.
@ 
[WARNING] 'reporting.plugins.plugin.version' for com.atlassian.maven.plugins:maven-clover2-plugin
is missing. @ 
[WARNING] 'reporting.plugins.plugin.version' for org.apache.maven.plugins:maven-javadoc-plugin
is missing. @ 
[WARNING] 'build.plugins.plugin.version' for org.apache.maven.plugins:maven-deploy-plugin
is missing. @ line 44, column 12
[WARNING] 'reporting.plugins.plugin.version' for com.atlassian.maven.plugins:maven-clover2-plugin
is missing. @ 
[WARNING] 'reporting.plugins.plugin.version' for org.apache.maven.plugins:maven-javadoc-plugin
is missing. @ 
[WARNING] 'build.plugins.plugin.version' for org.apache.maven.plugins:maven-deploy-plugin
is missing. @ line 52, column 12
[WARNING] 'build.plugins.plugin.version' for org.apache.maven.plugins:maven-compiler-plugin
is missing. @ line 39, column 12
[WARNING] 'build.plugins.plugin.version' for org.apache.maven.plugins:maven-deploy-plugin
is missing. @ line 65, column 12
[WARNING] 'build.plugins.plugin.version' for org.apache.maven.plugins:maven-compiler-plugin
is missing. @ line 44, column 12
[WARNING] 'build.plugins.plugin.version' for org.apache.maven.plugins:maven-deploy-plugin
is missing. @ line 47, column 12
[WARNING] 'build.plugins.plugin.version' for org.apache.maven.plugins:maven-compiler-plugin
is missing. @ line 39, column 12
[WARNING] 'reporting.plugins.plugin.version' for com.atlassian.maven.plugins:maven-clover2-plugin
is missing. @ 
[WARNING] 'reporting.plugins.plugin.version' for org.apache.maven.plugins:maven-javadoc-plugin
is missing. @ 
[WARNING] 'build.plugins.plugin.version' for org.codehaus.mojo:dependency-maven-plugin is
missing. @ line 163, column 12
[WARNING] 'build.plugins.plugin.version' for org.apache.maven.plugins:maven-deploy-plugin
is missing. @ line 219, column 12
[WARNING] 'build.plugins.plugin.version' for org.apache.cayenne.build-tools:maven-cayenne-build-plugin
is missing. @ line 207, column 12
[WARNING] The expression ${version} is deprecated. Please use ${project.version} instead.
@ 
[WARNING] The expression ${version} is deprecated. Please use ${project.version} instead.
@ 
[WARNING] The expression ${version} is deprecated. Please use ${project.version} instead.
@ 
[WARNING] 'reporting.plugins.plugin.version' for com.atlassian.maven.plugins:maven-clover2-plugin
is missing. @ 
[WARNING] 'reporting.plugins.plugin.version' for org.apache.maven.plugins:maven-javadoc-plugin
is missing. @ 
[WARNING] 'build.plugins.plugin.version' for org.apache.maven.plugins:maven-deploy-plugin
is missing. @ line 44, column 12
[WARNING] 'reporting.plugins.plugin.version' for com.atlassian.maven.plugins:maven-clover2-plugin
is missing. @ 
[WARNING] 'reporting.plugins.plugin.version' for org.apache.maven.plugins:maven-javadoc-plugin
is missing. @ 
[WARNING] 'reporting.plugins.plugin.version' for com.atlassian.maven.plugins:maven-clover2-plugin
is missing. @ line 578, column 12
[WARNING] 'reporting.plugins.plugin.version' for org.apache.maven.plugins:maven-javadoc-plugin
is missing. @ line 603, column 12

	at org.apache.maven.project.DefaultProjectBuilder.build(DefaultProjectBuilder.java:325)
	at org.apache.maven.DefaultMaven.collectProjects(DefaultMaven.java:632)
	at org.apache.maven.DefaultMaven.getProjectsForMavenReactor(DefaultMaven.java:581)
	at org.apache.maven.DefaultMaven.doExecute(DefaultMaven.java:233)
	at org.apache.maven.DefaultMaven.execute(DefaultMaven.java:156)
	at org.apache.maven.cli.MavenCli.execute(MavenCli.java:534)
	at org.apache.maven.cli.MavenCli.doMain(MavenCli.java:196)
	at org.apache.maven.cli.MavenCli.main(MavenCli.java:141)
	at sun.reflect.NativeMethodAccessorImpl.invoke0(Native Method)
	at sun.reflect.NativeMethodAccessorImpl.invoke(NativeMethodAccessorImpl.java:39)
	at sun.reflect.DelegatingMethodAccessorImpl.invoke(DelegatingMethodAccessorImpl.java:25)
	at java.lang.reflect.Method.invoke(Method.java:597)
	at org.codehaus.plexus.classworlds.launcher.Launcher.launchEnhanced(Launcher.java:290)
	at org.codehaus.plexus.classworlds.launcher.Launcher.launch(Launcher.java:230)
	at org.codehaus.plexus.classworlds.launcher.Launcher.mainWithExitCode(Launcher.java:409)
	at org.codehaus.plexus.classworlds.launcher.Launcher.main(Launcher.java:352)
[ERROR]   
[ERROR]   The project org.apache.cayenne.unpublished:cayenne-jdk1.5-unpublished:3.1-SNAPSHOT
(<https://hudson.apache.org/hudson/job/Cayenne-trunk/./cayenneTestConnection=HSQLDB,jdk=JDK%201.6%20(latest),label=Ubuntu/ws/trunk/framework/cayenne-jdk1.5-unpublished/pom.xml)>
has 1 error
[ERROR]     'dependencies.dependency.version' for org.mockito:mockito-all:jar is missing.
@ line 34, column 15
[ERROR]   
[ERROR]   The project org.apache.cayenne:cayenne-lifecycle:3.1-SNAPSHOT (<https://hudson.apache.org/hudson/job/Cayenne-trunk/./cayenneTestConnection=HSQLDB,jdk=JDK%201.6%20(latest),label=Ubuntu/ws/trunk/framework/cayenne-lifecycle/pom.xml)>
has 1 error
[ERROR]     'dependencies.dependency.version' for org.mockito:mockito-all:jar is missing.
@ line 18, column 15
[ERROR] 
[ERROR] Re-run Maven using the -X switch to enable full debug logging.
[ERROR] 
[ERROR] For more information about the errors and possible solutions, please read the following
articles:
[ERROR] [Help 1] http://cwiki.apache.org/confluence/display/MAVEN/ProjectBuildingException
Recording test results


Mime
View raw message