cayenne-commits mailing list archives

Site index · List index
Message view « Date » · « Thread »
Top « Date » · « Thread »
From Apache Hudson Server <hud...@hudson.zones.apache.org>
Subject Build failed in Hudson: Cayenne-trunk » derby,JDK 1.6 (latest),Ubuntu #345
Date Wed, 14 Jul 2010 11:49:17 GMT
See <http://hudson.zones.apache.org/hudson/job/Cayenne-trunk/./cayenneTestConnection=derby,jdk=JDK%201.6%20(latest),label=Ubuntu/345/changes>

Changes:

[evgeny] format src, no functional changes

[evgeny] CAY-1466
Clean-up Oracle specific type support (oracle.sql.*) from issue CAY-1336

changes are rolled back before issue CAY-1336 was applied

------------------------------------------
Started by upstream project "Cayenne-trunk" build number 345
Building remotely on minerva.apache.org (Ubuntu)
Updating http://svn.apache.org/repos/asf/cayenne/main/trunk
D         docs/doc/src/main/image-src/inheritance-example.graffle
D         docs/doc/src/main/image-src/entity-manager.graffle
A         docs/doc/src/main/image-src/inheritance-overview.graffle/QuickLook
A         docs/doc/src/main/image-src/inheritance-overview.graffle/QuickLook/Preview.pdf
A         docs/doc/src/main/image-src/inheritance-overview.graffle/QuickLook/Thumbnail.tiff
U         docs/doc/src/main/image-src/inheritance-overview.graffle/data.plist
U         docs/doc/src/main/resources/RELEASE-NOTES.txt
U         docs/doc/pom.xml
U         framework/cayenne-jdk1.5-unpublished/src/test/java/org/apache/cayenne/CayenneContextEJBQLTest.java
U         framework/cayenne-jdk1.5-unpublished/src/test/java/org/apache/cayenne/unit/di/server/ServerCase.java
U         framework/cayenne-jdk1.5-unpublished/src/test/java/org/apache/cayenne/access/DataContextEJBQLGroupByHavingTest.java
U         framework/cayenne-jdk1.5-unpublished/src/test/java/org/apache/cayenne/access/DataContextEJBQLFlattenedRelationshipsTest.java
U         framework/cayenne-jdk1.5-unpublished/src/test/java/org/apache/cayenne/access/DataContextEJBQLInheritanceTest.java
D         framework/cayenne-jdk1.5-unpublished/src/test/resources/dml/access.DataContextEJBQLFlattenedRelationshipsTest.xml
D         framework/cayenne-jdk1.5-unpublished/src/test/resources/dml/access.DataContextEJBQLInheritanceTest.xml
D         framework/cayenne-jdk1.5-unpublished/src/test/resources/dml/access.DataContextEJBQLGroupByHavingTest.xml
A         framework/cayenne-jdk1.5-unpublished/src/test/resources/cayenne-relationships.xml
A         framework/cayenne-jdk1.5-unpublished/src/test/resources/cayenne-people.xml
U         framework/cayenne-jdk1.5-unpublished/src/test/resources/cayenne-default.xml
U         framework/cayenne-jdk1.5-unpublished/src/main/java/org/apache/cayenne/merge/MergerToken.java
U         framework/cayenne-jdk1.5-unpublished/src/main/java/org/apache/cayenne/access/jdbc/DefaultBatchQueryBuilderFactory.java
U         framework/cayenne-jdk1.5-unpublished/src/main/java/org/apache/cayenne/access/jdbc/SoftDeleteBatchQueryBuilder.java
U         framework/cayenne-jdk1.5-unpublished/src/main/java/org/apache/cayenne/access/QueryLogger.java
U         framework/cayenne-jdk1.5-unpublished/src/main/java/org/apache/cayenne/access/ClientServerChannelQueryAction.java
U         framework/cayenne-jdk1.5-unpublished/src/main/java/org/apache/cayenne/access/trans/QueryAssemblerHelper.java
D         framework/cayenne-jdk1.5-unpublished/src/main/java/org/apache/cayenne/dba/oracle/OracleCharType.java
D         framework/cayenne-jdk1.5-unpublished/src/main/java/org/apache/cayenne/dba/oracle/OracleDateType.java
D         framework/cayenne-jdk1.5-unpublished/src/main/java/org/apache/cayenne/dba/oracle/OracleBLOBType.java
D         framework/cayenne-jdk1.5-unpublished/src/main/java/org/apache/cayenne/dba/oracle/OracleCLOBType.java
D         framework/cayenne-jdk1.5-unpublished/src/main/java/org/apache/cayenne/dba/oracle/OracleTimestampType.java
U         framework/cayenne-jdk1.5-unpublished/src/main/java/org/apache/cayenne/dba/oracle/OracleAdapter.java
U         framework/cayenne-jdk1.5-unpublished/src/main/java/org/apache/cayenne/remote/ClientChannel.java
At revision 964011
[trunk] $ /home/hudson/tools/maven/apache-maven-2.2.1/bin/mvn -Dlabel=Ubuntu "-Djdk=JDK 1.6
(latest)" -DcayenneTestConnection=derby -e clean install
+ Error stacktraces are turned on.
[INFO] Scanning for projects...
[INFO] Reactor build order: 
[INFO]   Cayenne
[INFO]   Common Unit Test Utilities
[INFO]   Cayenne Internal Build Plugin
[INFO]   Cayenne Internal Documentation Build Plugin
[INFO]   Cayenne Build Tools Parent
[INFO]   Cayenne License and Notice Bundle
[INFO]   Cayenne Dependency Injection Container
[INFO]   Cayenne Java 1.5 Unpublished
[INFO]   Cayenne Java 1.6 Extensions
[INFO]   Cayenne Project
[INFO]   Cayenne WebObjects Compatibility Library
[INFO]   Cayenne Aggregated Server Jar
[INFO]   Cayenne Aggregated Client Jar
[INFO]   Cayenne Tools
[INFO]   Cayenne Modeler
[INFO]   Cayenne Maven Plugin
[INFO]   Cayenne Modeler Maven Plugin
[INFO]   Cayenne Framework Aggregator Project
[INFO]   Cayenne Integration Tests Parent
[INFO]   Integration Tests - Cayenne DI Stack
[INFO]   Cayenne Modeler Java
[INFO]   Cayenne Modeler Parent
[INFO]   Cayenne Tutorial
[INFO]   Cayenne ROP Server Tutorial
[INFO]   Cayenne ROP Client Tutorial
[INFO]   Cayenne Tutorials
[INFO]   Cayenne Documentation
[INFO]   Cayenne Documenation Parent
[INFO] ------------------------------------------------------------------------
[INFO] Building Cayenne
[INFO]    task-segment: [clean, install]
[INFO] ------------------------------------------------------------------------
[INFO] [clean:clean {execution: default-clean}]
[INFO] [site:attach-descriptor {execution: default-attach-descriptor}]
[INFO] [install:install {execution: default-install}]
[INFO] Installing <http://hudson.zones.apache.org/hudson/job/Cayenne-trunk/./cayenneTestConnection=derby,jdk=JDK%201.6%20(latest),label=Ubuntu/ws/trunk/pom.xml>
to /home/hudson/.m2/repository/org/apache/cayenne/cayenne-parent/3.1-SNAPSHOT/cayenne-parent-3.1-SNAPSHOT.pom
[INFO] ------------------------------------------------------------------------
[INFO] Building Common Unit Test Utilities
[INFO]    task-segment: [clean, install]
[INFO] ------------------------------------------------------------------------
[INFO] [clean:clean {execution: default-clean}]
[INFO] Deleting directory <http://hudson.zones.apache.org/hudson/job/Cayenne-trunk/./cayenneTestConnection=derby,jdk=JDK%201.6%20(latest),label=Ubuntu/ws/trunk/build-tools/cayenne-test-utilities/target>
[INFO] [resources:resources {execution: default-resources}]
[WARNING] Using platform encoding (UTF-8 actually) to copy filtered resources, i.e. build
is platform dependent!
[INFO] skip non existing resourceDirectory <http://hudson.zones.apache.org/hudson/job/Cayenne-trunk/./cayenneTestConnection=derby,jdk=JDK%201.6%20(latest),label=Ubuntu/ws/trunk/build-tools/cayenne-test-utilities/src/main/resources>
[INFO] [compiler:compile {execution: default-compile}]
[INFO] Compiling 11 source files to <http://hudson.zones.apache.org/hudson/job/Cayenne-trunk/./cayenneTestConnection=derby,jdk=JDK%201.6%20(latest),label=Ubuntu/ws/trunk/build-tools/cayenne-test-utilities/target/classes>
[INFO] [resources:testResources {execution: default-testResources}]
[WARNING] Using platform encoding (UTF-8 actually) to copy filtered resources, i.e. build
is platform dependent!
[INFO] skip non existing resourceDirectory <http://hudson.zones.apache.org/hudson/job/Cayenne-trunk/./cayenneTestConnection=derby,jdk=JDK%201.6%20(latest),label=Ubuntu/ws/trunk/build-tools/cayenne-test-utilities/src/test/resources>
[INFO] [compiler:testCompile {execution: default-testCompile}]
[INFO] No sources to compile
[WARNING] DEPRECATED [systemProperties]: Use systemPropertyVariables instead.
[INFO] [surefire:test {execution: default-test}]
[INFO] No tests to run.
[INFO] [jar:jar {execution: default-jar}]
[INFO] Building jar: <http://hudson.zones.apache.org/hudson/job/Cayenne-trunk/./cayenneTestConnection=derby,jdk=JDK%201.6%20(latest),label=Ubuntu/ws/trunk/build-tools/cayenne-test-utilities/target/cayenne-test-utilities-3.1-SNAPSHOT.jar>
[INFO] [install:install {execution: default-install}]
[INFO] Installing <http://hudson.zones.apache.org/hudson/job/Cayenne-trunk/./cayenneTestConnection=derby,jdk=JDK%201.6%20(latest),label=Ubuntu/ws/trunk/build-tools/cayenne-test-utilities/target/cayenne-test-utilities-3.1-SNAPSHOT.jar>
to /home/hudson/.m2/repository/org/apache/cayenne/build-tools/cayenne-test-utilities/3.1-SNAPSHOT/cayenne-test-utilities-3.1-SNAPSHOT.jar
[INFO] ------------------------------------------------------------------------
[ERROR] BUILD ERROR
[INFO] ------------------------------------------------------------------------
[INFO] Error installing artifact: Failed to copy full contents from <http://hudson.zones.apache.org/hudson/job/Cayenne-trunk/./cayenneTestConnection=derby,jdk=JDK%201.6%20(latest),label=Ubuntu/ws/trunk/build-tools/cayenne-test-utilities/target/cayenne-test-utilities-3.1-SNAPSHOT.jar>
to /home/hudson/.m2/repository/org/apache/cayenne/build-tools/cayenne-test-utilities/3.1-SNAPSHOT/cayenne-test-utilities-3.1-SNAPSHOT.jar

[INFO] ------------------------------------------------------------------------
[INFO] Trace
org.apache.maven.lifecycle.LifecycleExecutionException: Error installing artifact: Failed
to copy full contents from <http://hudson.zones.apache.org/hudson/job/Cayenne-trunk/./cayenneTestConnection=derby,jdk=JDK%201.6%20(latest),label=Ubuntu/ws/trunk/build-tools/cayenne-test-utilities/target/cayenne-test-utilities-3.1-SNAPSHOT.jar>
to /home/hudson/.m2/repository/org/apache/cayenne/build-tools/cayenne-test-utilities/3.1-SNAPSHOT/cayenne-test-utilities-3.1-SNAPSHOT.jar
	at org.apache.maven.lifecycle.DefaultLifecycleExecutor.executeGoals(DefaultLifecycleExecutor.java:719)
	at org.apache.maven.lifecycle.DefaultLifecycleExecutor.executeGoalWithLifecycle(DefaultLifecycleExecutor.java:556)
	at org.apache.maven.lifecycle.DefaultLifecycleExecutor.executeGoal(DefaultLifecycleExecutor.java:535)
	at org.apache.maven.lifecycle.DefaultLifecycleExecutor.executeGoalAndHandleFailures(DefaultLifecycleExecutor.java:387)
	at org.apache.maven.lifecycle.DefaultLifecycleExecutor.executeTaskSegments(DefaultLifecycleExecutor.java:348)
	at org.apache.maven.lifecycle.DefaultLifecycleExecutor.execute(DefaultLifecycleExecutor.java:180)
	at org.apache.maven.DefaultMaven.doExecute(DefaultMaven.java:328)
	at org.apache.maven.DefaultMaven.execute(DefaultMaven.java:138)
	at org.apache.maven.cli.MavenCli.main(MavenCli.java:362)
	at org.apache.maven.cli.compat.CompatibleMain.main(CompatibleMain.java:60)
	at sun.reflect.NativeMethodAccessorImpl.invoke0(Native Method)
	at sun.reflect.NativeMethodAccessorImpl.invoke(NativeMethodAccessorImpl.java:39)
	at sun.reflect.DelegatingMethodAccessorImpl.invoke(DelegatingMethodAccessorImpl.java:25)
	at java.lang.reflect.Method.invoke(Method.java:597)
	at org.codehaus.classworlds.Launcher.launchEnhanced(Launcher.java:315)
	at org.codehaus.classworlds.Launcher.launch(Launcher.java:255)
	at org.codehaus.classworlds.Launcher.mainWithExitCode(Launcher.java:430)
	at org.codehaus.classworlds.Launcher.main(Launcher.java:375)
Caused by: org.apache.maven.plugin.MojoExecutionException: Error installing artifact: Failed
to copy full contents from <http://hudson.zones.apache.org/hudson/job/Cayenne-trunk/./cayenneTestConnection=derby,jdk=JDK%201.6%20(latest),label=Ubuntu/ws/trunk/build-tools/cayenne-test-utilities/target/cayenne-test-utilities-3.1-SNAPSHOT.jar>
to /home/hudson/.m2/repository/org/apache/cayenne/build-tools/cayenne-test-utilities/3.1-SNAPSHOT/cayenne-test-utilities-3.1-SNAPSHOT.jar
	at org.apache.maven.plugin.install.InstallMojo.execute(InstallMojo.java:143)
	at org.apache.maven.plugin.DefaultPluginManager.executeMojo(DefaultPluginManager.java:490)
	at org.apache.maven.lifecycle.DefaultLifecycleExecutor.executeGoals(DefaultLifecycleExecutor.java:694)
	... 17 more
Caused by: org.apache.maven.artifact.installer.ArtifactInstallationException: Error installing
artifact: Failed to copy full contents from <http://hudson.zones.apache.org/hudson/job/Cayenne-trunk/./cayenneTestConnection=derby,jdk=JDK%201.6%20(latest),label=Ubuntu/ws/trunk/build-tools/cayenne-test-utilities/target/cayenne-test-utilities-3.1-SNAPSHOT.jar>
to /home/hudson/.m2/repository/org/apache/cayenne/build-tools/cayenne-test-utilities/3.1-SNAPSHOT/cayenne-test-utilities-3.1-SNAPSHOT.jar
	at org.apache.maven.artifact.installer.DefaultArtifactInstaller.install(DefaultArtifactInstaller.java:119)
	at org.apache.maven.plugin.install.InstallMojo.execute(InstallMojo.java:105)
	... 19 more
Caused by: java.io.IOException: Failed to copy full contents from <http://hudson.zones.apache.org/hudson/job/Cayenne-trunk/./cayenneTestConnection=derby,jdk=JDK%201.6%20(latest),label=Ubuntu/ws/trunk/build-tools/cayenne-test-utilities/target/cayenne-test-utilities-3.1-SNAPSHOT.jar>
to /home/hudson/.m2/repository/org/apache/cayenne/build-tools/cayenne-test-utilities/3.1-SNAPSHOT/cayenne-test-utilities-3.1-SNAPSHOT.jar
	at hidden.org.codehaus.plexus.util.FileUtils.copyFile(FileUtils.java:1018)
	at org.apache.maven.artifact.installer.DefaultArtifactInstaller.install(DefaultArtifactInstaller.java:98)
	... 20 more
[INFO] ------------------------------------------------------------------------
[INFO] Total time: 5 seconds
[INFO] Finished at: Wed Jul 14 11:48:58 UTC 2010
[INFO] Final Memory: 33M/308M
[INFO] ------------------------------------------------------------------------
Recording test results


Mime
View raw message