cayenne-commits mailing list archives

Site index · List index
Message view « Date » · « Thread »
Top « Date » · « Thread »
From Apache Hudson Server <hud...@hudson.zones.apache.org>
Subject Build failed in Hudson: Cayenne-trunk » HSQLDB,JDK 1.5 (latest),Ubuntu #302
Date Mon, 03 May 2010 04:49:14 GMT
See <http://hudson.zones.apache.org/hudson/job/Cayenne-trunk/./cayenneTestConnection=HSQLDB,jdk=JDK%201.5%20(latest),label=Ubuntu/302/changes>

Changes:

[aadamchik] CAY-1414 Remove org.apache.cayenne.conf package

* Removed DefaultConfiguration
* Removed Configuration
* Removed util.WebApplicationResourceLocator (this one seems to be unused since the server
filters were migrated to DI)
* removed everything else from o.a.c.conf with a few things left as deprecated
* switched (almost all) tutorials to DI

[aadamchik] CAY-1425 Remove Configuration sharedConfiguration singleton affecting DataContext
deserialization, CayenneDataObject XML deserialization, DataContext static factory method

[aadamchik] CAY-1414 Remove org.apache.cayenne.conf package

* continuing cleanup
* continuing switching unit tests to the DI approach, including some general refactoring of
tests

[aadamchik] CAY-1420 Migrate ROP server-side components to DI-based stack

* unit tests
* naming refactoring
* changing CayenneFilter/ROPHessianServlet location mapping rules to specify an explicit location
  this will allow path symbols in the location and will avoid unobvious naming conventions

[aadamchik] CayenneRuntime cleanup/improvements:

* removing redundant location property from the Runtime object
* renaming 'newContext' to 'getContext'

[aadamchik] CAY-1420 Migrate ROP server-side components to DI-based stack

[aadamchik] CAY-1424 DI: support for named service injection and flexible map/list binding

* API for adding multiple map/list entries at once
* Fixing binding of empty lists/maps
* fixing binding with mixed @Inject costructor parameter annotations

------------------------------------------
[...truncated 61 lines...]
D         framework/cayenne-jdk1.5-unpublished/src/test/java/org/apache/cayenne/conf/ClasspathResourceFinderTest.java
D         framework/cayenne-jdk1.5-unpublished/src/test/java/org/apache/cayenne/conf/EmptyConfiguration.java
D         framework/cayenne-jdk1.5-unpublished/src/test/java/org/apache/cayenne/conf/ConfigurationTest.java
D         framework/cayenne-jdk1.5-unpublished/src/test/java/org/apache/cayenne/conf/ConfigLoaderCase.java
D         framework/cayenne-jdk1.5-unpublished/src/test/java/org/apache/cayenne/conf/ConfigLoaderTest.java
D         framework/cayenne-jdk1.5-unpublished/src/test/java/org/apache/cayenne/conf/MockDataSourceFactory.java
D         framework/cayenne-jdk1.5-unpublished/src/test/java/org/apache/cayenne/conf/MockDataSourceFactory1.java
D         framework/cayenne-jdk1.5-unpublished/src/test/java/org/apache/cayenne/access/DataContextStaticsTest.java
U         framework/cayenne-jdk1.5-unpublished/src/test/java/org/apache/cayenne/access/DataContextSerializationTest.java
U         framework/cayenne-jdk1.5-unpublished/src/test/java/org/apache/cayenne/access/DataNodeTest.java
U         framework/cayenne-jdk1.5-unpublished/src/test/java/org/apache/cayenne/access/MockDataRowStore.java
U         framework/cayenne-jdk1.5-unpublished/src/test/java/org/apache/cayenne/access/DataContextEJBQLGroupByHavingTest.java
U         framework/cayenne-jdk1.5-unpublished/src/test/java/org/apache/cayenne/access/DataContextEJBQLQueryTest.java
U         framework/cayenne-jdk1.5-unpublished/src/test/java/org/apache/cayenne/access/jdbc/SQLStatementTest.java
U         framework/cayenne-jdk1.5-unpublished/src/test/java/org/apache/cayenne/access/jdbc/SQLTemplateProcessorSelectTest.java
U         framework/cayenne-jdk1.5-unpublished/src/test/java/org/apache/cayenne/access/jdbc/SQLTemplateProcessorTest.java
U         framework/cayenne-jdk1.5-unpublished/src/test/java/org/apache/cayenne/access/jdbc/SQLTemplateProcessorChainTest.java
U         framework/cayenne-jdk1.5-unpublished/src/test/java/org/apache/cayenne/access/jdbc/SQLTemplateResourceManagerTest.java
U         framework/cayenne-jdk1.5-unpublished/src/test/java/org/apache/cayenne/access/DataContextExtrasTest.java
A         framework/cayenne-jdk1.5-unpublished/src/test/java/org/apache/cayenne/MockBaseContext.java
U         framework/cayenne-jdk1.5-unpublished/src/test/java/org/apache/cayenne/remote/hessian/service/HessianServiceTest.java
U         framework/cayenne-jdk1.5-unpublished/src/test/java/org/apache/cayenne/remote/service/BaseRemoteServiceTest.java
A         framework/cayenne-jdk1.5-unpublished/src/test/java/org/apache/cayenne/remote/MockRemoteService.java
D         framework/cayenne-jdk1.5-unpublished/src/test/resources/lightweight-cayenne.xml
A         framework/cayenne-jdk1.5-unpublished/src/test/resources/cayenne-org.apache.cayenne.configuration.rop.server.test-config.xml
D         framework/cayenne-jdk1.5-unpublished/src/test/resources/cay743/cayenne.xml
A         framework/cayenne-jdk1.5-unpublished/src/test/resources/cay743/cayenne-domain.xml
U         framework/cayenne-jdk1.5-unpublished/src/test/resources/cay743/map1.map.xml
U         framework/cayenne-jdk1.5-unpublished/src/test/resources/cay743/map2.map.xml
D         framework/cayenne-jdk1.5-unpublished/src/main/java/org/apache/cayenne/conf/NodeDataSource.java
D         framework/cayenne-jdk1.5-unpublished/src/main/java/org/apache/cayenne/conf/AbstractHandler.java
D         framework/cayenne-jdk1.5-unpublished/src/main/java/org/apache/cayenne/conf/ConfigSaverDelegate.java
D         framework/cayenne-jdk1.5-unpublished/src/main/java/org/apache/cayenne/conf/ClasspathResourceFinder.java
D         framework/cayenne-jdk1.5-unpublished/src/main/java/org/apache/cayenne/conf/DataSourceFactory.java
D         framework/cayenne-jdk1.5-unpublished/src/main/java/org/apache/cayenne/conf/ConfigLoaderDelegate.java
D         framework/cayenne-jdk1.5-unpublished/src/main/java/org/apache/cayenne/conf/Configuration.java
D         framework/cayenne-jdk1.5-unpublished/src/main/java/org/apache/cayenne/conf/ConfigStatus.java
D         framework/cayenne-jdk1.5-unpublished/src/main/java/org/apache/cayenne/conf/ConfigLoader.java
D         framework/cayenne-jdk1.5-unpublished/src/main/java/org/apache/cayenne/conf/DefaultConfiguration.java
D         framework/cayenne-jdk1.5-unpublished/src/main/java/org/apache/cayenne/conf/RuntimeSaveDelegate.java
D         framework/cayenne-jdk1.5-unpublished/src/main/java/org/apache/cayenne/conf/RuntimeLoadDelegate.java
U         framework/cayenne-jdk1.5-unpublished/src/main/java/org/apache/cayenne/conf/ResourceFinder.java
U         framework/cayenne-jdk1.5-unpublished/src/main/java/org/apache/cayenne/resource/ClassLoaderResourceLocator.java
U         framework/cayenne-jdk1.5-unpublished/src/main/java/org/apache/cayenne/BaseContext.java
U         framework/cayenne-jdk1.5-unpublished/src/main/java/org/apache/cayenne/access/DataContext.java
U         framework/cayenne-jdk1.5-unpublished/src/main/java/org/apache/cayenne/access/DataNode.java
A         framework/cayenne-jdk1.5-unpublished/src/main/java/org/apache/cayenne/configuration/rop
A         framework/cayenne-jdk1.5-unpublished/src/main/java/org/apache/cayenne/configuration/rop/server
A         framework/cayenne-jdk1.5-unpublished/src/main/java/org/apache/cayenne/configuration/rop/server/CayenneROPServerModule.java
A         framework/cayenne-jdk1.5-unpublished/src/main/java/org/apache/cayenne/configuration/rop/server/ROPHessianServlet.java
U         framework/cayenne-jdk1.5-unpublished/src/main/java/org/apache/cayenne/configuration/server/CayenneServerRuntime.java
U         framework/cayenne-jdk1.5-unpublished/src/main/java/org/apache/cayenne/configuration/CayenneRuntime.java
U         framework/cayenne-jdk1.5-unpublished/src/main/java/org/apache/cayenne/configuration/web/SessionContextRequestHandler.java
A         framework/cayenne-jdk1.5-unpublished/src/main/java/org/apache/cayenne/configuration/web/WebConfiguration.java
U         framework/cayenne-jdk1.5-unpublished/src/main/java/org/apache/cayenne/configuration/web/CayenneFilter.java
U         framework/cayenne-jdk1.5-unpublished/src/main/java/org/apache/cayenne/configuration/web/WebUtil.java
U         framework/cayenne-jdk1.5-unpublished/src/main/java/org/apache/cayenne/map/MapLoader.java
U         framework/cayenne-jdk1.5-unpublished/src/main/java/org/apache/cayenne/CayenneDataObject.java
U         framework/cayenne-jdk1.5-unpublished/src/main/java/org/apache/cayenne/dba/JdbcAdapter.java
U         framework/cayenne-jdk1.5-unpublished/src/main/java/org/apache/cayenne/remote/hessian/service/HessianServlet.java
U         framework/cayenne-jdk1.5-unpublished/src/main/java/org/apache/cayenne/remote/hessian/service/HessianService.java
U         framework/cayenne-jdk1.5-unpublished/src/main/java/org/apache/cayenne/remote/service/BaseRemoteService.java
U         framework/cayenne-jdk1.5-unpublished/src/main/java/org/apache/cayenne/remote/service/HttpRemoteService.java
D         framework/cayenne-jdk1.5-unpublished/src/main/java/org/apache/cayenne/util/WebApplicationResourceLocator.java
U         framework/cayenne-jdk1.5-unpublished/src/main/java/org/apache/cayenne/util/ZipUtil.java
U         framework/cayenne-jdk1.5-unpublished/src/main/java/org/apache/cayenne/util/ResourceLocator.java
At revision 940361
[trunk] $ /home/hudson/tools/maven/apache-maven-2.2.1/bin/mvn -Dlabel=Ubuntu "-Djdk=JDK 1.5
(latest)" -DcayenneTestConnection=HSQLDB -e clean install
+ Error stacktraces are turned on.
[INFO] Scanning for projects...
[INFO] Reactor build order: 
[INFO]   Cayenne
[INFO]   Common Unit Test Utilities
[INFO]   Cayenne Internal Build Plugin
[INFO]   Cayenne Internal Documentation Build Plugin
[INFO]   Cayenne Build Tools Parent
[INFO]   Cayenne License and Notice Bundle
[INFO]   Cayenne Dependency Injection Container
[INFO]   Cayenne Java 1.5 Unpublished
[INFO]   Cayenne Project
[INFO]   Cayenne WebObjects Compatibility Library
[INFO]   Cayenne Aggregated Server Jar
[INFO]   Cayenne Aggregated Client Jar
[INFO]   Cayenne Tools
[INFO]   Cayenne Modeler
[INFO]   Cayenne Maven Plugin
[INFO]   Cayenne Modeler Maven Plugin
[INFO]   Cayenne Framework Aggregator Project
[INFO]   Cayenne Integration Tests Parent
[INFO]   Integration Tests - Cayenne DI Stack
[INFO]   Cayenne Modeler Java
[INFO]   Cayenne Modeler Parent
[INFO]   Cayenne Tutorial
[INFO]   Cayenne ROP Server Tutorial
[INFO]   Cayenne ROP Client Tutorial
[INFO]   Cayenne Tutorials
[INFO]   Cayenne Documentation
[INFO]   Cayenne Documenation Parent
[INFO] ------------------------------------------------------------------------
[INFO] Building Cayenne
[INFO]    task-segment: [clean, install]
[INFO] ------------------------------------------------------------------------
[INFO] [clean:clean {execution: default-clean}]
[INFO] [site:attach-descriptor {execution: default-attach-descriptor}]
[INFO] [install:install {execution: default-install}]
[INFO] Installing <http://hudson.zones.apache.org/hudson/job/Cayenne-trunk/./cayenneTestConnection=HSQLDB,jdk=JDK%201.5%20(latest),label=Ubuntu/ws/trunk/pom.xml>
to /home/hudson/.m2/repository/org/apache/cayenne/cayenne-parent/3.1-SNAPSHOT/cayenne-parent-3.1-SNAPSHOT.pom
[INFO] ------------------------------------------------------------------------
[INFO] Building Common Unit Test Utilities
[INFO]    task-segment: [clean, install]
[INFO] ------------------------------------------------------------------------
[INFO] [clean:clean {execution: default-clean}]
[INFO] Deleting directory <http://hudson.zones.apache.org/hudson/job/Cayenne-trunk/./cayenneTestConnection=HSQLDB,jdk=JDK%201.5%20(latest),label=Ubuntu/ws/trunk/build-tools/cayenne-test-utilities/target>
[INFO] [resources:resources {execution: default-resources}]
[WARNING] Using platform encoding (UTF-8 actually) to copy filtered resources, i.e. build
is platform dependent!
[INFO] skip non existing resourceDirectory <http://hudson.zones.apache.org/hudson/job/Cayenne-trunk/./cayenneTestConnection=HSQLDB,jdk=JDK%201.5%20(latest),label=Ubuntu/ws/trunk/build-tools/cayenne-test-utilities/src/main/resources>
[INFO] [compiler:compile {execution: default-compile}]
[INFO] Compiling 5 source files to <http://hudson.zones.apache.org/hudson/job/Cayenne-trunk/./cayenneTestConnection=HSQLDB,jdk=JDK%201.5%20(latest),label=Ubuntu/ws/trunk/build-tools/cayenne-test-utilities/target/classes>
[INFO] [resources:testResources {execution: default-testResources}]
[WARNING] Using platform encoding (UTF-8 actually) to copy filtered resources, i.e. build
is platform dependent!
[INFO] skip non existing resourceDirectory <http://hudson.zones.apache.org/hudson/job/Cayenne-trunk/./cayenneTestConnection=HSQLDB,jdk=JDK%201.5%20(latest),label=Ubuntu/ws/trunk/build-tools/cayenne-test-utilities/src/test/resources>
[INFO] [compiler:testCompile {execution: default-testCompile}]
[INFO] No sources to compile
[WARNING] DEPRECATED [systemProperties]: Use systemPropertyVariables instead.
[INFO] [surefire:test {execution: default-test}]
[INFO] No tests to run.
[INFO] [jar:jar {execution: default-jar}]
[INFO] Building jar: <http://hudson.zones.apache.org/hudson/job/Cayenne-trunk/./cayenneTestConnection=HSQLDB,jdk=JDK%201.5%20(latest),label=Ubuntu/ws/trunk/build-tools/cayenne-test-utilities/target/cayenne-test-utilities-3.1-SNAPSHOT.jar>
[INFO] [install:install {execution: default-install}]
[INFO] Installing <http://hudson.zones.apache.org/hudson/job/Cayenne-trunk/./cayenneTestConnection=HSQLDB,jdk=JDK%201.5%20(latest),label=Ubuntu/ws/trunk/build-tools/cayenne-test-utilities/target/cayenne-test-utilities-3.1-SNAPSHOT.jar>
to /home/hudson/.m2/repository/org/apache/cayenne/build-tools/cayenne-test-utilities/3.1-SNAPSHOT/cayenne-test-utilities-3.1-SNAPSHOT.jar
[INFO] ------------------------------------------------------------------------
[INFO] Building Cayenne Internal Build Plugin
[INFO]    task-segment: [clean, install]
[INFO] ------------------------------------------------------------------------
[INFO] [clean:clean {execution: default-clean}]
[INFO] Deleting directory <http://hudson.zones.apache.org/hudson/job/Cayenne-trunk/./cayenneTestConnection=HSQLDB,jdk=JDK%201.5%20(latest),label=Ubuntu/ws/trunk/build-tools/maven-cayenne-build-plugin/target>
[INFO] [plugin:descriptor {execution: default-descriptor}]
[INFO] Using 2 extractors.
[INFO] Applying extractor for language: java
[INFO] Extractor for language: java found 3 mojo descriptors.
[INFO] Applying extractor for language: bsh
[INFO] Extractor for language: bsh found 0 mojo descriptors.
[INFO] [resources:resources {execution: default-resources}]
[WARNING] Using platform encoding (UTF-8 actually) to copy filtered resources, i.e. build
is platform dependent!
[INFO] skip non existing resourceDirectory <http://hudson.zones.apache.org/hudson/job/Cayenne-trunk/./cayenneTestConnection=HSQLDB,jdk=JDK%201.5%20(latest),label=Ubuntu/ws/trunk/build-tools/maven-cayenne-build-plugin/src/main/resources>
[INFO] [compiler:compile {execution: default-compile}]
[INFO] Compiling 6 source files to <http://hudson.zones.apache.org/hudson/job/Cayenne-trunk/./cayenneTestConnection=HSQLDB,jdk=JDK%201.5%20(latest),label=Ubuntu/ws/trunk/build-tools/maven-cayenne-build-plugin/target/classes>
[INFO] [resources:testResources {execution: default-testResources}]
[WARNING] Using platform encoding (UTF-8 actually) to copy filtered resources, i.e. build
is platform dependent!
[INFO] skip non existing resourceDirectory <http://hudson.zones.apache.org/hudson/job/Cayenne-trunk/./cayenneTestConnection=HSQLDB,jdk=JDK%201.5%20(latest),label=Ubuntu/ws/trunk/build-tools/maven-cayenne-build-plugin/src/test/resources>
[INFO] [compiler:testCompile {execution: default-testCompile}]
[INFO] Nothing to compile - all classes are up to date
[WARNING] DEPRECATED [systemProperties]: Use systemPropertyVariables instead.
[INFO] [surefire:test {execution: default-test}]
[INFO] No tests to run.
[INFO] [jar:jar {execution: default-jar}]
[INFO] Building jar: <http://hudson.zones.apache.org/hudson/job/Cayenne-trunk/./cayenneTestConnection=HSQLDB,jdk=JDK%201.5%20(latest),label=Ubuntu/ws/trunk/build-tools/maven-cayenne-build-plugin/target/maven-cayenne-build-plugin-3.1-SNAPSHOT.jar>
[INFO] [plugin:addPluginArtifactMetadata {execution: default-addPluginArtifactMetadata}]
[INFO] [install:install {execution: default-install}]
[INFO] Installing <http://hudson.zones.apache.org/hudson/job/Cayenne-trunk/./cayenneTestConnection=HSQLDB,jdk=JDK%201.5%20(latest),label=Ubuntu/ws/trunk/build-tools/maven-cayenne-build-plugin/target/maven-cayenne-build-plugin-3.1-SNAPSHOT.jar>
to /home/hudson/.m2/repository/org/apache/cayenne/build-tools/maven-cayenne-build-plugin/3.1-SNAPSHOT/maven-cayenne-build-plugin-3.1-SNAPSHOT.jar
[INFO] ------------------------------------------------------------------------
[INFO] Building Cayenne Internal Documentation Build Plugin
[INFO]    task-segment: [clean, install]
[INFO] ------------------------------------------------------------------------
[INFO] [clean:clean {execution: default-clean}]
[INFO] Deleting directory <http://hudson.zones.apache.org/hudson/job/Cayenne-trunk/./cayenneTestConnection=HSQLDB,jdk=JDK%201.5%20(latest),label=Ubuntu/ws/trunk/build-tools/maven-cayenne-doc-plugin/target>
Downloading: http://objectstyle.org/maven2/com/atlassian/confluence/confluence-soap/2.0/confluence-soap-2.0.pom
[INFO] Unable to find resource 'com.atlassian.confluence:confluence-soap:pom:2.0' in repository
objectstyle (http://objectstyle.org/maven2)
Downloading: http://repo1.maven.org/maven2/com/atlassian/confluence/confluence-soap/2.0/confluence-soap-2.0.pom
[INFO] Unable to find resource 'com.atlassian.confluence:confluence-soap:pom:2.0' in repository
central (http://repo1.maven.org/maven2)
[INFO] [plugin:descriptor {execution: default-descriptor}]
[INFO] Using 2 extractors.
[INFO] Applying extractor for language: java
[INFO] Extractor for language: java found 1 mojo descriptors.
[INFO] Applying extractor for language: bsh
[INFO] Extractor for language: bsh found 0 mojo descriptors.
[INFO] [resources:resources {execution: default-resources}]
[WARNING] Using platform encoding (UTF-8 actually) to copy filtered resources, i.e. build
is platform dependent!
[INFO] Copying 1 resource
[INFO] [compiler:compile {execution: default-compile}]
[INFO] Compiling 6 source files to <http://hudson.zones.apache.org/hudson/job/Cayenne-trunk/./cayenneTestConnection=HSQLDB,jdk=JDK%201.5%20(latest),label=Ubuntu/ws/trunk/build-tools/maven-cayenne-doc-plugin/target/classes>
[INFO] [resources:testResources {execution: default-testResources}]
[WARNING] Using platform encoding (UTF-8 actually) to copy filtered resources, i.e. build
is platform dependent!
[INFO] skip non existing resourceDirectory <http://hudson.zones.apache.org/hudson/job/Cayenne-trunk/./cayenneTestConnection=HSQLDB,jdk=JDK%201.5%20(latest),label=Ubuntu/ws/trunk/build-tools/maven-cayenne-doc-plugin/src/test/resources>
[INFO] [compiler:testCompile {execution: default-testCompile}]
[INFO] Compiling 1 source file to <http://hudson.zones.apache.org/hudson/job/Cayenne-trunk/./cayenneTestConnection=HSQLDB,jdk=JDK%201.5%20(latest),label=Ubuntu/ws/trunk/build-tools/maven-cayenne-doc-plugin/target/test-classes>
[WARNING] DEPRECATED [systemProperties]: Use systemPropertyVariables instead.
[INFO] [surefire:test {execution: default-test}]
[INFO] Surefire report directory: <http://hudson.zones.apache.org/hudson/job/Cayenne-trunk/./cayenneTestConnection=HSQLDB,jdk=JDK%201.5%20(latest),label=Ubuntu/ws/trunk/build-tools/maven-cayenne-doc-plugin/target/surefire-reports>

-------------------------------------------------------
 T E S T S
-------------------------------------------------------
Running org.apache.cayenne.maven.plugin.confluence.DocPageTest
Tests run: 5, Failures: 0, Errors: 0, Skipped: 0, Time elapsed: 0.039 sec

Results :

Tests run: 5, Failures: 0, Errors: 0, Skipped: 0

[INFO] [jar:jar {execution: default-jar}]
[INFO] Building jar: <http://hudson.zones.apache.org/hudson/job/Cayenne-trunk/./cayenneTestConnection=HSQLDB,jdk=JDK%201.5%20(latest),label=Ubuntu/ws/trunk/build-tools/maven-cayenne-doc-plugin/target/maven-cayenne-doc-plugin-3.1-SNAPSHOT.jar>
[INFO] [plugin:addPluginArtifactMetadata {execution: default-addPluginArtifactMetadata}]
[INFO] [install:install {execution: default-install}]
[INFO] Installing <http://hudson.zones.apache.org/hudson/job/Cayenne-trunk/./cayenneTestConnection=HSQLDB,jdk=JDK%201.5%20(latest),label=Ubuntu/ws/trunk/build-tools/maven-cayenne-doc-plugin/target/maven-cayenne-doc-plugin-3.1-SNAPSHOT.jar>
to /home/hudson/.m2/repository/org/apache/cayenne/build-tools/maven-cayenne-doc-plugin/3.1-SNAPSHOT/maven-cayenne-doc-plugin-3.1-SNAPSHOT.jar
[INFO] ------------------------------------------------------------------------
[ERROR] BUILD ERROR
[INFO] ------------------------------------------------------------------------
[INFO] Error installing artifact: Failed to copy full contents from <http://hudson.zones.apache.org/hudson/job/Cayenne-trunk/./cayenneTestConnection=HSQLDB,jdk=JDK%201.5%20(latest),label=Ubuntu/ws/trunk/build-tools/maven-cayenne-doc-plugin/target/maven-cayenne-doc-plugin-3.1-SNAPSHOT.jar>
to /home/hudson/.m2/repository/org/apache/cayenne/build-tools/maven-cayenne-doc-plugin/3.1-SNAPSHOT/maven-cayenne-doc-plugin-3.1-SNAPSHOT.jar

[INFO] ------------------------------------------------------------------------
[INFO] Trace
org.apache.maven.lifecycle.LifecycleExecutionException: Error installing artifact: Failed
to copy full contents from <http://hudson.zones.apache.org/hudson/job/Cayenne-trunk/./cayenneTestConnection=HSQLDB,jdk=JDK%201.5%20(latest),label=Ubuntu/ws/trunk/build-tools/maven-cayenne-doc-plugin/target/maven-cayenne-doc-plugin-3.1-SNAPSHOT.jar>
to /home/hudson/.m2/repository/org/apache/cayenne/build-tools/maven-cayenne-doc-plugin/3.1-SNAPSHOT/maven-cayenne-doc-plugin-3.1-SNAPSHOT.jar
	at org.apache.maven.lifecycle.DefaultLifecycleExecutor.executeGoals(DefaultLifecycleExecutor.java:719)
	at org.apache.maven.lifecycle.DefaultLifecycleExecutor.executeGoalWithLifecycle(DefaultLifecycleExecutor.java:556)
	at org.apache.maven.lifecycle.DefaultLifecycleExecutor.executeGoal(DefaultLifecycleExecutor.java:535)
	at org.apache.maven.lifecycle.DefaultLifecycleExecutor.executeGoalAndHandleFailures(DefaultLifecycleExecutor.java:387)
	at org.apache.maven.lifecycle.DefaultLifecycleExecutor.executeTaskSegments(DefaultLifecycleExecutor.java:348)
	at org.apache.maven.lifecycle.DefaultLifecycleExecutor.execute(DefaultLifecycleExecutor.java:180)
	at org.apache.maven.DefaultMaven.doExecute(DefaultMaven.java:328)
	at org.apache.maven.DefaultMaven.execute(DefaultMaven.java:138)
	at org.apache.maven.cli.MavenCli.main(MavenCli.java:362)
	at org.apache.maven.cli.compat.CompatibleMain.main(CompatibleMain.java:60)
	at sun.reflect.NativeMethodAccessorImpl.invoke0(Native Method)
	at sun.reflect.NativeMethodAccessorImpl.invoke(NativeMethodAccessorImpl.java:39)
	at sun.reflect.DelegatingMethodAccessorImpl.invoke(DelegatingMethodAccessorImpl.java:25)
	at java.lang.reflect.Method.invoke(Method.java:592)
	at org.codehaus.classworlds.Launcher.launchEnhanced(Launcher.java:315)
	at org.codehaus.classworlds.Launcher.launch(Launcher.java:255)
	at org.codehaus.classworlds.Launcher.mainWithExitCode(Launcher.java:430)
	at org.codehaus.classworlds.Launcher.main(Launcher.java:375)
Caused by: org.apache.maven.plugin.MojoExecutionException: Error installing artifact: Failed
to copy full contents from <http://hudson.zones.apache.org/hudson/job/Cayenne-trunk/./cayenneTestConnection=HSQLDB,jdk=JDK%201.5%20(latest),label=Ubuntu/ws/trunk/build-tools/maven-cayenne-doc-plugin/target/maven-cayenne-doc-plugin-3.1-SNAPSHOT.jar>
to /home/hudson/.m2/repository/org/apache/cayenne/build-tools/maven-cayenne-doc-plugin/3.1-SNAPSHOT/maven-cayenne-doc-plugin-3.1-SNAPSHOT.jar
	at org.apache.maven.plugin.install.InstallMojo.execute(InstallMojo.java:143)
	at org.apache.maven.plugin.DefaultPluginManager.executeMojo(DefaultPluginManager.java:490)
	at org.apache.maven.lifecycle.DefaultLifecycleExecutor.executeGoals(DefaultLifecycleExecutor.java:694)
	... 17 more
Caused by: org.apache.maven.artifact.installer.ArtifactInstallationException: Error installing
artifact: Failed to copy full contents from <http://hudson.zones.apache.org/hudson/job/Cayenne-trunk/./cayenneTestConnection=HSQLDB,jdk=JDK%201.5%20(latest),label=Ubuntu/ws/trunk/build-tools/maven-cayenne-doc-plugin/target/maven-cayenne-doc-plugin-3.1-SNAPSHOT.jar>
to /home/hudson/.m2/repository/org/apache/cayenne/build-tools/maven-cayenne-doc-plugin/3.1-SNAPSHOT/maven-cayenne-doc-plugin-3.1-SNAPSHOT.jar
	at org.apache.maven.artifact.installer.DefaultArtifactInstaller.install(DefaultArtifactInstaller.java:119)
	at org.apache.maven.plugin.install.InstallMojo.execute(InstallMojo.java:105)
	... 19 more
Caused by: java.io.IOException: Failed to copy full contents from <http://hudson.zones.apache.org/hudson/job/Cayenne-trunk/./cayenneTestConnection=HSQLDB,jdk=JDK%201.5%20(latest),label=Ubuntu/ws/trunk/build-tools/maven-cayenne-doc-plugin/target/maven-cayenne-doc-plugin-3.1-SNAPSHOT.jar>
to /home/hudson/.m2/repository/org/apache/cayenne/build-tools/maven-cayenne-doc-plugin/3.1-SNAPSHOT/maven-cayenne-doc-plugin-3.1-SNAPSHOT.jar
	at hidden.org.codehaus.plexus.util.FileUtils.copyFile(FileUtils.java:1018)
	at org.apache.maven.artifact.installer.DefaultArtifactInstaller.install(DefaultArtifactInstaller.java:98)
	... 20 more
[INFO] ------------------------------------------------------------------------
[INFO] Total time: 9 seconds
[INFO] Finished at: Mon May 03 04:49:00 UTC 2010
[INFO] Final Memory: 32M/213M
[INFO] ------------------------------------------------------------------------
Recording test results


Mime
View raw message