cayenne-commits mailing list archives

Site index · List index
Message view « Date » · « Thread »
Top « Date » · « Thread »
From Apache Hudson Server <hud...@hudson.zones.apache.org>
Subject Build failed in Hudson: Cayenne-trunk » HSQLDB,JDK 1.6 (latest),Ubuntu #294
Date Sun, 25 Apr 2010 14:47:58 GMT
See <http://hudson.zones.apache.org/hudson/job/Cayenne-trunk/./cayenneTestConnection=HSQLDB,jdk=JDK%201.6%20(latest),label=Ubuntu/294/changes>

Changes:

[amaniatis] Slight improvements to the documentation of pagination.

------------------------------------------
[...truncated 74464 lines...]

Results :

Tests run: 40, Failures: 0, Errors: 0, Skipped: 0

[INFO] [jar:jar {execution: default-jar}]
[INFO] Building jar: <http://hudson.zones.apache.org/hudson/job/Cayenne-trunk/./cayenneTestConnection=HSQLDB,jdk=JDK%201.6%20(latest),label=Ubuntu/ws/trunk/framework/cayenne-modeler/target/cayenne-modeler-3.1-SNAPSHOT.jar>
[INFO] Preparing source:jar
[WARNING] Removing: jar from forked lifecycle, to prevent recursive invocation.
[INFO] No goals needed for project - skipping
[INFO] [source:jar {execution: bundle-source-jar}]
[INFO] Building jar: <http://hudson.zones.apache.org/hudson/job/Cayenne-trunk/./cayenneTestConnection=HSQLDB,jdk=JDK%201.6%20(latest),label=Ubuntu/ws/trunk/framework/cayenne-modeler/target/cayenne-modeler-3.1-SNAPSHOT-sources.jar>
[INFO] [install:install {execution: default-install}]
[INFO] Installing <http://hudson.zones.apache.org/hudson/job/Cayenne-trunk/./cayenneTestConnection=HSQLDB,jdk=JDK%201.6%20(latest),label=Ubuntu/ws/trunk/framework/cayenne-modeler/target/cayenne-modeler-3.1-SNAPSHOT.jar>
to /home/hudson/.m2/repository/org/apache/cayenne/cayenne-modeler/3.1-SNAPSHOT/cayenne-modeler-3.1-SNAPSHOT.jar
[INFO] Installing <http://hudson.zones.apache.org/hudson/job/Cayenne-trunk/./cayenneTestConnection=HSQLDB,jdk=JDK%201.6%20(latest),label=Ubuntu/ws/trunk/framework/cayenne-modeler/target/cayenne-modeler-3.1-SNAPSHOT-sources.jar>
to /home/hudson/.m2/repository/org/apache/cayenne/cayenne-modeler/3.1-SNAPSHOT/cayenne-modeler-3.1-SNAPSHOT-sources.jar
[INFO] ------------------------------------------------------------------------
[INFO] Building Cayenne Maven Plugin
[INFO]    task-segment: [clean, install]
[INFO] ------------------------------------------------------------------------
[INFO] [clean:clean {execution: default-clean}]
[INFO] Deleting directory <http://hudson.zones.apache.org/hudson/job/Cayenne-trunk/./cayenneTestConnection=HSQLDB,jdk=JDK%201.6%20(latest),label=Ubuntu/ws/trunk/framework/maven-cayenne-plugin/target>
[INFO] [plugin:descriptor {execution: default-descriptor}]
[INFO] Using 2 extractors.
[INFO] Applying extractor for language: java
[INFO] Extractor for language: java found 3 mojo descriptors.
[INFO] Applying extractor for language: bsh
[INFO] Extractor for language: bsh found 0 mojo descriptors.
[INFO] [resources:resources {execution: default-resources}]
[WARNING] Using platform encoding (UTF-8 actually) to copy filtered resources, i.e. build
is platform dependent!
[INFO] skip non existing resourceDirectory <http://hudson.zones.apache.org/hudson/job/Cayenne-trunk/./cayenneTestConnection=HSQLDB,jdk=JDK%201.6%20(latest),label=Ubuntu/ws/trunk/framework/maven-cayenne-plugin/src/main/resources>
[INFO] [compiler:compile {execution: default-compile}]
[INFO] Compiling 4 source files to <http://hudson.zones.apache.org/hudson/job/Cayenne-trunk/./cayenneTestConnection=HSQLDB,jdk=JDK%201.6%20(latest),label=Ubuntu/ws/trunk/framework/maven-cayenne-plugin/target/classes>
[INFO] [resources:testResources {execution: default-testResources}]
[WARNING] Using platform encoding (UTF-8 actually) to copy filtered resources, i.e. build
is platform dependent!
[INFO] skip non existing resourceDirectory <http://hudson.zones.apache.org/hudson/job/Cayenne-trunk/./cayenneTestConnection=HSQLDB,jdk=JDK%201.6%20(latest),label=Ubuntu/ws/trunk/framework/maven-cayenne-plugin/src/test/resources>
[INFO] [compiler:testCompile {execution: default-testCompile}]
[INFO] No sources to compile
[WARNING] DEPRECATED [systemProperties]: Use systemPropertyVariables instead.
[INFO] [surefire:test {execution: default-test}]
[INFO] No tests to run.
[INFO] [jar:jar {execution: default-jar}]
[INFO] Building jar: <http://hudson.zones.apache.org/hudson/job/Cayenne-trunk/./cayenneTestConnection=HSQLDB,jdk=JDK%201.6%20(latest),label=Ubuntu/ws/trunk/framework/maven-cayenne-plugin/target/maven-cayenne-plugin-3.1-SNAPSHOT.jar>
[INFO] [plugin:addPluginArtifactMetadata {execution: default-addPluginArtifactMetadata}]
[INFO] [install:install {execution: default-install}]
[INFO] Installing <http://hudson.zones.apache.org/hudson/job/Cayenne-trunk/./cayenneTestConnection=HSQLDB,jdk=JDK%201.6%20(latest),label=Ubuntu/ws/trunk/framework/maven-cayenne-plugin/target/maven-cayenne-plugin-3.1-SNAPSHOT.jar>
to /home/hudson/.m2/repository/org/apache/cayenne/plugins/maven-cayenne-plugin/3.1-SNAPSHOT/maven-cayenne-plugin-3.1-SNAPSHOT.jar
[INFO] ------------------------------------------------------------------------
[INFO] Building Cayenne Modeler Maven Plugin
[INFO]    task-segment: [clean, install]
[INFO] ------------------------------------------------------------------------
[INFO] [clean:clean {execution: default-clean}]
[INFO] Deleting directory <http://hudson.zones.apache.org/hudson/job/Cayenne-trunk/./cayenneTestConnection=HSQLDB,jdk=JDK%201.6%20(latest),label=Ubuntu/ws/trunk/framework/maven-cayenne-modeler-plugin/target>
[INFO] [plugin:descriptor {execution: default-descriptor}]
[INFO] Using 2 extractors.
[INFO] Applying extractor for language: java
[INFO] Extractor for language: java found 1 mojo descriptors.
[INFO] Applying extractor for language: bsh
[INFO] Extractor for language: bsh found 0 mojo descriptors.
[INFO] [resources:resources {execution: default-resources}]
[WARNING] Using platform encoding (UTF-8 actually) to copy filtered resources, i.e. build
is platform dependent!
[INFO] skip non existing resourceDirectory <http://hudson.zones.apache.org/hudson/job/Cayenne-trunk/./cayenneTestConnection=HSQLDB,jdk=JDK%201.6%20(latest),label=Ubuntu/ws/trunk/framework/maven-cayenne-modeler-plugin/src/main/resources>
[INFO] [compiler:compile {execution: default-compile}]
[INFO] Compiling 1 source file to <http://hudson.zones.apache.org/hudson/job/Cayenne-trunk/./cayenneTestConnection=HSQLDB,jdk=JDK%201.6%20(latest),label=Ubuntu/ws/trunk/framework/maven-cayenne-modeler-plugin/target/classes>
[INFO] [resources:testResources {execution: default-testResources}]
[WARNING] Using platform encoding (UTF-8 actually) to copy filtered resources, i.e. build
is platform dependent!
[INFO] skip non existing resourceDirectory <http://hudson.zones.apache.org/hudson/job/Cayenne-trunk/./cayenneTestConnection=HSQLDB,jdk=JDK%201.6%20(latest),label=Ubuntu/ws/trunk/framework/maven-cayenne-modeler-plugin/src/test/resources>
[INFO] [compiler:testCompile {execution: default-testCompile}]
[INFO] No sources to compile
[WARNING] DEPRECATED [systemProperties]: Use systemPropertyVariables instead.
[INFO] [surefire:test {execution: default-test}]
[INFO] No tests to run.
[INFO] [jar:jar {execution: default-jar}]
[INFO] Building jar: <http://hudson.zones.apache.org/hudson/job/Cayenne-trunk/./cayenneTestConnection=HSQLDB,jdk=JDK%201.6%20(latest),label=Ubuntu/ws/trunk/framework/maven-cayenne-modeler-plugin/target/maven-cayenne-modeler-plugin-3.1-SNAPSHOT.jar>
[INFO] [plugin:addPluginArtifactMetadata {execution: default-addPluginArtifactMetadata}]
[INFO] [install:install {execution: default-install}]
[INFO] Installing <http://hudson.zones.apache.org/hudson/job/Cayenne-trunk/./cayenneTestConnection=HSQLDB,jdk=JDK%201.6%20(latest),label=Ubuntu/ws/trunk/framework/maven-cayenne-modeler-plugin/target/maven-cayenne-modeler-plugin-3.1-SNAPSHOT.jar>
to /home/hudson/.m2/repository/org/apache/cayenne/plugins/maven-cayenne-modeler-plugin/3.1-SNAPSHOT/maven-cayenne-modeler-plugin-3.1-SNAPSHOT.jar
[INFO] ------------------------------------------------------------------------
[INFO] Building Cayenne Framework Aggregator Project
[INFO]    task-segment: [clean, install]
[INFO] ------------------------------------------------------------------------
[INFO] [clean:clean {execution: default-clean}]
[INFO] [site:attach-descriptor {execution: default-attach-descriptor}]
[INFO] [install:install {execution: default-install}]
[INFO] Installing <http://hudson.zones.apache.org/hudson/job/Cayenne-trunk/./cayenneTestConnection=HSQLDB,jdk=JDK%201.6%20(latest),label=Ubuntu/ws/trunk/framework/pom.xml>
to /home/hudson/.m2/repository/org/apache/cayenne/parents/cayenne-framework-parent/3.1-SNAPSHOT/cayenne-framework-parent-3.1-SNAPSHOT.pom
[INFO] ------------------------------------------------------------------------
[INFO] Building Cayenne Integration Tests Parent
[INFO]    task-segment: [clean, install]
[INFO] ------------------------------------------------------------------------
[INFO] [clean:clean {execution: default-clean}]
[INFO] [site:attach-descriptor {execution: default-attach-descriptor}]
[INFO] [install:install {execution: default-install}]
[INFO] Installing <http://hudson.zones.apache.org/hudson/job/Cayenne-trunk/./cayenneTestConnection=HSQLDB,jdk=JDK%201.6%20(latest),label=Ubuntu/ws/trunk/itests/pom.xml>
to /home/hudson/.m2/repository/org/apache/cayenne/itests/cayenne-itests-parent/3.1-SNAPSHOT/cayenne-itests-parent-3.1-SNAPSHOT.pom
[INFO] ------------------------------------------------------------------------
[INFO] Building Integration Tests - Cayenne DI Stack
[INFO]    task-segment: [clean, install]
[INFO] ------------------------------------------------------------------------
[INFO] [clean:clean {execution: default-clean}]
[INFO] Deleting directory <http://hudson.zones.apache.org/hudson/job/Cayenne-trunk/./cayenneTestConnection=HSQLDB,jdk=JDK%201.6%20(latest),label=Ubuntu/ws/trunk/itests/cayenne-di-stack/target>
[INFO] [resources:resources {execution: default-resources}]
[WARNING] Using platform encoding (UTF-8 actually) to copy filtered resources, i.e. build
is platform dependent!
[INFO] Copying 3 resources
[INFO] [compiler:compile {execution: default-compile}]
[INFO] Compiling 6 source files to <http://hudson.zones.apache.org/hudson/job/Cayenne-trunk/./cayenneTestConnection=HSQLDB,jdk=JDK%201.6%20(latest),label=Ubuntu/ws/trunk/itests/cayenne-di-stack/target/classes>
[INFO] [resources:testResources {execution: default-testResources}]
[WARNING] Using platform encoding (UTF-8 actually) to copy filtered resources, i.e. build
is platform dependent!
[INFO] skip non existing resourceDirectory <http://hudson.zones.apache.org/hudson/job/Cayenne-trunk/./cayenneTestConnection=HSQLDB,jdk=JDK%201.6%20(latest),label=Ubuntu/ws/trunk/itests/cayenne-di-stack/src/test/resources>
[INFO] [compiler:testCompile {execution: default-testCompile}]
[INFO] Compiling 1 source file to <http://hudson.zones.apache.org/hudson/job/Cayenne-trunk/./cayenneTestConnection=HSQLDB,jdk=JDK%201.6%20(latest),label=Ubuntu/ws/trunk/itests/cayenne-di-stack/target/test-classes>
[WARNING] DEPRECATED [systemProperties]: Use systemPropertyVariables instead.
[INFO] [surefire:test {execution: default-test}]
[INFO] Surefire report directory: <http://hudson.zones.apache.org/hudson/job/Cayenne-trunk/./cayenneTestConnection=HSQLDB,jdk=JDK%201.6%20(latest),label=Ubuntu/ws/trunk/itests/cayenne-di-stack/target/surefire-reports>

-------------------------------------------------------
 T E S T S
-------------------------------------------------------
Running org.apache.cayenne.runtime.CayenneServerRuntimeIntegrationTest
Apr 25, 2010 2:47:48 PM org.apache.cayenne.configuration.XMLDataChannelDescriptorLoader$DataSourceChildrenHandler
createChildTagHandler
INFO: loading user name and password.
Apr 25, 2010 2:47:48 PM org.apache.cayenne.access.QueryLogger logPoolCreated
INFO: Created connection pool: jdbc:hsqldb:mem:DEFAULT
	Driver class: org.hsqldb.jdbcDriver
	Min. connections in the pool: 1
	Max. connections in the pool: 1
Apr 25, 2010 2:47:48 PM org.apache.cayenne.access.QueryLogger logConnect
INFO: Opening connection: jdbc:hsqldb:mem:DEFAULT
	Login: null
	Password: *******
Apr 25, 2010 2:47:48 PM org.apache.cayenne.access.QueryLogger logConnectSuccess
INFO: +++ Connecting: SUCCESS.
Apr 25, 2010 2:47:48 PM org.apache.cayenne.access.QueryLogger log
INFO: Detected and installed adapter: org.apache.cayenne.dba.hsqldb.HSQLDBAdapter
Apr 25, 2010 2:47:48 PM org.apache.cayenne.access.dbsync.CreateIfNoSchemaStrategy processSchemaUpdate
INFO: No schema detected, will create mapped tables
Apr 25, 2010 2:47:48 PM org.apache.cayenne.access.QueryLogger logQuery
INFO: CREATE CACHED TABLE TABLE1 (ID BIGINT NOT NULL, NAME VARCHAR(255) NULL, PRIMARY KEY
(ID))
Apr 25, 2010 2:47:48 PM org.apache.cayenne.access.QueryLogger logQuery
INFO: CREATE TABLE AUTO_PK_SUPPORT (  TABLE_NAME CHAR(100) NOT NULL,  NEXT_ID BIGINT NOT NULL,
 PRIMARY KEY(TABLE_NAME))
Apr 25, 2010 2:47:48 PM org.apache.cayenne.access.QueryLogger logQuery
INFO: DELETE FROM AUTO_PK_SUPPORT WHERE TABLE_NAME IN ('TABLE1')
Apr 25, 2010 2:47:48 PM org.apache.cayenne.access.QueryLogger logQuery
INFO: INSERT INTO AUTO_PK_SUPPORT (TABLE_NAME, NEXT_ID) VALUES ('TABLE1', 200)
Apr 25, 2010 2:47:48 PM org.apache.cayenne.configuration.XMLDataChannelDescriptorLoader$DataSourceChildrenHandler
createChildTagHandler
INFO: loading user name and password.
Apr 25, 2010 2:47:48 PM org.apache.cayenne.access.QueryLogger logPoolCreated
INFO: Created connection pool: jdbc:hsqldb:mem:DEFAULT
	Driver class: org.hsqldb.jdbcDriver
	Min. connections in the pool: 1
	Max. connections in the pool: 1
Apr 25, 2010 2:47:48 PM org.apache.cayenne.access.QueryLogger logConnect
INFO: Opening connection: jdbc:hsqldb:mem:DEFAULT
	Login: null
	Password: *******
Apr 25, 2010 2:47:48 PM org.apache.cayenne.access.QueryLogger logConnectSuccess
INFO: +++ Connecting: SUCCESS.
Apr 25, 2010 2:47:48 PM org.apache.cayenne.access.QueryLogger log
INFO: Detected and installed adapter: org.apache.cayenne.dba.hsqldb.HSQLDBAdapter
Apr 25, 2010 2:47:48 PM org.apache.cayenne.access.dbsync.CreateIfNoSchemaStrategy processSchemaUpdate
INFO: Full or partial schema detected, skipping tables creation
Apr 25, 2010 2:47:48 PM org.apache.cayenne.configuration.XMLDataChannelDescriptorLoader$DataSourceChildrenHandler
createChildTagHandler
INFO: loading user name and password.
Apr 25, 2010 2:47:48 PM org.apache.cayenne.access.QueryLogger logPoolCreated
INFO: Created connection pool: jdbc:hsqldb:mem:DEFAULT
	Driver class: org.hsqldb.jdbcDriver
	Min. connections in the pool: 1
	Max. connections in the pool: 1
Apr 25, 2010 2:47:48 PM org.apache.cayenne.access.QueryLogger logConnect
INFO: Opening connection: jdbc:hsqldb:mem:DEFAULT
	Login: null
	Password: *******
Apr 25, 2010 2:47:48 PM org.apache.cayenne.access.QueryLogger logConnectSuccess
INFO: +++ Connecting: SUCCESS.
Apr 25, 2010 2:47:48 PM org.apache.cayenne.access.QueryLogger log
INFO: Detected and installed adapter: org.apache.cayenne.dba.hsqldb.HSQLDBAdapter
Apr 25, 2010 2:47:48 PM org.apache.cayenne.access.dbsync.CreateIfNoSchemaStrategy processSchemaUpdate
INFO: Full or partial schema detected, skipping tables creation
Apr 25, 2010 2:47:48 PM org.apache.cayenne.access.QueryLogger logQueryStart
INFO: --- will run 1 query.
Apr 25, 2010 2:47:48 PM org.apache.cayenne.access.QueryLogger logBeginTransaction
INFO: --- transaction started.
Apr 25, 2010 2:47:48 PM org.apache.cayenne.access.QueryLogger logQuery
INFO: SELECT t0.NAME, t0.ID FROM TABLE1 t0 - prepared in 24 ms.
Apr 25, 2010 2:47:48 PM org.apache.cayenne.access.QueryLogger logSelectCount
INFO: === returned 1 row. - took 33 ms.
Apr 25, 2010 2:47:48 PM org.apache.cayenne.access.QueryLogger logCommitTransaction
INFO: +++ transaction committed.
Apr 25, 2010 2:47:48 PM org.apache.cayenne.access.QueryLogger logQueryStart
INFO: --- will run 1 query.
Apr 25, 2010 2:47:48 PM org.apache.cayenne.access.QueryLogger logBeginTransaction
INFO: --- transaction started.
Apr 25, 2010 2:47:48 PM org.apache.cayenne.access.QueryLogger logQuery
INFO: SELECT t0.NAME, t0.ID FROM TABLE1 t0
Apr 25, 2010 2:47:48 PM org.apache.cayenne.access.QueryLogger logSelectCount
INFO: === returned 1 row. - took 1 ms.
Apr 25, 2010 2:47:48 PM org.apache.cayenne.access.QueryLogger logCommitTransaction
INFO: +++ transaction committed.
Tests run: 3, Failures: 0, Errors: 0, Skipped: 0, Time elapsed: 0.797 sec

Results :

Tests run: 3, Failures: 0, Errors: 0, Skipped: 0

[INFO] [jar:jar {execution: default-jar}]
[INFO] Building jar: <http://hudson.zones.apache.org/hudson/job/Cayenne-trunk/./cayenneTestConnection=HSQLDB,jdk=JDK%201.6%20(latest),label=Ubuntu/ws/trunk/itests/cayenne-di-stack/target/cayenne-di-stack-3.1-SNAPSHOT.jar>
[INFO] [install:install {execution: default-install}]
[INFO] Installing <http://hudson.zones.apache.org/hudson/job/Cayenne-trunk/./cayenneTestConnection=HSQLDB,jdk=JDK%201.6%20(latest),label=Ubuntu/ws/trunk/itests/cayenne-di-stack/target/cayenne-di-stack-3.1-SNAPSHOT.jar>
to /home/hudson/.m2/repository/org/apache/cayenne/itests/cayenne-di-stack/3.1-SNAPSHOT/cayenne-di-stack-3.1-SNAPSHOT.jar
[INFO] ------------------------------------------------------------------------
[INFO] Building Cayenne Modeler Java
[INFO]    task-segment: [clean, install]
[INFO] ------------------------------------------------------------------------
[INFO] artifact org.objectstyle.woproject.maven2:maven-japplication-plugin: checking for updates
from webobjects.mdimension.com/plugin/releases
[INFO] artifact org.objectstyle.woproject.maven2:maven-japplication-plugin: checking for updates
from Maven Central Repo
[INFO] ------------------------------------------------------------------------
[ERROR] BUILD ERROR
[INFO] ------------------------------------------------------------------------
[INFO] The plugin 'org.objectstyle.woproject.maven2:maven-japplication-plugin' does not exist
or no valid version could be found
[INFO] ------------------------------------------------------------------------
[INFO] Trace
org.apache.maven.lifecycle.LifecycleExecutionException: The plugin 'org.objectstyle.woproject.maven2:maven-japplication-plugin'
does not exist or no valid version could be found
	at org.apache.maven.lifecycle.DefaultLifecycleExecutor.verifyPlugin(DefaultLifecycleExecutor.java:1569)
	at org.apache.maven.lifecycle.DefaultLifecycleExecutor.bindPluginToLifecycle(DefaultLifecycleExecutor.java:1503)
	at org.apache.maven.lifecycle.DefaultLifecycleExecutor.constructLifecycleMappings(DefaultLifecycleExecutor.java:1282)
	at org.apache.maven.lifecycle.DefaultLifecycleExecutor.executeGoal(DefaultLifecycleExecutor.java:534)
	at org.apache.maven.lifecycle.DefaultLifecycleExecutor.executeGoalAndHandleFailures(DefaultLifecycleExecutor.java:387)
	at org.apache.maven.lifecycle.DefaultLifecycleExecutor.executeTaskSegments(DefaultLifecycleExecutor.java:348)
	at org.apache.maven.lifecycle.DefaultLifecycleExecutor.execute(DefaultLifecycleExecutor.java:180)
	at org.apache.maven.DefaultMaven.doExecute(DefaultMaven.java:328)
	at org.apache.maven.DefaultMaven.execute(DefaultMaven.java:138)
	at org.apache.maven.cli.MavenCli.main(MavenCli.java:362)
	at org.apache.maven.cli.compat.CompatibleMain.main(CompatibleMain.java:60)
	at sun.reflect.NativeMethodAccessorImpl.invoke0(Native Method)
	at sun.reflect.NativeMethodAccessorImpl.invoke(NativeMethodAccessorImpl.java:39)
	at sun.reflect.DelegatingMethodAccessorImpl.invoke(DelegatingMethodAccessorImpl.java:25)
	at java.lang.reflect.Method.invoke(Method.java:597)
	at org.codehaus.classworlds.Launcher.launchEnhanced(Launcher.java:315)
	at org.codehaus.classworlds.Launcher.launch(Launcher.java:255)
	at org.codehaus.classworlds.Launcher.mainWithExitCode(Launcher.java:430)
	at org.codehaus.classworlds.Launcher.main(Launcher.java:375)
Caused by: org.apache.maven.plugin.version.PluginVersionNotFoundException: The plugin 'org.objectstyle.woproject.maven2:maven-japplication-plugin'
does not exist or no valid version could be found
	at org.apache.maven.plugin.version.DefaultPluginVersionManager.resolvePluginVersion(DefaultPluginVersionManager.java:229)
	at org.apache.maven.plugin.version.DefaultPluginVersionManager.resolvePluginVersion(DefaultPluginVersionManager.java:91)
	at org.apache.maven.plugin.DefaultPluginManager.verifyPlugin(DefaultPluginManager.java:179)
	at org.apache.maven.plugin.DefaultPluginManager.loadPluginDescriptor(DefaultPluginManager.java:1642)
	at org.apache.maven.lifecycle.DefaultLifecycleExecutor.verifyPlugin(DefaultLifecycleExecutor.java:1540)
	... 18 more
[INFO] ------------------------------------------------------------------------
[INFO] Total time: 2 minutes 2 seconds
[INFO] Finished at: Sun Apr 25 14:47:49 UTC 2010
[INFO] Final Memory: 110M/240M
[INFO] ------------------------------------------------------------------------
Recording test results


Mime
View raw message