cayenne-commits mailing list archives

Site index · List index
Message view « Date » · « Thread »
Top « Date » · « Thread »
From Apache Hudson Server <hud...@hudson.zones.apache.org>
Subject Build failed in Hudson: Cayenne-trunk » HSQLDB,JDK 1.5 (latest),Ubuntu #163
Date Sun, 10 Jan 2010 18:50:29 GMT
See <http://hudson.zones.apache.org/hudson/job/Cayenne-trunk/./cayenneTestConnection=HSQLDB,jdk=JDK%201.5%20(latest),label=Ubuntu/163/changes>

Changes:

[andrey] test for cay-1313

------------------------------------------
[...truncated 71891 lines...]
INFO: +++ transaction committed.
Jan 10, 2010 6:51:53 PM org.apache.cayenne.access.QueryLogger logQueryStart
INFO: --- will run 1 query.
Jan 10, 2010 6:51:53 PM org.apache.cayenne.access.QueryLogger logBeginTransaction
INFO: --- transaction started.
Jan 10, 2010 6:51:53 PM org.apache.cayenne.access.QueryLogger logQuery
INFO: SELECT t0.ARTIST_NAME, t0.ARTIST_ID, t0.DATE_OF_BIRTH FROM ARTIST t0 WHERE t0.ARTIST_NAME
= ? [bind: 1->ARTIST_NAME:'A1'] - prepared in 23 ms.
Jan 10, 2010 6:51:53 PM org.apache.cayenne.access.QueryLogger logSelectCount
INFO: === returned 1 row. - took 31 ms.
Jan 10, 2010 6:51:53 PM org.apache.cayenne.access.QueryLogger logCommitTransaction
INFO: +++ transaction committed.
Tests run: 1, Failures: 0, Errors: 0, Skipped: 0, Time elapsed: 1.615 sec
Running org.apache.cayenne.access.AbstractDbLoaderDelegateTest
Tests run: 5, Failures: 0, Errors: 0, Skipped: 0, Time elapsed: 0.008 sec
Running org.apache.cayenne.gen.ClientDataMapGeneratedQueryRunTest
Jan 10, 2010 6:51:53 PM org.apache.cayenne.remote.BaseConnection sendMessage
INFO: --- Message 0: Bootstrap
Jan 10, 2010 6:51:53 PM org.apache.cayenne.remote.BaseConnection sendMessage
INFO: === Message 0: Bootstrap done - took 7 ms.
Jan 10, 2010 6:51:53 PM org.apache.cayenne.remote.BaseConnection sendMessage
INFO: --- Message 1: flush-cascade-sync
Jan 10, 2010 6:51:53 PM org.apache.cayenne.access.QueryLogger logQueryStart
INFO: --- will run 2 queries.
Jan 10, 2010 6:51:53 PM org.apache.cayenne.access.QueryLogger logBeginTransaction
INFO: --- transaction started.
Jan 10, 2010 6:51:53 PM org.apache.cayenne.access.QueryLogger logQuery
INFO: SELECT NEXT_ID FROM AUTO_PK_SUPPORT WHERE TABLE_NAME = 'MT_TABLE1'
Jan 10, 2010 6:51:53 PM org.apache.cayenne.access.QueryLogger logSelectCount
INFO: === returned 1 row. - took 3 ms.
Jan 10, 2010 6:51:53 PM org.apache.cayenne.access.QueryLogger logQuery
INFO: UPDATE AUTO_PK_SUPPORT SET NEXT_ID = NEXT_ID + 20 WHERE TABLE_NAME = 'MT_TABLE1'
Jan 10, 2010 6:51:53 PM org.apache.cayenne.access.QueryLogger logUpdateCount
INFO: === updated 1 row.
Jan 10, 2010 6:51:53 PM org.apache.cayenne.access.QueryLogger logQueryStart
INFO: --- will run 1 query.
Jan 10, 2010 6:51:53 PM org.apache.cayenne.access.QueryLogger logQuery
INFO: INSERT INTO MT_TABLE1 (GLOBAL_ATTRIBUTE1, SERVER_ATTRIBUTE1, SUBCLASS_ATTRIBUTE1, TABLE1_ID)
VALUES (?, ?, ?, ?)
Jan 10, 2010 6:51:53 PM org.apache.cayenne.access.QueryLogger logQueryParameters
INFO: [bind: 1->GLOBAL_ATTRIBUTE1:'A1', 2->SERVER_ATTRIBUTE1:NULL, 3->SUBCLASS_ATTRIBUTE1:NULL,
4->TABLE1_ID:200]
Jan 10, 2010 6:51:53 PM org.apache.cayenne.access.QueryLogger logUpdateCount
INFO: === updated 1 row.
Jan 10, 2010 6:51:53 PM org.apache.cayenne.access.QueryLogger logCommitTransaction
INFO: +++ transaction committed.
Jan 10, 2010 6:51:53 PM org.apache.cayenne.remote.BaseConnection sendMessage
INFO: === Message 1: flush-cascade-sync done - took 48 ms.
Jan 10, 2010 6:51:53 PM org.apache.cayenne.remote.BaseConnection sendMessage
INFO: --- Message 2: Query
Jan 10, 2010 6:51:53 PM org.apache.cayenne.access.QueryLogger logQueryStart
INFO: --- will run 1 query.
Jan 10, 2010 6:51:53 PM org.apache.cayenne.access.QueryLogger logBeginTransaction
INFO: --- transaction started.
Jan 10, 2010 6:51:53 PM org.apache.cayenne.access.QueryLogger logQuery
INFO: SELECT t0.SERVER_ATTRIBUTE1, t0.TABLE1_ID, t0.GLOBAL_ATTRIBUTE1, t0.SUBCLASS_ATTRIBUTE1
FROM MT_TABLE1 t0
Jan 10, 2010 6:51:53 PM org.apache.cayenne.access.QueryLogger logSelectCount
INFO: === returned 1 row. - took 4 ms.
Jan 10, 2010 6:51:53 PM org.apache.cayenne.access.QueryLogger logCommitTransaction
INFO: +++ transaction committed.
Jan 10, 2010 6:51:53 PM org.apache.cayenne.remote.BaseConnection sendMessage
INFO: === Message 2: Query done - took 9 ms.
Tests run: 1, Failures: 0, Errors: 0, Skipped: 0, Time elapsed: 0.122 sec
Running org.apache.cayenne.gen.ImportUtilsTest
Tests run: 14, Failures: 0, Errors: 0, Skipped: 0, Time elapsed: 0.009 sec
Running org.apache.cayenne.tools.CayenneGeneratorTaskTest
Tests run: 7, Failures: 0, Errors: 0, Skipped: 0, Time elapsed: 0.768 sec
Running org.apache.cayenne.gen.ClassGenerationActionTest
Tests run: 7, Failures: 0, Errors: 0, Skipped: 0, Time elapsed: 0.195 sec
Running org.apache.cayenne.tools.DbGeneratorTaskTest
Tests run: 4, Failures: 0, Errors: 0, Skipped: 0, Time elapsed: 0.005 sec
Running org.apache.cayenne.tools.NamePatternMatcherTest
Tests run: 3, Failures: 0, Errors: 0, Skipped: 0, Time elapsed: 0.004 sec
Running org.apache.cayenne.tools.CayenneGeneratorTaskCrossMapRelationshipsTest
Tests run: 1, Failures: 0, Errors: 0, Skipped: 0, Time elapsed: 0.054 sec
Running org.apache.cayenne.map.naming.SmartNamingStrategyTest
Tests run: 1, Failures: 0, Errors: 0, Skipped: 0, Time elapsed: 0.039 sec
Running org.apache.cayenne.tools.AntDataPortDelegateTest
Tests run: 1, Failures: 0, Errors: 0, Skipped: 0, Time elapsed: 0.004 sec

Results :

Tests run: 45, Failures: 0, Errors: 0, Skipped: 0

[INFO] [jar:jar {execution: default-jar}]
[INFO] Building jar: <http://hudson.zones.apache.org/hudson/job/Cayenne-trunk/./cayenneTestConnection=HSQLDB,jdk=JDK%201.5%20(latest),label=Ubuntu/ws/trunk/framework/cayenne-tools/target/cayenne-tools-3.1-SNAPSHOT.jar>
[INFO] Preparing source:jar
[WARNING] Removing: jar from forked lifecycle, to prevent recursive invocation.
[INFO] No goals needed for project - skipping
[INFO] [source:jar {execution: bundle-source-jar}]
[INFO] Building jar: <http://hudson.zones.apache.org/hudson/job/Cayenne-trunk/./cayenneTestConnection=HSQLDB,jdk=JDK%201.5%20(latest),label=Ubuntu/ws/trunk/framework/cayenne-tools/target/cayenne-tools-3.1-SNAPSHOT-sources.jar>
[INFO] [install:install {execution: default-install}]
[INFO] Installing <http://hudson.zones.apache.org/hudson/job/Cayenne-trunk/./cayenneTestConnection=HSQLDB,jdk=JDK%201.5%20(latest),label=Ubuntu/ws/trunk/framework/cayenne-tools/target/cayenne-tools-3.1-SNAPSHOT.jar>
to /home/hudson/.m2/repository/org/apache/cayenne/cayenne-tools/3.1-SNAPSHOT/cayenne-tools-3.1-SNAPSHOT.jar
[INFO] Installing <http://hudson.zones.apache.org/hudson/job/Cayenne-trunk/./cayenneTestConnection=HSQLDB,jdk=JDK%201.5%20(latest),label=Ubuntu/ws/trunk/framework/cayenne-tools/target/cayenne-tools-3.1-SNAPSHOT-sources.jar>
to /home/hudson/.m2/repository/org/apache/cayenne/cayenne-tools/3.1-SNAPSHOT/cayenne-tools-3.1-SNAPSHOT-sources.jar
[INFO] ------------------------------------------------------------------------
[INFO] Building Cayenne Modeler
[INFO]    task-segment: [clean, install]
[INFO] ------------------------------------------------------------------------
[INFO] [clean:clean {execution: default-clean}]
[INFO] Deleting directory <http://hudson.zones.apache.org/hudson/job/Cayenne-trunk/./cayenneTestConnection=HSQLDB,jdk=JDK%201.5%20(latest),label=Ubuntu/ws/trunk/framework/cayenne-modeler/target>
[INFO] [resources:resources {execution: default-resources}]
[WARNING] Using platform encoding (UTF-8 actually) to copy filtered resources, i.e. build
is platform dependent!
[INFO] Copying 58 resources
[INFO] [remote-resources:process {execution: default}]
[INFO] [compiler:compile {execution: default-compile}]
[INFO] Compiling 494 source files to <http://hudson.zones.apache.org/hudson/job/Cayenne-trunk/./cayenneTestConnection=HSQLDB,jdk=JDK%201.5%20(latest),label=Ubuntu/ws/trunk/framework/cayenne-modeler/target/classes>
[INFO] [resources:testResources {execution: default-testResources}]
[WARNING] Using platform encoding (UTF-8 actually) to copy filtered resources, i.e. build
is platform dependent!
[INFO] skip non existing resourceDirectory <http://hudson.zones.apache.org/hudson/job/Cayenne-trunk/./cayenneTestConnection=HSQLDB,jdk=JDK%201.5%20(latest),label=Ubuntu/ws/trunk/framework/cayenne-modeler/src/test/resources>
[INFO] Copying 894 resources
[INFO] [compiler:testCompile {execution: default-testCompile}]
[INFO] Compiling 18 source files to <http://hudson.zones.apache.org/hudson/job/Cayenne-trunk/./cayenneTestConnection=HSQLDB,jdk=JDK%201.5%20(latest),label=Ubuntu/ws/trunk/framework/cayenne-modeler/target/test-classes>
[WARNING] DEPRECATED [systemProperties]: use systemPropertyVariables instead
[INFO] [surefire:test {execution: default-test}]
[INFO] Surefire report directory: <http://hudson.zones.apache.org/hudson/job/Cayenne-trunk/./cayenneTestConnection=HSQLDB,jdk=JDK%201.5%20(latest),label=Ubuntu/ws/trunk/framework/cayenne-modeler/target/surefire-reports>

-------------------------------------------------------
 T E S T S
-------------------------------------------------------
Running org.apache.cayenne.modeler.event.DataMapEventTest
Tests run: 3, Failures: 0, Errors: 0, Skipped: 0, Time elapsed: 0.039 sec
Running org.apache.cayenne.modeler.event.ModelerEventTest
Tests run: 2, Failures: 0, Errors: 0, Skipped: 0, Time elapsed: 0.007 sec
Running org.apache.cayenne.modeler.event.EntityEventTest
Tests run: 5, Failures: 0, Errors: 0, Skipped: 0, Time elapsed: 0.028 sec
Running org.apache.cayenne.modeler.action.ModelerProjectLoaderDelegateTest
Tests run: 1, Failures: 0, Errors: 0, Skipped: 0, Time elapsed: 0.046 sec
Running org.apache.cayenne.modeler.util.CircularArrayTest
Tests run: 2, Failures: 0, Errors: 0, Skipped: 0, Time elapsed: 0.006 sec
Running org.apache.cayenne.modeler.event.AttributeEventTest
Tests run: 1, Failures: 0, Errors: 0, Skipped: 0, Time elapsed: 0.004 sec
Running org.apache.cayenne.modeler.util.VersionTest
Tests run: 3, Failures: 0, Errors: 0, Skipped: 0, Time elapsed: 0.005 sec
Running org.apache.cayenne.configuration.event.DataNodeEventTest
Tests run: 3, Failures: 0, Errors: 0, Skipped: 0, Time elapsed: 0.005 sec
Running org.apache.cayenne.modeler.event.RelationshipEventTest
Tests run: 1, Failures: 0, Errors: 0, Skipped: 0, Time elapsed: 0.005 sec
Running org.apache.cayenne.modeler.event.DomainEventTest
Tests run: 3, Failures: 0, Errors: 0, Skipped: 0, Time elapsed: 0.008 sec
Running org.apache.cayenne.modeler.util.EOModelFileFilterTest
Tests run: 4, Failures: 0, Errors: 0, Skipped: 0, Time elapsed: 0.006 sec
Running org.apache.cayenne.modeler.action.CreateNodeActionTest
Tests run: 1, Failures: 0, Errors: 0, Skipped: 0, Time elapsed: 0.135 sec
Running org.apache.cayenne.modeler.util.DataMapFileFilterTest
Tests run: 6, Failures: 0, Errors: 0, Skipped: 0, Time elapsed: 0.009 sec
Running org.apache.cayenne.modeler.dialog.objentity.EntityRelationshipModelTest
Tests run: 1, Failures: 0, Errors: 0, Skipped: 0, Time elapsed: 0.008 sec
Running org.apache.cayenne.modeler.util.ApplicationFileFilterTest
Tests run: 4, Failures: 0, Errors: 0, Skipped: 0, Time elapsed: 0.004 sec
Running org.apache.cayenne.modeler.dialog.validator.ValidationDisplayHandlerTest
Tests run: 4, Failures: 0, Errors: 0, Skipped: 0, Time elapsed: 0.012 sec
Running org.apache.cayenne.modeler.event.DomainDisplayEventTest
Tests run: 1, Failures: 0, Errors: 0, Skipped: 0, Time elapsed: 0.003 sec

Results :

Tests run: 45, Failures: 0, Errors: 0, Skipped: 0

[INFO] [jar:jar {execution: default-jar}]
[INFO] Building jar: <http://hudson.zones.apache.org/hudson/job/Cayenne-trunk/./cayenneTestConnection=HSQLDB,jdk=JDK%201.5%20(latest),label=Ubuntu/ws/trunk/framework/cayenne-modeler/target/cayenne-modeler-3.1-SNAPSHOT.jar>
[INFO] Preparing source:jar
[WARNING] Removing: jar from forked lifecycle, to prevent recursive invocation.
[INFO] No goals needed for project - skipping
[INFO] [source:jar {execution: bundle-source-jar}]
[INFO] Building jar: <http://hudson.zones.apache.org/hudson/job/Cayenne-trunk/./cayenneTestConnection=HSQLDB,jdk=JDK%201.5%20(latest),label=Ubuntu/ws/trunk/framework/cayenne-modeler/target/cayenne-modeler-3.1-SNAPSHOT-sources.jar>
[INFO] [install:install {execution: default-install}]
[INFO] Installing <http://hudson.zones.apache.org/hudson/job/Cayenne-trunk/./cayenneTestConnection=HSQLDB,jdk=JDK%201.5%20(latest),label=Ubuntu/ws/trunk/framework/cayenne-modeler/target/cayenne-modeler-3.1-SNAPSHOT.jar>
to /home/hudson/.m2/repository/org/apache/cayenne/cayenne-modeler/3.1-SNAPSHOT/cayenne-modeler-3.1-SNAPSHOT.jar
[INFO] Installing <http://hudson.zones.apache.org/hudson/job/Cayenne-trunk/./cayenneTestConnection=HSQLDB,jdk=JDK%201.5%20(latest),label=Ubuntu/ws/trunk/framework/cayenne-modeler/target/cayenne-modeler-3.1-SNAPSHOT-sources.jar>
to /home/hudson/.m2/repository/org/apache/cayenne/cayenne-modeler/3.1-SNAPSHOT/cayenne-modeler-3.1-SNAPSHOT-sources.jar
[INFO] ------------------------------------------------------------------------
[INFO] Building Cayenne Maven Plugin
[INFO]    task-segment: [clean, install]
[INFO] ------------------------------------------------------------------------
[INFO] [clean:clean {execution: default-clean}]
[INFO] Deleting directory <http://hudson.zones.apache.org/hudson/job/Cayenne-trunk/./cayenneTestConnection=HSQLDB,jdk=JDK%201.5%20(latest),label=Ubuntu/ws/trunk/framework/maven-cayenne-plugin/target>
[INFO] [plugin:descriptor {execution: default-descriptor}]
[INFO] Using 2 extractors.
[INFO] Applying extractor for language: java
[INFO] Extractor for language: java found 3 mojo descriptors.
[INFO] Applying extractor for language: bsh
[INFO] Extractor for language: bsh found 0 mojo descriptors.
[INFO] [resources:resources {execution: default-resources}]
[WARNING] Using platform encoding (UTF-8 actually) to copy filtered resources, i.e. build
is platform dependent!
[INFO] skip non existing resourceDirectory <http://hudson.zones.apache.org/hudson/job/Cayenne-trunk/./cayenneTestConnection=HSQLDB,jdk=JDK%201.5%20(latest),label=Ubuntu/ws/trunk/framework/maven-cayenne-plugin/src/main/resources>
[INFO] [compiler:compile {execution: default-compile}]
[INFO] Compiling 4 source files to <http://hudson.zones.apache.org/hudson/job/Cayenne-trunk/./cayenneTestConnection=HSQLDB,jdk=JDK%201.5%20(latest),label=Ubuntu/ws/trunk/framework/maven-cayenne-plugin/target/classes>
[INFO] [resources:testResources {execution: default-testResources}]
[WARNING] Using platform encoding (UTF-8 actually) to copy filtered resources, i.e. build
is platform dependent!
[INFO] skip non existing resourceDirectory <http://hudson.zones.apache.org/hudson/job/Cayenne-trunk/./cayenneTestConnection=HSQLDB,jdk=JDK%201.5%20(latest),label=Ubuntu/ws/trunk/framework/maven-cayenne-plugin/src/test/resources>
[INFO] [compiler:testCompile {execution: default-testCompile}]
[INFO] No sources to compile
[WARNING] DEPRECATED [systemProperties]: use systemPropertyVariables instead
[INFO] [surefire:test {execution: default-test}]
[INFO] No tests to run.
[INFO] [jar:jar {execution: default-jar}]
[INFO] Building jar: <http://hudson.zones.apache.org/hudson/job/Cayenne-trunk/./cayenneTestConnection=HSQLDB,jdk=JDK%201.5%20(latest),label=Ubuntu/ws/trunk/framework/maven-cayenne-plugin/target/maven-cayenne-plugin-3.1-SNAPSHOT.jar>
[INFO] [plugin:addPluginArtifactMetadata {execution: default-addPluginArtifactMetadata}]
[INFO] [install:install {execution: default-install}]
[INFO] Installing <http://hudson.zones.apache.org/hudson/job/Cayenne-trunk/./cayenneTestConnection=HSQLDB,jdk=JDK%201.5%20(latest),label=Ubuntu/ws/trunk/framework/maven-cayenne-plugin/target/maven-cayenne-plugin-3.1-SNAPSHOT.jar>
to /home/hudson/.m2/repository/org/apache/cayenne/plugins/maven-cayenne-plugin/3.1-SNAPSHOT/maven-cayenne-plugin-3.1-SNAPSHOT.jar
[INFO] ------------------------------------------------------------------------
[ERROR] BUILD ERROR
[INFO] ------------------------------------------------------------------------
[INFO] Error installing artifact's metadata: Error installing metadata: Error copying POM
to the local repository.

Failed to copy full contents from <http://hudson.zones.apache.org/hudson/job/Cayenne-trunk/./cayenneTestConnection=HSQLDB,jdk=JDK%201.5%20(latest),label=Ubuntu/ws/trunk/framework/maven-cayenne-plugin/pom.xml>
to /home/hudson/.m2/repository/org/apache/cayenne/plugins/maven-cayenne-plugin/3.1-SNAPSHOT/maven-cayenne-plugin-3.1-SNAPSHOT.pom
[INFO] ------------------------------------------------------------------------
[INFO] Trace
org.apache.maven.lifecycle.LifecycleExecutionException: Error installing artifact's metadata:
Error installing metadata: Error copying POM to the local repository.
	at org.apache.maven.lifecycle.DefaultLifecycleExecutor.executeGoals(DefaultLifecycleExecutor.java:719)
	at org.apache.maven.lifecycle.DefaultLifecycleExecutor.executeGoalWithLifecycle(DefaultLifecycleExecutor.java:556)
	at org.apache.maven.lifecycle.DefaultLifecycleExecutor.executeGoal(DefaultLifecycleExecutor.java:535)
	at org.apache.maven.lifecycle.DefaultLifecycleExecutor.executeGoalAndHandleFailures(DefaultLifecycleExecutor.java:387)
	at org.apache.maven.lifecycle.DefaultLifecycleExecutor.executeTaskSegments(DefaultLifecycleExecutor.java:348)
	at org.apache.maven.lifecycle.DefaultLifecycleExecutor.execute(DefaultLifecycleExecutor.java:180)
	at org.apache.maven.DefaultMaven.doExecute(DefaultMaven.java:328)
	at org.apache.maven.DefaultMaven.execute(DefaultMaven.java:138)
	at org.apache.maven.cli.MavenCli.main(MavenCli.java:362)
	at org.apache.maven.cli.compat.CompatibleMain.main(CompatibleMain.java:60)
	at sun.reflect.NativeMethodAccessorImpl.invoke0(Native Method)
	at sun.reflect.NativeMethodAccessorImpl.invoke(NativeMethodAccessorImpl.java:39)
	at sun.reflect.DelegatingMethodAccessorImpl.invoke(DelegatingMethodAccessorImpl.java:25)
	at java.lang.reflect.Method.invoke(Method.java:592)
	at org.codehaus.classworlds.Launcher.launchEnhanced(Launcher.java:315)
	at org.codehaus.classworlds.Launcher.launch(Launcher.java:255)
	at org.codehaus.classworlds.Launcher.mainWithExitCode(Launcher.java:430)
	at org.codehaus.classworlds.Launcher.main(Launcher.java:375)
Caused by: org.apache.maven.plugin.MojoExecutionException: Error installing artifact's metadata:
Error installing metadata: Error copying POM to the local repository.
	at org.apache.maven.plugin.install.InstallMojo.execute(InstallMojo.java:143)
	at org.apache.maven.plugin.DefaultPluginManager.executeMojo(DefaultPluginManager.java:490)
	at org.apache.maven.lifecycle.DefaultLifecycleExecutor.executeGoals(DefaultLifecycleExecutor.java:694)
	... 17 more
Caused by: org.apache.maven.artifact.installer.ArtifactInstallationException: Error installing
artifact's metadata: Error installing metadata: Error copying POM to the local repository.
	at org.apache.maven.artifact.installer.DefaultArtifactInstaller.install(DefaultArtifactInstaller.java:123)
	at org.apache.maven.plugin.install.InstallMojo.execute(InstallMojo.java:105)
	... 19 more
Caused by: org.apache.maven.artifact.repository.metadata.RepositoryMetadataInstallationException:
Error installing metadata: Error copying POM to the local repository.
	at org.apache.maven.artifact.repository.metadata.DefaultRepositoryMetadataManager.install(DefaultRepositoryMetadataManager.java:462)
	at org.apache.maven.artifact.installer.DefaultArtifactInstaller.install(DefaultArtifactInstaller.java:111)
	... 20 more
Caused by: org.apache.maven.artifact.repository.metadata.RepositoryMetadataStoreException:
Error copying POM to the local repository.
	at org.apache.maven.project.artifact.ProjectArtifactMetadata.storeInLocalRepository(ProjectArtifactMetadata.java:100)
	at org.apache.maven.artifact.repository.metadata.DefaultRepositoryMetadataManager.install(DefaultRepositoryMetadataManager.java:458)
	... 21 more
Caused by: java.io.IOException: Failed to copy full contents from <http://hudson.zones.apache.org/hudson/job/Cayenne-trunk/./cayenneTestConnection=HSQLDB,jdk=JDK%201.5%20(latest),label=Ubuntu/ws/trunk/framework/maven-cayenne-plugin/pom.xml>
to /home/hudson/.m2/repository/org/apache/cayenne/plugins/maven-cayenne-plugin/3.1-SNAPSHOT/maven-cayenne-plugin-3.1-SNAPSHOT.pom
	at hidden.org.codehaus.plexus.util.FileUtils.copyFile(FileUtils.java:1018)
	at org.apache.maven.project.artifact.ProjectArtifactMetadata.storeInLocalRepository(ProjectArtifactMetadata.java:96)
	... 22 more
[INFO] ------------------------------------------------------------------------
[INFO] Total time: 1 minute 50 seconds
[INFO] Finished at: Sun Jan 10 18:52:07 UTC 2010
[INFO] Final Memory: 63M/294M
[INFO] ------------------------------------------------------------------------
Recording test results


Mime
View raw message