cayenne-commits mailing list archives

Site index · List index
Message view « Date » · « Thread »
Top « Date » · « Thread »
From Apache Hudson Server <hud...@hudson.zones.apache.org>
Subject Build failed in Hudson: Cayenne-trunk » HSQLDB,JDK 1.6 (latest),Ubuntu #179
Date Sat, 16 Jan 2010 18:56:44 GMT
See <http://hudson.zones.apache.org/hudson/job/Cayenne-trunk/./cayenneTestConnection=HSQLDB,jdk=JDK%201.6%20(latest),label=Ubuntu/179/>

------------------------------------------
[...truncated 73550 lines...]
[INFO] No tests to run.
[INFO] [jar:jar {execution: default-jar}]
[INFO] Building jar: <http://hudson.zones.apache.org/hudson/job/Cayenne-trunk/./cayenneTestConnection=HSQLDB,jdk=JDK%201.6%20(latest),label=Ubuntu/ws/trunk/itests/itest-common/target/itest-common-3.1-SNAPSHOT.jar>
[INFO] Preparing source:jar
[WARNING] Removing: jar from forked lifecycle, to prevent recursive invocation.
[INFO] No goals needed for project - skipping
[INFO] [source:jar {execution: bundle-source-jar}]
[INFO] Building jar: <http://hudson.zones.apache.org/hudson/job/Cayenne-trunk/./cayenneTestConnection=HSQLDB,jdk=JDK%201.6%20(latest),label=Ubuntu/ws/trunk/itests/itest-common/target/itest-common-3.1-SNAPSHOT-sources.jar>
[INFO] [install:install {execution: default-install}]
[INFO] Installing <http://hudson.zones.apache.org/hudson/job/Cayenne-trunk/./cayenneTestConnection=HSQLDB,jdk=JDK%201.6%20(latest),label=Ubuntu/ws/trunk/itests/itest-common/target/itest-common-3.1-SNAPSHOT.jar>
to /home/hudson/.m2/repository/org/apache/cayenne/itests/itest-common/3.1-SNAPSHOT/itest-common-3.1-SNAPSHOT.jar
[INFO] Installing <http://hudson.zones.apache.org/hudson/job/Cayenne-trunk/./cayenneTestConnection=HSQLDB,jdk=JDK%201.6%20(latest),label=Ubuntu/ws/trunk/itests/itest-common/target/itest-common-3.1-SNAPSHOT-sources.jar>
to /home/hudson/.m2/repository/org/apache/cayenne/itests/itest-common/3.1-SNAPSHOT/itest-common-3.1-SNAPSHOT-sources.jar
[INFO] ------------------------------------------------------------------------
[INFO] Building Integration Tests - Cayenne DI Stack
[INFO]    task-segment: [clean, install]
[INFO] ------------------------------------------------------------------------
[INFO] [clean:clean {execution: default-clean}]
[INFO] Deleting directory <http://hudson.zones.apache.org/hudson/job/Cayenne-trunk/./cayenneTestConnection=HSQLDB,jdk=JDK%201.6%20(latest),label=Ubuntu/ws/trunk/itests/cayenne-di-stack/target>
[INFO] [resources:resources {execution: default-resources}]
[WARNING] Using platform encoding (UTF-8 actually) to copy filtered resources, i.e. build
is platform dependent!
[INFO] Copying 3 resources
[INFO] [compiler:compile {execution: default-compile}]
[INFO] Compiling 6 source files to <http://hudson.zones.apache.org/hudson/job/Cayenne-trunk/./cayenneTestConnection=HSQLDB,jdk=JDK%201.6%20(latest),label=Ubuntu/ws/trunk/itests/cayenne-di-stack/target/classes>
[INFO] [resources:testResources {execution: default-testResources}]
[WARNING] Using platform encoding (UTF-8 actually) to copy filtered resources, i.e. build
is platform dependent!
[INFO] skip non existing resourceDirectory <http://hudson.zones.apache.org/hudson/job/Cayenne-trunk/./cayenneTestConnection=HSQLDB,jdk=JDK%201.6%20(latest),label=Ubuntu/ws/trunk/itests/cayenne-di-stack/src/test/resources>
[INFO] [compiler:testCompile {execution: default-testCompile}]
[INFO] Compiling 1 source file to <http://hudson.zones.apache.org/hudson/job/Cayenne-trunk/./cayenneTestConnection=HSQLDB,jdk=JDK%201.6%20(latest),label=Ubuntu/ws/trunk/itests/cayenne-di-stack/target/test-classes>
[WARNING] DEPRECATED [systemProperties]: use systemPropertyVariables instead
[INFO] [surefire:test {execution: default-test}]
[INFO] Surefire report directory: <http://hudson.zones.apache.org/hudson/job/Cayenne-trunk/./cayenneTestConnection=HSQLDB,jdk=JDK%201.6%20(latest),label=Ubuntu/ws/trunk/itests/cayenne-di-stack/target/surefire-reports>

-------------------------------------------------------
 T E S T S
-------------------------------------------------------
Running org.apache.cayenne.runtime.CayenneServerRuntimeIntegrationTest
Jan 16, 2010 7:03:37 PM org.apache.cayenne.configuration.XMLDataChannelDescriptorLoader$DataSourceChildrenHandler
createChildTagHandler
INFO: loading user name and password.
Jan 16, 2010 7:03:37 PM org.apache.cayenne.access.QueryLogger logPoolCreated
INFO: Created connection pool: jdbc:hsqldb:mem:DEFAULT
	Driver class: org.hsqldb.jdbcDriver
	Min. connections in the pool: 1
	Max. connections in the pool: 1
Jan 16, 2010 7:03:37 PM org.apache.cayenne.access.QueryLogger logConnect
INFO: Opening connection: jdbc:hsqldb:mem:DEFAULT
	Login: null
	Password: *******
Jan 16, 2010 7:03:37 PM org.apache.cayenne.access.QueryLogger logConnectSuccess
INFO: +++ Connecting: SUCCESS.
Jan 16, 2010 7:03:37 PM org.apache.cayenne.access.QueryLogger log
INFO: Detected and installed adapter: org.apache.cayenne.dba.hsqldb.HSQLDBAdapter
Jan 16, 2010 7:03:37 PM org.apache.cayenne.access.dbsync.CreateIfNoSchemaStrategy processSchemaUpdate
INFO: No schema detected, will create mapped tables
Jan 16, 2010 7:03:37 PM org.apache.cayenne.access.QueryLogger logQuery
INFO: CREATE CACHED TABLE TABLE1 (ID BIGINT NOT NULL, NAME VARCHAR(255) NULL, PRIMARY KEY
(ID))
Jan 16, 2010 7:03:37 PM org.apache.cayenne.access.QueryLogger logQuery
INFO: CREATE TABLE AUTO_PK_SUPPORT (  TABLE_NAME CHAR(100) NOT NULL,  NEXT_ID BIGINT NOT NULL,
 PRIMARY KEY(TABLE_NAME))
Jan 16, 2010 7:03:37 PM org.apache.cayenne.access.QueryLogger logQuery
INFO: DELETE FROM AUTO_PK_SUPPORT WHERE TABLE_NAME IN ('TABLE1')
Jan 16, 2010 7:03:37 PM org.apache.cayenne.access.QueryLogger logQuery
INFO: INSERT INTO AUTO_PK_SUPPORT (TABLE_NAME, NEXT_ID) VALUES ('TABLE1', 200)
Jan 16, 2010 7:03:37 PM org.apache.cayenne.access.QueryLogger logQueryStart
INFO: --- will run 1 query.
Jan 16, 2010 7:03:37 PM org.apache.cayenne.access.QueryLogger logBeginTransaction
INFO: --- transaction started.
Jan 16, 2010 7:03:37 PM org.apache.cayenne.access.QueryLogger logQuery
INFO: SELECT t0.NAME, t0.ID FROM TABLE1 t0 - prepared in 22 ms.
Jan 16, 2010 7:03:37 PM org.apache.cayenne.access.QueryLogger logSelectCount
INFO: === returned 1 row. - took 29 ms.
Jan 16, 2010 7:03:37 PM org.apache.cayenne.access.QueryLogger logCommitTransaction
INFO: +++ transaction committed.
Jan 16, 2010 7:03:37 PM org.apache.cayenne.access.QueryLogger logQueryStart
INFO: --- will run 1 query.
Jan 16, 2010 7:03:37 PM org.apache.cayenne.access.QueryLogger logBeginTransaction
INFO: --- transaction started.
Jan 16, 2010 7:03:37 PM org.apache.cayenne.access.QueryLogger logQuery
INFO: SELECT t0.NAME, t0.ID FROM TABLE1 t0
Jan 16, 2010 7:03:37 PM org.apache.cayenne.access.QueryLogger logSelectCount
INFO: === returned 1 row. - took 1 ms.
Jan 16, 2010 7:03:37 PM org.apache.cayenne.access.QueryLogger logCommitTransaction
INFO: +++ transaction committed.
Tests run: 3, Failures: 0, Errors: 0, Skipped: 0, Time elapsed: 0.508 sec

Results :

Tests run: 3, Failures: 0, Errors: 0, Skipped: 0

[INFO] [jar:jar {execution: default-jar}]
[INFO] Building jar: <http://hudson.zones.apache.org/hudson/job/Cayenne-trunk/./cayenneTestConnection=HSQLDB,jdk=JDK%201.6%20(latest),label=Ubuntu/ws/trunk/itests/cayenne-di-stack/target/cayenne-di-stack-3.1-SNAPSHOT.jar>
[INFO] [install:install {execution: default-install}]
[INFO] Installing <http://hudson.zones.apache.org/hudson/job/Cayenne-trunk/./cayenneTestConnection=HSQLDB,jdk=JDK%201.6%20(latest),label=Ubuntu/ws/trunk/itests/cayenne-di-stack/target/cayenne-di-stack-3.1-SNAPSHOT.jar>
to /home/hudson/.m2/repository/org/apache/cayenne/itests/cayenne-di-stack/3.1-SNAPSHOT/cayenne-di-stack-3.1-SNAPSHOT.jar
[INFO] ------------------------------------------------------------------------
[INFO] Building Cayenne Modeler Java
[INFO]    task-segment: [clean, install]
[INFO] ------------------------------------------------------------------------
[INFO] [clean:clean {execution: default-clean}]
[INFO] Deleting directory <http://hudson.zones.apache.org/hudson/job/Cayenne-trunk/./cayenneTestConnection=HSQLDB,jdk=JDK%201.6%20(latest),label=Ubuntu/ws/trunk/modeler/cayenne-modeler-java/target>
[INFO] [japplication:japplication {execution: default}]
[INFO] [resources:resources {execution: default-resources}]
[WARNING] Using platform encoding (UTF-8 actually) to copy filtered resources, i.e. build
is platform dependent!
[INFO] Copying 1 resource
[INFO] [compiler:compile {execution: default-compile}]
[INFO] No sources to compile
[INFO] [resources:testResources {execution: default-testResources}]
[WARNING] Using platform encoding (UTF-8 actually) to copy filtered resources, i.e. build
is platform dependent!
[INFO] skip non existing resourceDirectory <http://hudson.zones.apache.org/hudson/job/Cayenne-trunk/./cayenneTestConnection=HSQLDB,jdk=JDK%201.6%20(latest),label=Ubuntu/ws/trunk/modeler/cayenne-modeler-java/src/test/resources>
[INFO] [compiler:testCompile {execution: default-testCompile}]
[INFO] No sources to compile
[WARNING] DEPRECATED [systemProperties]: use systemPropertyVariables instead
[INFO] [surefire:test {execution: default-test}]
[INFO] No tests to run.
[INFO] [jar:jar {execution: default-jar}]
[INFO] Building jar: <http://hudson.zones.apache.org/hudson/job/Cayenne-trunk/./cayenneTestConnection=HSQLDB,jdk=JDK%201.6%20(latest),label=Ubuntu/ws/trunk/modeler/cayenne-modeler-java/target/cayenne-modeler-java-3.1-SNAPSHOT.jar>
[INFO] [install:install {execution: default-install}]
[INFO] Installing <http://hudson.zones.apache.org/hudson/job/Cayenne-trunk/./cayenneTestConnection=HSQLDB,jdk=JDK%201.6%20(latest),label=Ubuntu/ws/trunk/modeler/cayenne-modeler-java/target/cayenne-modeler-java-3.1-SNAPSHOT.jar>
to /home/hudson/.m2/repository/org/apache/cayenne/cayenne-modeler-java/3.1-SNAPSHOT/cayenne-modeler-java-3.1-SNAPSHOT.jar
[INFO] ------------------------------------------------------------------------
[INFO] Building Cayenne Modeler Parent
[INFO]    task-segment: [clean, install]
[INFO] ------------------------------------------------------------------------
[INFO] [clean:clean {execution: default-clean}]
[INFO] [site:attach-descriptor {execution: default-attach-descriptor}]
[INFO] [install:install {execution: default-install}]
[INFO] Installing <http://hudson.zones.apache.org/hudson/job/Cayenne-trunk/./cayenneTestConnection=HSQLDB,jdk=JDK%201.6%20(latest),label=Ubuntu/ws/trunk/modeler/pom.xml>
to /home/hudson/.m2/repository/org/apache/cayenne/parents/cayenne-modeler-parent/3.1-SNAPSHOT/cayenne-modeler-parent-3.1-SNAPSHOT.pom
[INFO] ------------------------------------------------------------------------
[INFO] Building Cayenne Tutorial
[INFO]    task-segment: [clean, install]
[INFO] ------------------------------------------------------------------------
[INFO] [clean:clean {execution: default-clean}]
[INFO] Deleting directory <http://hudson.zones.apache.org/hudson/job/Cayenne-trunk/./cayenneTestConnection=HSQLDB,jdk=JDK%201.6%20(latest),label=Ubuntu/ws/trunk/tutorials/tutorial/target>
[INFO] [resources:resources {execution: default-resources}]
[WARNING] Using platform encoding (UTF-8 actually) to copy filtered resources, i.e. build
is platform dependent!
[INFO] Copying 3 resources
[INFO] [compiler:compile {execution: default-compile}]
[INFO] Compiling 9 source files to <http://hudson.zones.apache.org/hudson/job/Cayenne-trunk/./cayenneTestConnection=HSQLDB,jdk=JDK%201.6%20(latest),label=Ubuntu/ws/trunk/tutorials/tutorial/target/classes>
[INFO] [resources:testResources {execution: default-testResources}]
[WARNING] Using platform encoding (UTF-8 actually) to copy filtered resources, i.e. build
is platform dependent!
[INFO] Copying 1 resource
[INFO] [compiler:testCompile {execution: default-testCompile}]
[INFO] Nothing to compile - all classes are up to date
[INFO] [surefire:test {execution: default-test}]
[INFO] Surefire report directory: <http://hudson.zones.apache.org/hudson/job/Cayenne-trunk/./cayenneTestConnection=HSQLDB,jdk=JDK%201.6%20(latest),label=Ubuntu/ws/trunk/tutorials/tutorial/target/surefire-reports>

-------------------------------------------------------
 T E S T S
-------------------------------------------------------
There are no tests to run.

Results :

Tests run: 0, Failures: 0, Errors: 0, Skipped: 0

[INFO] [jar:jar {execution: default-jar}]
[INFO] Building jar: <http://hudson.zones.apache.org/hudson/job/Cayenne-trunk/./cayenneTestConnection=HSQLDB,jdk=JDK%201.6%20(latest),label=Ubuntu/ws/trunk/tutorials/tutorial/target/tutorial-3.1-SNAPSHOT.jar>
[INFO] [install:install {execution: default-install}]
[INFO] Installing <http://hudson.zones.apache.org/hudson/job/Cayenne-trunk/./cayenneTestConnection=HSQLDB,jdk=JDK%201.6%20(latest),label=Ubuntu/ws/trunk/tutorials/tutorial/target/tutorial-3.1-SNAPSHOT.jar>
to /home/hudson/.m2/repository/org/apache/cayenne/tutorial/3.1-SNAPSHOT/tutorial-3.1-SNAPSHOT.jar
[INFO] ------------------------------------------------------------------------
[INFO] Building Cayenne ROP Server Tutorial
[INFO]    task-segment: [clean, install]
[INFO] ------------------------------------------------------------------------
[INFO] [clean:clean {execution: default-clean}]
[INFO] Deleting directory <http://hudson.zones.apache.org/hudson/job/Cayenne-trunk/./cayenneTestConnection=HSQLDB,jdk=JDK%201.6%20(latest),label=Ubuntu/ws/trunk/tutorials/tutorial-rop-server/target>
[INFO] [resources:resources {execution: default-resources}]
[WARNING] Using platform encoding (UTF-8 actually) to copy filtered resources, i.e. build
is platform dependent!
[INFO] Copying 3 resources
[INFO] [compiler:compile {execution: default-compile}]
[INFO] Compiling 16 source files to <http://hudson.zones.apache.org/hudson/job/Cayenne-trunk/./cayenneTestConnection=HSQLDB,jdk=JDK%201.6%20(latest),label=Ubuntu/ws/trunk/tutorials/tutorial-rop-server/target/classes>
[INFO] [resources:testResources {execution: default-testResources}]
[WARNING] Using platform encoding (UTF-8 actually) to copy filtered resources, i.e. build
is platform dependent!
[INFO] Copying 1 resource
[INFO] [compiler:testCompile {execution: default-testCompile}]
[INFO] Nothing to compile - all classes are up to date
[INFO] [surefire:test {execution: default-test}]
[INFO] Surefire report directory: <http://hudson.zones.apache.org/hudson/job/Cayenne-trunk/./cayenneTestConnection=HSQLDB,jdk=JDK%201.6%20(latest),label=Ubuntu/ws/trunk/tutorials/tutorial-rop-server/target/surefire-reports>

-------------------------------------------------------
 T E S T S
-------------------------------------------------------
There are no tests to run.

Results :

Tests run: 0, Failures: 0, Errors: 0, Skipped: 0

[INFO] [jar:jar {execution: default-jar}]
[INFO] Building jar: <http://hudson.zones.apache.org/hudson/job/Cayenne-trunk/./cayenneTestConnection=HSQLDB,jdk=JDK%201.6%20(latest),label=Ubuntu/ws/trunk/tutorials/tutorial-rop-server/target/tutorial-rop-server-3.1-SNAPSHOT.jar>
[INFO] [install:install {execution: default-install}]
[INFO] Installing <http://hudson.zones.apache.org/hudson/job/Cayenne-trunk/./cayenneTestConnection=HSQLDB,jdk=JDK%201.6%20(latest),label=Ubuntu/ws/trunk/tutorials/tutorial-rop-server/target/tutorial-rop-server-3.1-SNAPSHOT.jar>
to /home/hudson/.m2/repository/org/apache/cayenne/tutorial-rop-server/3.1-SNAPSHOT/tutorial-rop-server-3.1-SNAPSHOT.jar
[INFO] ------------------------------------------------------------------------
[INFO] Building Cayenne ROP Client Tutorial
[INFO]    task-segment: [clean, install]
[INFO] ------------------------------------------------------------------------
[INFO] [clean:clean {execution: default-clean}]
[INFO] Deleting directory <http://hudson.zones.apache.org/hudson/job/Cayenne-trunk/./cayenneTestConnection=HSQLDB,jdk=JDK%201.6%20(latest),label=Ubuntu/ws/trunk/tutorials/tutorial-rop-client/target>
[INFO] [resources:resources {execution: default-resources}]
[WARNING] Using platform encoding (UTF-8 actually) to copy filtered resources, i.e. build
is platform dependent!
[INFO] skip non existing resourceDirectory <http://hudson.zones.apache.org/hudson/job/Cayenne-trunk/./cayenneTestConnection=HSQLDB,jdk=JDK%201.6%20(latest),label=Ubuntu/ws/trunk/tutorials/tutorial-rop-client/src/main/resources>
[INFO] [compiler:compile {execution: default-compile}]
[INFO] Compiling 9 source files to <http://hudson.zones.apache.org/hudson/job/Cayenne-trunk/./cayenneTestConnection=HSQLDB,jdk=JDK%201.6%20(latest),label=Ubuntu/ws/trunk/tutorials/tutorial-rop-client/target/classes>
[INFO] ------------------------------------------------------------------------
[ERROR] BUILD FAILURE
[INFO] ------------------------------------------------------------------------
[INFO] Compilation failure
<http://hudson.zones.apache.org/hudson/job/Cayenne-trunk/./cayenneTestConnection=HSQLDB,jdk=JDK%201.6%20(latest),label=Ubuntu/ws/trunk/tutorials/tutorial-rop-client/src/main/java/org/apache/cayenne/tutorial/persistent/client/auto/_Painting.java>:[49,39]
cannot access org.apache.cayenne.CayenneRuntimeException
class file for org.apache.cayenne.CayenneRuntimeException not found
        return (Artist) artist.getValue();


[INFO] ------------------------------------------------------------------------
[INFO] Trace
org.apache.maven.BuildFailureException: Compilation failure
<http://hudson.zones.apache.org/hudson/job/Cayenne-trunk/./cayenneTestConnection=HSQLDB,jdk=JDK%201.6%20(latest),label=Ubuntu/ws/trunk/tutorials/tutorial-rop-client/src/main/java/org/apache/cayenne/tutorial/persistent/client/auto/_Painting.java>:[49,39]
cannot access org.apache.cayenne.CayenneRuntimeException
class file for org.apache.cayenne.CayenneRuntimeException not found
        return (Artist) artist.getValue();


	at org.apache.maven.lifecycle.DefaultLifecycleExecutor.executeGoals(DefaultLifecycleExecutor.java:715)
	at org.apache.maven.lifecycle.DefaultLifecycleExecutor.executeGoalWithLifecycle(DefaultLifecycleExecutor.java:556)
	at org.apache.maven.lifecycle.DefaultLifecycleExecutor.executeGoal(DefaultLifecycleExecutor.java:535)
	at org.apache.maven.lifecycle.DefaultLifecycleExecutor.executeGoalAndHandleFailures(DefaultLifecycleExecutor.java:387)
	at org.apache.maven.lifecycle.DefaultLifecycleExecutor.executeTaskSegments(DefaultLifecycleExecutor.java:348)
	at org.apache.maven.lifecycle.DefaultLifecycleExecutor.execute(DefaultLifecycleExecutor.java:180)
	at org.apache.maven.DefaultMaven.doExecute(DefaultMaven.java:328)
	at org.apache.maven.DefaultMaven.execute(DefaultMaven.java:138)
	at org.apache.maven.cli.MavenCli.main(MavenCli.java:362)
	at org.apache.maven.cli.compat.CompatibleMain.main(CompatibleMain.java:60)
	at sun.reflect.NativeMethodAccessorImpl.invoke0(Native Method)
	at sun.reflect.NativeMethodAccessorImpl.invoke(NativeMethodAccessorImpl.java:39)
	at sun.reflect.DelegatingMethodAccessorImpl.invoke(DelegatingMethodAccessorImpl.java:25)
	at java.lang.reflect.Method.invoke(Method.java:597)
	at org.codehaus.classworlds.Launcher.launchEnhanced(Launcher.java:315)
	at org.codehaus.classworlds.Launcher.launch(Launcher.java:255)
	at org.codehaus.classworlds.Launcher.mainWithExitCode(Launcher.java:430)
	at org.codehaus.classworlds.Launcher.main(Launcher.java:375)
Caused by: org.apache.maven.plugin.CompilationFailureException: Compilation failure
<http://hudson.zones.apache.org/hudson/job/Cayenne-trunk/./cayenneTestConnection=HSQLDB,jdk=JDK%201.6%20(latest),label=Ubuntu/ws/trunk/tutorials/tutorial-rop-client/src/main/java/org/apache/cayenne/tutorial/persistent/client/auto/_Painting.java>:[49,39]
cannot access org.apache.cayenne.CayenneRuntimeException
class file for org.apache.cayenne.CayenneRuntimeException not found
        return (Artist) artist.getValue();


	at org.apache.maven.plugin.AbstractCompilerMojo.execute(AbstractCompilerMojo.java:516)
	at org.apache.maven.plugin.CompilerMojo.execute(CompilerMojo.java:114)
	at org.apache.maven.plugin.DefaultPluginManager.executeMojo(DefaultPluginManager.java:490)
	at org.apache.maven.lifecycle.DefaultLifecycleExecutor.executeGoals(DefaultLifecycleExecutor.java:694)
	... 17 more
[INFO] ------------------------------------------------------------------------
[INFO] Total time: 1 minute 32 seconds
[INFO] Finished at: Sat Jan 16 19:03:45 UTC 2010
[INFO] Final Memory: 120M/200M
[INFO] ------------------------------------------------------------------------
Recording test results


Mime
View raw message