cayenne-commits mailing list archives

Site index · List index
Message view « Date » · « Thread »
Top « Date » · « Thread »
From Apache Hudson Server <hud...@hudson.zones.apache.org>
Subject Build failed in Hudson: Cayenne-trunk » derby,JDK 1.5 (latest),Ubuntu #172
Date Thu, 14 Jan 2010 10:53:38 GMT
See <http://hudson.zones.apache.org/hudson/job/Cayenne-trunk/./cayenneTestConnection=derby,jdk=JDK%201.5%20(latest),label=Ubuntu/172/changes>

Changes:

[evgeny] CAY-1354
Wrong Types mapping for selected values in Row Queries

Fixed default mapping for most of types. Add JUnits to control regression. Still problem with
mapping of float.

[oltka] *add note

[oltka] CAY-1365 "= NULL" being used instead of "IS NULL" on an EJBQL expression..

(cherry picked from commit 9a7811693a8482b8452fbb3891f393bbc1f66e6c)

------------------------------------------
[...truncated 13959 lines...]
  testSelectPrimitives(org.apache.cayenne.CayenneContextWithDataContextTest)
  testCommitChangesPrimitives(org.apache.cayenne.CayenneContextWithDataContextTest)
  testPostAddCallback(org.apache.cayenne.CayenneContextWithDataContextTest)
  testPostAddOnObjectCallback(org.apache.cayenne.CayenneContextWithDataContextTest)
  testPreRemoveCallback(org.apache.cayenne.CayenneContextWithDataContextTest)
  testCAY830(org.apache.cayenne.CayenneContextWithDataContextTest)
  testRollbackChanges(org.apache.cayenne.CayenneContextWithDataContextTest)
  testOIDQueryInterception(org.apache.cayenne.CayenneContextWithDataContextTest)
  testNullifyToOne(org.apache.cayenne.access.DataContextDeleteRulesTest)
  testCascadeToOne(org.apache.cayenne.access.DataContextDeleteRulesTest)
  testCascadeToManyFlattened(org.apache.cayenne.access.DataContextDeleteRulesTest)
  testNullifyToManyFlattened(org.apache.cayenne.access.DataContextDeleteRulesTest)
  testNullifyToMany(org.apache.cayenne.access.DataContextDeleteRulesTest)
  testCascadeToMany(org.apache.cayenne.access.DataContextDeleteRulesTest)
  testDenyToMany(org.apache.cayenne.access.DataContextDeleteRulesTest)
  testPrefetchingToOneNull(org.apache.cayenne.access.DataContextPrefetchTest)
  testPrefetchToMany(org.apache.cayenne.access.DataContextPrefetchTest)
  testPrefetch4(org.apache.cayenne.access.DataContextPrefetchTest)
  testPrefetchToManyNoQualifier(org.apache.cayenne.access.DataContextPrefetchTest)
  testPrefetchToManyOnJoinTableDisjoinedPrefetch(org.apache.cayenne.access.DataContextPrefetchTest)
  testPrefetchToManyOnJoinTableJoinedPrefetch(org.apache.cayenne.access.DataContextPrefetchTest)
  testPrefetch3a(org.apache.cayenne.access.DataContextPrefetchTest)
  testPrefetchOneWayToMany(org.apache.cayenne.access.DataContextPrefetchTest)
  testPrefetch5(org.apache.cayenne.access.DataContextPrefetchTest)
  testPrefetch6(org.apache.cayenne.access.DataContextPrefetchTest)
  testPrefetch7(org.apache.cayenne.access.DataContextPrefetchTest)
  testPrefetch8(org.apache.cayenne.access.DataContextPrefetchTest)
  testPrefetch9(org.apache.cayenne.access.DataContextPrefetchTest)
  testPrefetchOneToOne(org.apache.cayenne.access.DataContextPrefetchTest)
  testCAY119(org.apache.cayenne.access.DataContextPrefetchTest)
  testPrefetchToOneSharedCache(org.apache.cayenne.access.DataContextPrefetchTest)
  testPrefetchToOneLocalCache(org.apache.cayenne.access.DataContextPrefetchTest)
  testLongPk(org.apache.cayenne.PregeneratedPKTest)
  testAddToMany(org.apache.cayenne.CDOCollectionRelationshipTest)
  testAddToManyViaReverse(org.apache.cayenne.CDOCollectionRelationshipTest)
  testReadRelationship(org.apache.cayenne.CDOOneToOneFKTest)
  test2Null(org.apache.cayenne.CDOOneToOneFKTest)
  testNewAdd(org.apache.cayenne.CDOOneToOneFKTest)
  testTakeObjectSnapshotDependentFault(org.apache.cayenne.CDOOneToOneFKTest)
  testDelete(org.apache.cayenne.CDOOneToOneFKTest)
  testReplaceNull1(org.apache.cayenne.CDOOneToOneFKTest)
  testReplaceNull2(org.apache.cayenne.CDOOneToOneFKTest)
  testReadFlattenedRelationship(org.apache.cayenne.CayenneDataObjectFlattenedRelTest)
  testReadFlattenedRelationship2(org.apache.cayenne.CayenneDataObjectFlattenedRelTest)
  testAddToFlattenedRelationship(org.apache.cayenne.CayenneDataObjectFlattenedRelTest)
  testDoubleCommitAddToFlattenedRelationship(org.apache.cayenne.CayenneDataObjectFlattenedRelTest)
  testRemoveFromFlattenedRelationship(org.apache.cayenne.CayenneDataObjectFlattenedRelTest)
  testRemoveFlattenedRelationshipAndRootRecord(org.apache.cayenne.CayenneDataObjectFlattenedRelTest)
  testAddRemoveFlattenedRelationship1(org.apache.cayenne.CayenneDataObjectFlattenedRelTest)
  testAddRemoveFlattenedRelationship2(org.apache.cayenne.CayenneDataObjectFlattenedRelTest)
  testSyncNewObject(org.apache.cayenne.CayenneContextClientChannelEventsTest)
  testSyncNewDeletedObject(org.apache.cayenne.CayenneContextClientChannelEventsTest)
  testSyncNewObjectIntoDirtyContext(org.apache.cayenne.CayenneContextClientChannelEventsTest)
  testSyncToManyRelationship(org.apache.cayenne.CayenneContextClientChannelEventsTest)
  testSyncToManyRelationship1(org.apache.cayenne.CayenneContextClientChannelEventsTest)
  testSyncManyToManyRelationship1(org.apache.cayenne.CayenneContextClientChannelEventsTest)
  testCompoundPkChangeSingleElement(org.apache.cayenne.CompoundPkChangeTest)
  testCompoundPkChangeAllElements(org.apache.cayenne.CompoundPkChangeTest)
  testDeepMergeNonExistent(org.apache.cayenne.util.DeepMergeOperationTest)
  testDeepMergeModified(org.apache.cayenne.util.DeepMergeOperationTest)
  testLocalObjectPeerContextMap(org.apache.cayenne.access.DataContextObjectTrackingTest)
  testLocalObjectPeerContextNoOverride(org.apache.cayenne.access.DataContextObjectTrackingTest)
  testPartialLoad(org.apache.cayenne.access.DbLoaderPartialTest)
  testManyToMany(org.apache.cayenne.access.FlattenedPrefetchTest)
  testMultiPrefetch(org.apache.cayenne.access.FlattenedPrefetchTest)
  testJointManyToMany(org.apache.cayenne.access.FlattenedPrefetchTest)
  testJointMultiPrefetch(org.apache.cayenne.access.FlattenedPrefetchTest)
  testManualIdProcessingOnCommit(org.apache.cayenne.access.DataContextExtrasTest)
  testResolveFault(org.apache.cayenne.access.DataContextExtrasTest)
  testPhantomModificationsValidate(org.apache.cayenne.access.DataContextExtrasTest)
  testPhantomModificationsValidateToOne(org.apache.cayenne.access.DataContextExtrasTest)
  testValidateOnToManyChange(org.apache.cayenne.access.DataContextExtrasTest)
  testPhantomAttributeModificationCommit(org.apache.cayenne.access.DataContextExtrasTest)
  testPhantomRelationshipModificationCommit(org.apache.cayenne.access.DataContextExtrasTest)
  testPhantomRelationshipModificationValidate(org.apache.cayenne.access.DataContextExtrasTest)
  testSerializeResolver(org.apache.cayenne.access.DataContextSerializationTest)
  testSerializeChannel(org.apache.cayenne.access.DataContextSerializationTest)
  testSerializeWithSharedCache(org.apache.cayenne.access.DataContextSerializationTest)
  testSerializeWithLocalCache(org.apache.cayenne.access.DataContextSerializationTest)
  testSerializeNew(org.apache.cayenne.access.DataContextSerializationTest)
  testSerializeCommitted(org.apache.cayenne.access.DataContextSerializationTest)
  testSerializeModified(org.apache.cayenne.access.DataContextSerializationTest)
  testLocalCacheRefreshObjectsRefresh(org.apache.cayenne.access.DataContextQueryCachingTest)
  testGeneratePkForDbEntity(org.apache.cayenne.dba.PkGeneratorTest)
  testUnrefreshingToOne(org.apache.cayenne.access.DataContextRelationshipQueryTest)
  testRefreshingToOne(org.apache.cayenne.access.DataContextRelationshipQueryTest)
  testDateParameter(org.apache.cayenne.access.DataContextEJBQLConditionsTest)
  testArithmetics(org.apache.cayenne.access.DataContextEJBQLConditionsTest)
  testLike1(org.apache.cayenne.access.DataContextEJBQLConditionsTest)
  testNotLike(org.apache.cayenne.access.DataContextEJBQLConditionsTest)
  testLike2(org.apache.cayenne.access.DataContextEJBQLConditionsTest)
  testLikeEscape(org.apache.cayenne.access.DataContextEJBQLConditionsTest)
  testIn(org.apache.cayenne.access.DataContextEJBQLConditionsTest)
  testNotIn(org.apache.cayenne.access.DataContextEJBQLConditionsTest)
  testInSubquery(org.apache.cayenne.access.DataContextEJBQLConditionsTest)
  testCollectionEmpty(org.apache.cayenne.access.DataContextEJBQLConditionsTest)
  testCollectionNotEmpty(org.apache.cayenne.access.DataContextEJBQLConditionsTest)
  testCollectionNotEmptyExplicitDistinct(org.apache.cayenne.access.DataContextEJBQLConditionsTest)
  testCollectionMemberOfParameter(org.apache.cayenne.access.DataContextEJBQLConditionsTest)
  testGreaterOrEquals(org.apache.cayenne.access.DataContextEJBQLConditionsTest)
  testLessOrEquals(org.apache.cayenne.access.DataContextEJBQLConditionsTest)
  testCollectionNotMemberOfParameter(org.apache.cayenne.access.DataContextEJBQLConditionsTest)
  testCollectionMemberOfThetaJoin(org.apache.cayenne.access.DataContextEJBQLConditionsTest)
  testSerializeCommitted(org.apache.cayenne.DataObjectSerializationTest)
  testFetchLimit(org.apache.cayenne.query.SelectQueryTest)
  testFetchOffset(org.apache.cayenne.query.SelectQueryTest)
  testDbEntityRoot(org.apache.cayenne.query.SelectQueryTest)
  testFetchLimitWithOffset(org.apache.cayenne.query.SelectQueryTest)
  testFetchOffsetWithQualifier(org.apache.cayenne.query.SelectQueryTest)
  testFetchLimitWithQualifier(org.apache.cayenne.query.SelectQueryTest)
  testSelectAllObjectsRootEntityName(org.apache.cayenne.query.SelectQueryTest)
  testSelectAllObjectsRootClass(org.apache.cayenne.query.SelectQueryTest)
  testSelectAllObjectsRootObjEntity(org.apache.cayenne.query.SelectQueryTest)
  testSelectLikeExactMatch(org.apache.cayenne.query.SelectQueryTest)
  testSelectNotLikeSingleWildcardMatch(org.apache.cayenne.query.SelectQueryTest)
  testSelectNotLikeIgnoreCaseSingleWildcardMatch(org.apache.cayenne.query.SelectQueryTest)
  testSelectLikeCaseSensitive(org.apache.cayenne.query.SelectQueryTest)
  testSelectLikeSingleWildcardMatch(org.apache.cayenne.query.SelectQueryTest)
  testSelectLikeMultipleWildcardMatch(org.apache.cayenne.query.SelectQueryTest)
  testSelectLikeIgnoreCaseObjects1(org.apache.cayenne.query.SelectQueryTest)
  testSelectLikeIgnoreCaseObjects2(org.apache.cayenne.query.SelectQueryTest)
  testSelectLikeIgnoreCaseClob(org.apache.cayenne.query.SelectQueryTest)
  testSelectIn(org.apache.cayenne.query.SelectQueryTest)
  testSelectParameterizedIn(org.apache.cayenne.query.SelectQueryTest)
  testSelectParameterizedEmptyIn(org.apache.cayenne.query.SelectQueryTest)
  testSelectParameterizedEmptyNotIn(org.apache.cayenne.query.SelectQueryTest)
  testSelectEmptyIn(org.apache.cayenne.query.SelectQueryTest)
  testSelectEmptyNotIn(org.apache.cayenne.query.SelectQueryTest)
  testSelectBooleanTrue(org.apache.cayenne.query.SelectQueryTest)
  testSelectBooleanNotTrueOr(org.apache.cayenne.query.SelectQueryTest)
  testSelectBooleanFalse(org.apache.cayenne.query.SelectQueryTest)
  testSelectBooleanFalseOr(org.apache.cayenne.query.SelectQueryTest)
  testRouteWithPrefetches(org.apache.cayenne.query.SelectQueryTest)
  testRouteQueryWithPrefetchesNoReverse(org.apache.cayenne.query.SelectQueryTest)
  testRouteQueryWithPrefetchesPrefetchExpressionPath(org.apache.cayenne.query.SelectQueryTest)
  testPrefetchToOne(org.apache.cayenne.unit.jira.CAY_788Test)
  testInsert(org.apache.cayenne.access.DataContextCharPKTest)
  testUpdate(org.apache.cayenne.access.DataContextCharPKTest)
  testDelete(org.apache.cayenne.access.DataContextCharPKTest)
  testBIGINT(org.apache.cayenne.access.ReturnTypesMappingTest)
  testBIGINT2(org.apache.cayenne.access.ReturnTypesMappingTest)
  testBINARY(org.apache.cayenne.access.ReturnTypesMappingTest)
  testBINARY2(org.apache.cayenne.access.ReturnTypesMappingTest)
  testBIT(org.apache.cayenne.access.ReturnTypesMappingTest)
  testBIT2(org.apache.cayenne.access.ReturnTypesMappingTest)
  testBLOB(org.apache.cayenne.access.ReturnTypesMappingTest)
  testBLOB2(org.apache.cayenne.access.ReturnTypesMappingTest)
  testBOOLEAN(org.apache.cayenne.access.ReturnTypesMappingTest)
  testBOOLEAN2(org.apache.cayenne.access.ReturnTypesMappingTest)
  testCHAR(org.apache.cayenne.access.ReturnTypesMappingTest)
  testCHAR2(org.apache.cayenne.access.ReturnTypesMappingTest)
  testCLOB(org.apache.cayenne.access.ReturnTypesMappingTest)
  testCLOB2(org.apache.cayenne.access.ReturnTypesMappingTest)
  testDATE(org.apache.cayenne.access.ReturnTypesMappingTest)
  testDATE2(org.apache.cayenne.access.ReturnTypesMappingTest)
  testDECIMAL(org.apache.cayenne.access.ReturnTypesMappingTest)
  testDECIMAL2(org.apache.cayenne.access.ReturnTypesMappingTest)
  testDOUBLE(org.apache.cayenne.access.ReturnTypesMappingTest)
  testDOUBLE2(org.apache.cayenne.access.ReturnTypesMappingTest)
  testFLOAT(org.apache.cayenne.access.ReturnTypesMappingTest)
  testFLOAT2(org.apache.cayenne.access.ReturnTypesMappingTest)
  testINTEGER(org.apache.cayenne.access.ReturnTypesMappingTest)
  testINTEGER2(org.apache.cayenne.access.ReturnTypesMappingTest)
  testLONGVARBINARY(org.apache.cayenne.access.ReturnTypesMappingTest)
  testLONGVARBINARY2(org.apache.cayenne.access.ReturnTypesMappingTest)
  testLONGVARCHAR(org.apache.cayenne.access.ReturnTypesMappingTest)
  testLONGVARCHAR2(org.apache.cayenne.access.ReturnTypesMappingTest)
  testNUMERIC(org.apache.cayenne.access.ReturnTypesMappingTest)
  testNUMERIC2(org.apache.cayenne.access.ReturnTypesMappingTest)
  testREAL(org.apache.cayenne.access.ReturnTypesMappingTest)
  testREAL2(org.apache.cayenne.access.ReturnTypesMappingTest)
  testSMALLINT(org.apache.cayenne.access.ReturnTypesMappingTest)
  testSMALLINT2(org.apache.cayenne.access.ReturnTypesMappingTest)
  testTIME(org.apache.cayenne.access.ReturnTypesMappingTest)
  testTIME2(org.apache.cayenne.access.ReturnTypesMappingTest)
  testSQLTemplateTime(org.apache.cayenne.access.ReturnTypesMappingTest)
  testTIMESTAMP(org.apache.cayenne.access.ReturnTypesMappingTest)
  testTIMESTAMP2(org.apache.cayenne.access.ReturnTypesMappingTest)
  testTINYINT(org.apache.cayenne.access.ReturnTypesMappingTest)
  testTINYINT2(org.apache.cayenne.access.ReturnTypesMappingTest)
  testVARBINARY(org.apache.cayenne.access.ReturnTypesMappingTest)
  testVARBINARY2(org.apache.cayenne.access.ReturnTypesMappingTest)
  testVARCHAR(org.apache.cayenne.access.ReturnTypesMappingTest)
  testVARCHAR2(org.apache.cayenne.access.ReturnTypesMappingTest)
  testGet1(org.apache.cayenne.access.SimpleIdIncrementalFaultListDataRowsTest)
  testIndexOf1(org.apache.cayenne.access.SimpleIdIncrementalFaultListDataRowsTest)
  testIndexOf2(org.apache.cayenne.access.SimpleIdIncrementalFaultListDataRowsTest)
  testLastIndexOf1(org.apache.cayenne.access.SimpleIdIncrementalFaultListDataRowsTest)
  testLastIndexOf2(org.apache.cayenne.access.SimpleIdIncrementalFaultListDataRowsTest)
  testIterator(org.apache.cayenne.access.SimpleIdIncrementalFaultListDataRowsTest)
  testRefetchRootWithUpdatedAttributes(org.apache.cayenne.access.DataContextRefreshingTest)
  testRefetchRootWithNullifiedToOne(org.apache.cayenne.access.DataContextRefreshingTest)
  testRefetchRootWithChangedToOneTarget(org.apache.cayenne.access.DataContextRefreshingTest)
  testRefetchRootWithNullToOneTargetChangedToNotNull(org.apache.cayenne.access.DataContextRefreshingTest)
  testRefetchRootWithDeletedToMany(org.apache.cayenne.access.DataContextRefreshingTest)
  testRefetchRootWithAddedToMany(org.apache.cayenne.access.DataContextRefreshingTest)
  testInvalidateRootWithUpdatedAttributes(org.apache.cayenne.access.DataContextRefreshingTest)
  testInvalidateRootWithNullifiedToOne(org.apache.cayenne.access.DataContextRefreshingTest)
  testInvalidateRootWithChangedToOneTarget(org.apache.cayenne.access.DataContextRefreshingTest)
  testInvalidateRootWithNullToOneTargetChangedToNotNull(org.apache.cayenne.access.DataContextRefreshingTest)
  testInvalidateRootWithDeletedToMany(org.apache.cayenne.access.DataContextRefreshingTest)
  testInvaliateRootWithAddedToMany(org.apache.cayenne.access.DataContextRefreshingTest)
  testInvalidateThenModify(org.apache.cayenne.access.DataContextRefreshingTest)
  testModifyHollow(org.apache.cayenne.access.DataContextRefreshingTest)

Tests run: 2051, Failures: 5, Errors: 821, Skipped: 0

[INFO] ------------------------------------------------------------------------
[ERROR] BUILD FAILURE
[INFO] ------------------------------------------------------------------------
[INFO] There are test failures.

Please refer to <http://hudson.zones.apache.org/hudson/job/Cayenne-trunk/./cayenneTestConnection=derby,jdk=JDK%201.5%20(latest),label=Ubuntu/ws/trunk/framework/cayenne-jdk1.5-unpublished/target/surefire-reports>
for the individual test results.
[INFO] ------------------------------------------------------------------------
[INFO] Trace
org.apache.maven.BuildFailureException: There are test failures.

Please refer to <http://hudson.zones.apache.org/hudson/job/Cayenne-trunk/./cayenneTestConnection=derby,jdk=JDK%201.5%20(latest),label=Ubuntu/ws/trunk/framework/cayenne-jdk1.5-unpublished/target/surefire-reports>
for the individual test results.
	at org.apache.maven.lifecycle.DefaultLifecycleExecutor.executeGoals(DefaultLifecycleExecutor.java:715)
	at org.apache.maven.lifecycle.DefaultLifecycleExecutor.executeGoalWithLifecycle(DefaultLifecycleExecutor.java:556)
	at org.apache.maven.lifecycle.DefaultLifecycleExecutor.executeGoal(DefaultLifecycleExecutor.java:535)
	at org.apache.maven.lifecycle.DefaultLifecycleExecutor.executeGoalAndHandleFailures(DefaultLifecycleExecutor.java:387)
	at org.apache.maven.lifecycle.DefaultLifecycleExecutor.executeTaskSegments(DefaultLifecycleExecutor.java:348)
	at org.apache.maven.lifecycle.DefaultLifecycleExecutor.execute(DefaultLifecycleExecutor.java:180)
	at org.apache.maven.DefaultMaven.doExecute(DefaultMaven.java:328)
	at org.apache.maven.DefaultMaven.execute(DefaultMaven.java:138)
	at org.apache.maven.cli.MavenCli.main(MavenCli.java:362)
	at org.apache.maven.cli.compat.CompatibleMain.main(CompatibleMain.java:60)
	at sun.reflect.NativeMethodAccessorImpl.invoke0(Native Method)
	at sun.reflect.NativeMethodAccessorImpl.invoke(NativeMethodAccessorImpl.java:39)
	at sun.reflect.DelegatingMethodAccessorImpl.invoke(DelegatingMethodAccessorImpl.java:25)
	at java.lang.reflect.Method.invoke(Method.java:592)
	at org.codehaus.classworlds.Launcher.launchEnhanced(Launcher.java:315)
	at org.codehaus.classworlds.Launcher.launch(Launcher.java:255)
	at org.codehaus.classworlds.Launcher.mainWithExitCode(Launcher.java:430)
	at org.codehaus.classworlds.Launcher.main(Launcher.java:375)
Caused by: org.apache.maven.plugin.MojoFailureException: There are test failures.

Please refer to <http://hudson.zones.apache.org/hudson/job/Cayenne-trunk/./cayenneTestConnection=derby,jdk=JDK%201.5%20(latest),label=Ubuntu/ws/trunk/framework/cayenne-jdk1.5-unpublished/target/surefire-reports>
for the individual test results.
	at org.apache.maven.plugin.surefire.SurefirePlugin.execute(SurefirePlugin.java:599)
	at org.apache.maven.plugin.DefaultPluginManager.executeMojo(DefaultPluginManager.java:490)
	at org.apache.maven.lifecycle.DefaultLifecycleExecutor.executeGoals(DefaultLifecycleExecutor.java:694)
	... 17 more
[INFO] ------------------------------------------------------------------------
[INFO] Total time: 1 minute 2 seconds
[INFO] Finished at: Thu Jan 14 10:55:36 UTC 2010
[INFO] Final Memory: 43M/201M
[INFO] ------------------------------------------------------------------------
Recording test results


Mime
View raw message