cayenne-commits mailing list archives

Site index · List index
Message view « Date » · « Thread »
Top « Date » · « Thread »
From Apache Hudson Server <hud...@hudson.zones.apache.org>
Subject Build failed in Hudson: Cayenne-trunk » derby,JDK 1.6 (latest),master #149
Date Mon, 04 Jan 2010 13:35:21 GMT
See <http://hudson.zones.apache.org/hudson/job/Cayenne-trunk/./cayenneTestConnection=derby,jdk=JDK%201.6%20(latest),label=master/149/changes>

Changes:

[aadamchik] CAY-1350 Implement memorized sorting of modeler columns

    patch by Ksenia Khailenko. fixing remaining issues

[oltka] CAY-1251 Memorize user-selected column widths in preferences

* new error: if rename class nema in embeddable and we have designed embeddable attribute,
 Exception in thread "AWT-EventQueue-0" java.lang.ClassCastException: javax.swing.table.DefaultTableModel
	at org.apache.cayenne.modeler.util.CayenneTable.getCayenneModel(CayenneTable.java:87)
	at org.apache.cayenne.modeler.util.CayenneTable.select(CayenneTable.java:103)
	at org.apache.cayenne.modeler.editor.ObjEntityAttributeTab.objAttributeChanged(ObjEntityAttributeTab.java:288)
	at org.apache.cayenne.modeler.ProjectController.fireObjAttributeEvent(ProjectController.java:1531)
	at org.apache.cayenne.modeler.editor.EmbeddableTab.setClassName(EmbeddableTab.java:161)
	at org.apache.cayenne.modeler.editor.EmbeddableTab$1.updateModel(EmbeddableTab.java:78)
	at org.apache.cayenne.modeler.util.TextAdapter.updateModel(TextAdapter.java:160)
	at org.apache.cayenne.modeler.util.TextAdapter$2.verify(TextAdapter.java:93)

------------------------------------------
[...truncated 66025 lines...]
Running org.apache.cayenne.tools.CayenneGeneratorTaskTest
Jan 4, 2010 1:33:40 PM org.springframework.beans.factory.xml.XmlBeanDefinitionReader loadBeanDefinitions
INFO: Loading XML bean definitions from resource loaded through InputStream
Jan 4, 2010 1:33:40 PM org.springframework.core.CollectionFactory <clinit>
INFO: Commons Collections 3.x available
Jan 4, 2010 1:33:41 PM org.apache.cayenne.unit.CayenneResources setupTestDir
INFO: No property 'cayenne.test.dir' set. Using default directory: 'target/testrun'
Jan 4, 2010 1:33:41 PM org.apache.cayenne.unit.CayenneResources setConnectionKey
INFO: test connection info: [org.apache.cayenne.conn.DataSourceInfo:
   user name: username
   password: **********
   driver: org.apache.derby.jdbc.EmbeddedDriver
   db adapter class: org.apache.cayenne.dba.derby.DerbyAdapter
   url: jdbc:derby:/tmp/cayenne/derby;create=true
   min. connections: 1
   max. connections: 1
]
Jan 4, 2010 1:33:48 PM org.apache.cayenne.unit.AccessStackAdapter executeDDL
INFO: ALTER TABLE MT_TOONE_DEP DROP CONSTRAINT SQL100104132812811
Jan 4, 2010 1:33:48 PM org.apache.cayenne.unit.AccessStackAdapter executeDDL
INFO: ALTER TABLE CLOB_TEST_RELATION DROP CONSTRAINT SQL100104132813890
Jan 4, 2010 1:33:48 PM org.apache.cayenne.unit.AccessStackAdapter executeDDL
INFO: ALTER TABLE MT_DELETE_NULLIFY DROP CONSTRAINT SQL100104132812841
Jan 4, 2010 1:33:48 PM org.apache.cayenne.unit.AccessStackAdapter executeDDL
INFO: ALTER TABLE PAINTING_INFO DROP CONSTRAINT SQL100104132813970
Jan 4, 2010 1:33:48 PM org.apache.cayenne.unit.AccessStackAdapter executeDDL
INFO: ALTER TABLE GENERIC2 DROP CONSTRAINT SQL100104132812170
Jan 4, 2010 1:33:48 PM org.apache.cayenne.unit.AccessStackAdapter executeDDL
INFO: ALTER TABLE DELETE_RULE_TEST3 DROP CONSTRAINT SQL100104132813500
Jan 4, 2010 1:33:48 PM org.apache.cayenne.unit.AccessStackAdapter executeDDL
INFO: ALTER TABLE DELETE_RULE_TEST1 DROP CONSTRAINT SQL100104132813521
Jan 4, 2010 1:33:48 PM org.apache.cayenne.unit.AccessStackAdapter executeDDL
INFO: ALTER TABLE COLLECTION_TO_MANY_TARGET DROP CONSTRAINT SQL100104132813491
Jan 4, 2010 1:33:48 PM org.apache.cayenne.unit.AccessStackAdapter executeDDL
INFO: ALTER TABLE ARTIST_EXHIBIT DROP CONSTRAINT SQL100104132813921
Jan 4, 2010 1:33:48 PM org.apache.cayenne.unit.AccessStackAdapter executeDDL
INFO: ALTER TABLE ARTIST_EXHIBIT DROP CONSTRAINT SQL100104132813930
Jan 4, 2010 1:33:48 PM org.apache.cayenne.unit.AccessStackAdapter executeDDL
INFO: ALTER TABLE SET_TO_MANY_TARGET DROP CONSTRAINT SQL100104132813511
Jan 4, 2010 1:33:48 PM org.apache.cayenne.unit.AccessStackAdapter executeDDL
INFO: ALTER TABLE BASE_ENTITY DROP CONSTRAINT SQL100104132813040
Jan 4, 2010 1:33:48 PM org.apache.cayenne.unit.AccessStackAdapter executeDDL
INFO: ALTER TABLE BASE_ENTITY DROP CONSTRAINT SQL100104132813050
Jan 4, 2010 1:33:48 PM org.apache.cayenne.unit.AccessStackAdapter executeDDL
INFO: ALTER TABLE REFLEXIVE_AND_TO_ONE DROP CONSTRAINT SQL100104132813470
Jan 4, 2010 1:33:48 PM org.apache.cayenne.unit.AccessStackAdapter executeDDL
INFO: ALTER TABLE REFLEXIVE_AND_TO_ONE DROP CONSTRAINT SQL100104132813471
Jan 4, 2010 1:33:48 PM org.apache.cayenne.unit.AccessStackAdapter executeDDL
INFO: ALTER TABLE MEANINGFUL_FK DROP CONSTRAINT SQL100104132813490
Jan 4, 2010 1:33:48 PM org.apache.cayenne.unit.AccessStackAdapter executeDDL
INFO: ALTER TABLE MAP_TO_MANY_TARGET DROP CONSTRAINT SQL100104132813430
Jan 4, 2010 1:33:48 PM org.apache.cayenne.unit.AccessStackAdapter executeDDL
INFO: ALTER TABLE ID_MAP_TO_MANY_TARGET DROP CONSTRAINT SQL100104132813420
Jan 4, 2010 1:33:48 PM org.apache.cayenne.unit.AccessStackAdapter executeDDL
INFO: ALTER TABLE COMPOUND_FK_TEST DROP CONSTRAINT SQL100104132813940
Jan 4, 2010 1:33:48 PM org.apache.cayenne.unit.AccessStackAdapter executeDDL
INFO: ALTER TABLE MT_TABLE2 DROP CONSTRAINT SQL100104132812870
Jan 4, 2010 1:33:48 PM org.apache.cayenne.unit.AccessStackAdapter executeDDL
INFO: ALTER TABLE MT_TABLE2 DROP CONSTRAINT SQL100104132812860
Jan 4, 2010 1:33:48 PM org.apache.cayenne.unit.AccessStackAdapter executeDDL
INFO: ALTER TABLE ARTIST_GROUP DROP CONSTRAINT SQL100104132813871
Jan 4, 2010 1:33:48 PM org.apache.cayenne.unit.AccessStackAdapter executeDDL
INFO: ALTER TABLE ARTIST_GROUP DROP CONSTRAINT SQL100104132813870
Jan 4, 2010 1:33:48 PM org.apache.cayenne.unit.AccessStackAdapter executeDDL
INFO: ALTER TABLE PAINTING1 DROP CONSTRAINT SQL100104132813910
Jan 4, 2010 1:33:49 PM org.apache.cayenne.unit.AccessStackAdapter executeDDL
INFO: ALTER TABLE QUALIFIED2 DROP CONSTRAINT SQL100104132813080
Jan 4, 2010 1:33:49 PM org.apache.cayenne.unit.AccessStackAdapter executeDDL
INFO: ALTER TABLE DELETE_RULE_JOIN DROP CONSTRAINT SQL100104132813530
Jan 4, 2010 1:33:49 PM org.apache.cayenne.unit.AccessStackAdapter executeDDL
INFO: ALTER TABLE DELETE_RULE_JOIN DROP CONSTRAINT SQL100104132813540
Jan 4, 2010 1:33:49 PM org.apache.cayenne.unit.AccessStackAdapter executeDDL
INFO: ALTER TABLE MT_MAP_TO_MANY_TARGET DROP CONSTRAINT SQL100104132812810
Jan 4, 2010 1:33:49 PM org.apache.cayenne.unit.AccessStackAdapter executeDDL
INFO: ALTER TABLE ARTGROUP DROP CONSTRAINT SQL100104132813861
Jan 4, 2010 1:33:49 PM org.apache.cayenne.unit.AccessStackAdapter executeDDL
INFO: ALTER TABLE PERSON_NOTES DROP CONSTRAINT SQL100104132813030
Jan 4, 2010 1:33:49 PM org.apache.cayenne.unit.AccessStackAdapter executeDDL
INFO: ALTER TABLE CROSSDB_M2E2 DROP CONSTRAINT SQL100104132812430
Jan 4, 2010 1:33:49 PM org.apache.cayenne.unit.AccessStackAdapter executeDDL
INFO: ALTER TABLE MIXED_PERSISTENCE_STRATEGY2 DROP CONSTRAINT SQL100104132813880
Jan 4, 2010 1:33:49 PM org.apache.cayenne.unit.AccessStackAdapter executeDDL
INFO: ALTER TABLE CHAR_FK_TEST DROP CONSTRAINT SQL100104132813860
Jan 4, 2010 1:33:49 PM org.apache.cayenne.unit.AccessStackAdapter executeDDL
INFO: ALTER TABLE LOCKING_HELPER DROP CONSTRAINT SQL100104132812400
Jan 4, 2010 1:33:49 PM org.apache.cayenne.unit.AccessStackAdapter executeDDL
INFO: ALTER TABLE PAINTING DROP CONSTRAINT SQL100104132813950
Jan 4, 2010 1:33:49 PM org.apache.cayenne.unit.AccessStackAdapter executeDDL
INFO: ALTER TABLE PAINTING DROP CONSTRAINT SQL100104132813941
Jan 4, 2010 1:33:49 PM org.apache.cayenne.unit.AccessStackAdapter executeDDL
INFO: ALTER TABLE REL_LOCKING_TEST DROP CONSTRAINT SQL100104132812390
Jan 4, 2010 1:33:49 PM org.apache.cayenne.unit.AccessStackAdapter executeDDL
INFO: ALTER TABLE GENERATED_COLUMN_DEP DROP CONSTRAINT SQL100104132813920
Jan 4, 2010 1:33:49 PM org.apache.cayenne.unit.AccessStackAdapter executeDDL
INFO: ALTER TABLE MT_DELETE_DENY DROP CONSTRAINT SQL100104132812840
Jan 4, 2010 1:33:49 PM org.apache.cayenne.unit.AccessStackAdapter executeDDL
INFO: ALTER TABLE TO_MANY_FKDEP DROP CONSTRAINT SQL100104132813520
Jan 4, 2010 1:33:49 PM org.apache.cayenne.unit.AccessStackAdapter executeDDL
INFO: ALTER TABLE FLATTENED_CIRCULAR_JOIN DROP CONSTRAINT SQL100104132813460
Jan 4, 2010 1:33:49 PM org.apache.cayenne.unit.AccessStackAdapter executeDDL
INFO: ALTER TABLE FLATTENED_CIRCULAR_JOIN DROP CONSTRAINT SQL100104132813451
Jan 4, 2010 1:33:49 PM org.apache.cayenne.unit.AccessStackAdapter executeDDL
INFO: ALTER TABLE MEANINGFUL_PK_DEP DROP CONSTRAINT SQL100104132813881
Jan 4, 2010 1:33:49 PM org.apache.cayenne.unit.AccessStackAdapter executeDDL
INFO: ALTER TABLE MT_REFLEXIVE DROP CONSTRAINT SQL100104132812800
Jan 4, 2010 1:33:49 PM org.apache.cayenne.unit.AccessStackAdapter executeDDL
INFO: ALTER TABLE MT_DELETE_CASCADE DROP CONSTRAINT SQL100104132812850
Jan 4, 2010 1:33:49 PM org.apache.cayenne.unit.AccessStackAdapter executeDDL
INFO: ALTER TABLE DEPARTMENT DROP CONSTRAINT SQL100104132813000
Jan 4, 2010 1:33:49 PM org.apache.cayenne.unit.AccessStackAdapter executeDDL
INFO: ALTER TABLE CLOB_DETAIL DROP CONSTRAINT SQL100104132813510
Jan 4, 2010 1:33:49 PM org.apache.cayenne.unit.AccessStackAdapter executeDDL
INFO: ALTER TABLE GENERATED_COLUMN_COMP_KEY DROP CONSTRAINT SQL100104132813900
Jan 4, 2010 1:33:49 PM org.apache.cayenne.unit.AccessStackAdapter executeDDL
INFO: ALTER TABLE COUNTRY DROP CONSTRAINT SQL100104132812820
Jan 4, 2010 1:33:49 PM org.apache.cayenne.unit.AccessStackAdapter executeDDL
INFO: ALTER TABLE ADDRESS DROP CONSTRAINT SQL100104132813051
Jan 4, 2010 1:33:49 PM org.apache.cayenne.unit.AccessStackAdapter executeDDL
INFO: ALTER TABLE COMPLEX_JOIN DROP CONSTRAINT SQL100104132813560
Jan 4, 2010 1:33:49 PM org.apache.cayenne.unit.AccessStackAdapter executeDDL
INFO: ALTER TABLE COMPLEX_JOIN DROP CONSTRAINT SQL100104132813550
Jan 4, 2010 1:33:49 PM org.apache.cayenne.unit.AccessStackAdapter executeDDL
INFO: ALTER TABLE FLATTENED_TEST_2 DROP CONSTRAINT SQL100104132813480
Jan 4, 2010 1:33:49 PM org.apache.cayenne.unit.AccessStackAdapter executeDDL
INFO: ALTER TABLE EXHIBIT DROP CONSTRAINT SQL100104132813891
Jan 4, 2010 1:33:49 PM org.apache.cayenne.unit.AccessStackAdapter executeDDL
INFO: ALTER TABLE FLATTENED_TEST_3 DROP CONSTRAINT SQL100104132813541
Jan 4, 2010 1:33:49 PM org.apache.cayenne.unit.AccessStackAdapter executeDDL
INFO: ALTER TABLE MT_JOIN45 DROP CONSTRAINT SQL100104132812831
Jan 4, 2010 1:33:49 PM org.apache.cayenne.unit.AccessStackAdapter executeDDL
INFO: ALTER TABLE MT_JOIN45 DROP CONSTRAINT SQL100104132812830
Jan 4, 2010 1:33:49 PM org.apache.cayenne.unit.AccessStackAdapter executeDDL
INFO: ALTER TABLE PERSON DROP CONSTRAINT SQL100104132813020
Jan 4, 2010 1:33:49 PM org.apache.cayenne.unit.AccessStackAdapter executeDDL
INFO: ALTER TABLE PERSON DROP CONSTRAINT SQL100104132813010
Jan 4, 2010 1:33:49 PM org.apache.cayenne.unit.AccessStackAdapter executeDDL
INFO: ALTER TABLE TO_ONEFK1 DROP CONSTRAINT SQL100104132813450
Jan 4, 2010 1:33:49 PM org.apache.cayenne.unit.AbstractAccessStack dropSchema
INFO: DROP TABLE EMBED_ENTITY1
Jan 4, 2010 1:33:50 PM org.apache.cayenne.unit.CayenneResources getResources
SEVERE: Error generating schema...
java.sql.SQLSyntaxErrorException: Syntax error: org.apache.derby.catalog.IndexDescriptor.getKeyColumnPosition.
	at org.apache.derby.impl.jdbc.SQLExceptionFactory40.getSQLException(Unknown Source)
	at org.apache.derby.impl.jdbc.Util.generateCsSQLException(Unknown Source)
	at org.apache.derby.impl.jdbc.TransactionResourceImpl.wrapInSQLException(Unknown Source)
	at org.apache.derby.impl.jdbc.TransactionResourceImpl.handleException(Unknown Source)
	at org.apache.derby.impl.jdbc.EmbedConnection.handleException(Unknown Source)
	at org.apache.derby.impl.jdbc.ConnectionChild.handleException(Unknown Source)
	at org.apache.derby.impl.jdbc.EmbedStatement.executeStatement(Unknown Source)
	at org.apache.derby.impl.jdbc.EmbedPreparedStatement.executeStatement(Unknown Source)
	at org.apache.derby.impl.jdbc.EmbedPreparedStatement.executeQuery(Unknown Source)
	at org.apache.derby.impl.jdbc.EmbedDatabaseMetaData.getExportedKeys(Unknown Source)
	at org.apache.cayenne.unit.AccessStackAdapter.getConstraints(AccessStackAdapter.java:306)
	at org.apache.cayenne.unit.AccessStackAdapter.dropConstraints(AccessStackAdapter.java:87)
	at org.apache.cayenne.unit.AccessStackAdapter.willDropTables(AccessStackAdapter.java:80)
	at org.apache.cayenne.unit.AbstractAccessStack.dropSchema(AbstractAccessStack.java:212)
	at org.apache.cayenne.unit.SimpleAccessStack.dropSchema(SimpleAccessStack.java:112)
	at org.apache.cayenne.unit.CayenneResources.rebuildSchema(CayenneResources.java:190)
	at org.apache.cayenne.unit.CayenneResources.getResources(CayenneResources.java:108)
	at org.apache.cayenne.tools.CayenneGeneratorTaskTest.<clinit>(CayenneGeneratorTaskTest.java:40)
	at sun.reflect.NativeConstructorAccessorImpl.newInstance0(Native Method)
	at sun.reflect.NativeConstructorAccessorImpl.newInstance(NativeConstructorAccessorImpl.java:39)
	at sun.reflect.DelegatingConstructorAccessorImpl.newInstance(DelegatingConstructorAccessorImpl.java:27)
	at java.lang.reflect.Constructor.newInstance(Constructor.java:513)
	at junit.framework.TestSuite.createTest(TestSuite.java:131)
	at junit.framework.TestSuite.addTestMethod(TestSuite.java:114)
	at junit.framework.TestSuite.<init>(TestSuite.java:75)
	at sun.reflect.NativeConstructorAccessorImpl.newInstance0(Native Method)
	at sun.reflect.NativeConstructorAccessorImpl.newInstance(NativeConstructorAccessorImpl.java:39)
	at sun.reflect.DelegatingConstructorAccessorImpl.newInstance(DelegatingConstructorAccessorImpl.java:27)
	at java.lang.reflect.Constructor.newInstance(Constructor.java:513)
	at org.apache.maven.surefire.junit.JUnitTestSet.constructTestObject(JUnitTestSet.java:151)
	at org.apache.maven.surefire.junit.JUnitTestSet.execute(JUnitTestSet.java:197)
	at org.apache.maven.surefire.suite.AbstractDirectoryTestSuite.executeTestSet(AbstractDirectoryTestSuite.java:143)
	at org.apache.maven.surefire.suite.AbstractDirectoryTestSuite.execute(AbstractDirectoryTestSuite.java:130)
	at org.apache.maven.surefire.Surefire.run(Surefire.java:180)
	at sun.reflect.NativeMethodAccessorImpl.invoke0(Native Method)
	at sun.reflect.NativeMethodAccessorImpl.invoke(NativeMethodAccessorImpl.java:39)
	at sun.reflect.DelegatingMethodAccessorImpl.invoke(DelegatingMethodAccessorImpl.java:25)
	at java.lang.reflect.Method.invoke(Method.java:597)
	at org.apache.maven.surefire.booter.SurefireBooter.runSuitesInProcess(SurefireBooter.java:350)
	at org.apache.maven.surefire.booter.SurefireBooter.main(SurefireBooter.java:1021)
Caused by: java.sql.SQLException: Syntax error: org.apache.derby.catalog.IndexDescriptor.getKeyColumnPosition.
	at org.apache.derby.impl.jdbc.SQLExceptionFactory.getSQLException(Unknown Source)
	at org.apache.derby.impl.jdbc.SQLExceptionFactory40.wrapArgsForTransportAcrossDRDA(Unknown
Source)
	... 40 more
Caused by: ERROR 42X01: Syntax error: org.apache.derby.catalog.IndexDescriptor.getKeyColumnPosition.
	at org.apache.derby.iapi.error.StandardException.newException(Unknown Source)
	at org.apache.derby.impl.sql.compile.MethodCallNode.resolveMethodCall(Unknown Source)
	at org.apache.derby.impl.sql.compile.NonStaticMethodCallNode.bindExpression(Unknown Source)
	at org.apache.derby.impl.sql.compile.JavaToSQLValueNode.bindExpression(Unknown Source)
	at org.apache.derby.impl.sql.compile.ResultColumn.bindExpression(Unknown Source)
	at org.apache.derby.impl.sql.compile.ResultColumnList.bindExpressions(Unknown Source)
	at org.apache.derby.impl.sql.compile.SelectNode.bindExpressions(Unknown Source)
	at org.apache.derby.impl.sql.compile.FromSubquery.bindExpressions(Unknown Source)
	at org.apache.derby.impl.sql.compile.FromList.bindExpressions(Unknown Source)
	at org.apache.derby.impl.sql.compile.SelectNode.bindExpressions(Unknown Source)
	at org.apache.derby.impl.sql.compile.DMLStatementNode.bindExpressions(Unknown Source)
	at org.apache.derby.impl.sql.compile.DMLStatementNode.bind(Unknown Source)
	at org.apache.derby.impl.sql.compile.CursorNode.bindStatement(Unknown Source)
	at org.apache.derby.impl.sql.GenericStatement.prepMinion(Unknown Source)
	at org.apache.derby.impl.sql.GenericStatement.prepare(Unknown Source)
	at org.apache.derby.impl.sql.GenericPreparedStatement.rePrepare(Unknown Source)
	at org.apache.derby.impl.sql.GenericPreparedStatement.executeStmt(Unknown Source)
	at org.apache.derby.impl.sql.GenericPreparedStatement.execute(Unknown Source)
	... 34 more
org.apache.maven.surefire.booter.SurefireExecutionException: org.apache.cayenne.tools.CayenneGeneratorTaskTest;
nested exception is java.lang.ExceptionInInitializerError: null; nested exception is org.apache.maven.surefire.testset.TestSetFailedException:
org.apache.cayenne.tools.CayenneGeneratorTaskTest; nested exception is java.lang.ExceptionInInitializerError:
null
org.apache.maven.surefire.testset.TestSetFailedException: org.apache.cayenne.tools.CayenneGeneratorTaskTest;
nested exception is java.lang.ExceptionInInitializerError: null
java.lang.ExceptionInInitializerError
	at sun.reflect.NativeConstructorAccessorImpl.newInstance0(Native Method)
	at sun.reflect.NativeConstructorAccessorImpl.newInstance(NativeConstructorAccessorImpl.java:39)
	at sun.reflect.DelegatingConstructorAccessorImpl.newInstance(DelegatingConstructorAccessorImpl.java:27)
	at java.lang.reflect.Constructor.newInstance(Constructor.java:513)
	at junit.framework.TestSuite.createTest(TestSuite.java:131)
	at junit.framework.TestSuite.addTestMethod(TestSuite.java:114)
	at junit.framework.TestSuite.<init>(TestSuite.java:75)
	at sun.reflect.NativeConstructorAccessorImpl.newInstance0(Native Method)
	at sun.reflect.NativeConstructorAccessorImpl.newInstance(NativeConstructorAccessorImpl.java:39)
	at sun.reflect.DelegatingConstructorAccessorImpl.newInstance(DelegatingConstructorAccessorImpl.java:27)
	at java.lang.reflect.Constructor.newInstance(Constructor.java:513)
	at org.apache.maven.surefire.junit.JUnitTestSet.constructTestObject(JUnitTestSet.java:151)
	at org.apache.maven.surefire.junit.JUnitTestSet.execute(JUnitTestSet.java:197)
	at org.apache.maven.surefire.suite.AbstractDirectoryTestSuite.executeTestSet(AbstractDirectoryTestSuite.java:143)
	at org.apache.maven.surefire.suite.AbstractDirectoryTestSuite.execute(AbstractDirectoryTestSuite.java:130)
	at org.apache.maven.surefire.Surefire.run(Surefire.java:180)
	at sun.reflect.NativeMethodAccessorImpl.invoke0(Native Method)
	at sun.reflect.NativeMethodAccessorImpl.invoke(NativeMethodAccessorImpl.java:39)
	at sun.reflect.DelegatingMethodAccessorImpl.invoke(DelegatingMethodAccessorImpl.java:25)
	at java.lang.reflect.Method.invoke(Method.java:597)
	at org.apache.maven.surefire.booter.SurefireBooter.runSuitesInProcess(SurefireBooter.java:350)
	at org.apache.maven.surefire.booter.SurefireBooter.main(SurefireBooter.java:1021)
Caused by: java.lang.RuntimeException: Error generating schema
	at org.apache.cayenne.unit.CayenneResources.getResources(CayenneResources.java:112)
	at org.apache.cayenne.tools.CayenneGeneratorTaskTest.<clinit>(CayenneGeneratorTaskTest.java:40)
	... 22 more
[INFO] ------------------------------------------------------------------------
[ERROR] BUILD FAILURE
[INFO] ------------------------------------------------------------------------
[INFO] There are test failures.

Please refer to /zonestorage/hudson/home/hudson/hudson/jobs/Cayenne-trunk/workspace/cayenneTestConnection/derby/jdk/JDK
1.6 (latest)/label/master/trunk/framework/cayenne-tools/target/surefire-reports for the individual
test results.
[INFO] ------------------------------------------------------------------------
[INFO] For more information, run Maven with the -e switch
[INFO] ------------------------------------------------------------------------
[INFO] Total time: 8 minutes 13 seconds
[INFO] Finished at: Mon Jan 04 13:33:50 UTC 2010
[INFO] Final Memory: 85M/204M
[INFO] ------------------------------------------------------------------------
Recording test results


Mime
View raw message