cassandra-dev mailing list archives

Site index · List index
Message view « Date » · « Thread »
Top « Date » · « Thread »
From Apache Jenkins Server <jenk...@builds.apache.org>
Subject Build failed in Jenkins: Cassandra-Coverage #204
Date Thu, 03 May 2012 01:33:10 GMT
See <https://builds.apache.org/job/Cassandra-Coverage/204/changes>

Changes:

[jbellis] add debug messages to commitlog allocator

[jbellis] Optimize reads when row deletion timestamps allow us to restrict the sstables we
check

[vijay2win] Fix descriptor versioning for bloom filter changes

[sylvain] Cleanup DTPE usage after CASSANDRA-3494

[jbellis] fix maxTimestamp to include row tombstones

[jbellis] additional trunk-only 4116 fixes

[sylvain] Fix cql3 order by for reversed queries

[jbellis] Open one sstableScanner per level for leveled compaction

[jbellis] add sstablemetadata utility

[jbellis] r/m droppable tombstones metadata from 1.1 (1.2 feature only)

[jbellis] add back droppable tombstones metadata to 1.2

[jbellis] rename away misleading Next from comparator method names; add docstrings

[eevans] (lazily )create and persist a host ID if none exists

[eevans] gossip host ID; Maintain a mapping of endpoint to ID

[eevans] store hints by host ID, instead of token

[eevans] removeNode (by ID) instead of token

[xedin] stress tool to return appropriate exit code on failure

------------------------------------------
[...truncated 1035 lines...]
    [junit] Cobertura: Saved information on 1142 classes.
    [junit] Testsuite: org.apache.cassandra.service.RemoveTest
    [junit] Tests run: 3, Failures: 0, Errors: 0, Time elapsed: 12.912 sec
    [junit] 
    [junit] Flushing results...
    [junit] Flushing results done
    [junit] Cobertura: Loaded information on 1142 classes.
    [junit] Cobertura: Saved information on 1142 classes.
    [junit] Testsuite: org.apache.cassandra.service.RowResolverTest
    [junit] Tests run: 8, Failures: 0, Errors: 0, Time elapsed: 9.015 sec
    [junit] 
    [junit] Flushing results...
    [junit] Flushing results done
    [junit] Cobertura: Loaded information on 1142 classes.
    [junit] Cobertura: Saved information on 1142 classes.
    [junit] Testsuite: org.apache.cassandra.service.SerializationsTest
    [junit] Tests run: 2, Failures: 0, Errors: 0, Time elapsed: 8.644 sec
    [junit] 
    [junit] Flushing results...
    [junit] Flushing results done
    [junit] Cobertura: Loaded information on 1142 classes.
    [junit] Cobertura: Saved information on 1142 classes.
    [junit] Testsuite: org.apache.cassandra.service.StorageProxyTest
    [junit] Tests run: 4, Failures: 0, Errors: 0, Time elapsed: 9.128 sec
    [junit] 
    [junit] Flushing results...
    [junit] Flushing results done
    [junit] Cobertura: Loaded information on 1142 classes.
    [junit] Cobertura: Saved information on 1142 classes.
    [junit] Testsuite: org.apache.cassandra.service.StorageServiceClientTest
    [junit] Tests run: 1, Failures: 0, Errors: 0, Time elapsed: 2.757 sec
    [junit] 
    [junit] Flushing results...
    [junit] Flushing results done
    [junit] Cobertura: Loaded information on 1142 classes.
    [junit] Cobertura: Saved information on 1142 classes.
    [junit] Testsuite: org.apache.cassandra.service.StorageServiceServerTest
    [junit] Tests run: 4, Failures: 0, Errors: 0, Time elapsed: 3.253 sec
    [junit] 
    [junit] ------------- Standard Error -----------------
    [junit]  WARN 01:30:12,492 No host ID found, created 20128c43-7b5f-47cc-aedf-d4f2470fbc85
(Note: This should happen exactly once per node).
    [junit]  WARN 01:30:12,905 Generated random token Token(bytes[4ac43f4ce02f0b2463ff6128d69e9d20]).
Random tokens will result in an unbalanced ring; see http://wiki.apache.org/cassandra/Operations
    [junit] ------------- ---------------- ---------------
    [junit] Flushing results...
    [junit] Flushing results done
    [junit] Cobertura: Loaded information on 1142 classes.
    [junit] Cobertura: Saved information on 1142 classes.
    [junit] Testsuite: org.apache.cassandra.streaming.BootstrapTest
    [junit] Tests run: 1, Failures: 0, Errors: 1, Time elapsed: 8.706 sec
    [junit] 
    [junit] Testcase: testGetNewNames(org.apache.cassandra.streaming.BootstrapTest):	Caused
an ERROR
    [junit] SSTable Keyspace1/Keyspace1-Standard1-f-500-Data.db is not compatible with current
version ia
    [junit] java.lang.UnsupportedOperationException: SSTable Keyspace1/Keyspace1-Standard1-f-500-Data.db
is not compatible with current version ia
    [junit] 	at org.apache.cassandra.streaming.StreamIn.getContextMapping(StreamIn.java:78)
    [junit] 	at org.apache.cassandra.streaming.BootstrapTest.testGetNewNames(BootstrapTest.java:43)
    [junit] 
    [junit] 
    [junit] Flushing results...
    [junit] Flushing results done
    [junit] Cobertura: Loaded information on 1142 classes.
    [junit] Cobertura: Saved information on 1142 classes.
    [junit] Test org.apache.cassandra.streaming.BootstrapTest FAILED
    [junit] Testsuite: org.apache.cassandra.streaming.SerializationsTest
    [junit] Tests run: 4, Failures: 0, Errors: 0, Time elapsed: 9.131 sec
    [junit] 
    [junit] Flushing results...
    [junit] Flushing results done
    [junit] Cobertura: Loaded information on 1142 classes.
    [junit] Cobertura: Saved information on 1142 classes.
    [junit] Testsuite: org.apache.cassandra.streaming.StreamingTransferTest
    [junit] Tests run: 5, Failures: 0, Errors: 0, Time elapsed: 9.427 sec
    [junit] 
    [junit] ------------- Standard Error -----------------
    [junit]  WARN 01:30:46,774 No host ID found, created f41a70c4-75a4-419e-a486-6ce6f21e000e
(Note: This should happen exactly once per node).
    [junit]  WARN 01:30:47,118 Generated random token Token(bytes[ada4861031fdae21937659172a405cd1]).
Random tokens will result in an unbalanced ring; see http://wiki.apache.org/cassandra/Operations
    [junit] ------------- ---------------- ---------------
    [junit] Flushing results...
    [junit] Flushing results done
    [junit] Cobertura: Loaded information on 1142 classes.
    [junit] Cobertura: Saved information on 1142 classes.
    [junit] Testsuite: org.apache.cassandra.thrift.ThriftValidationTest
    [junit] Tests run: 5, Failures: 0, Errors: 0, Time elapsed: 9.137 sec
    [junit] 
    [junit] Flushing results...
    [junit] Flushing results done
    [junit] Cobertura: Loaded information on 1142 classes.
    [junit] Cobertura: Saved information on 1142 classes.
    [junit] Testsuite: org.apache.cassandra.tools.SSTableExportTest
    [junit] Tests run: 6, Failures: 0, Errors: 0, Time elapsed: 9.069 sec
    [junit] 
    [junit] ------------- Standard Output ---------------
    [junit] Importing 1 keys...
    [junit] 1 keys imported successfully.
    [junit] ------------- ---------------- ---------------
    [junit] Flushing results...
    [junit] Flushing results done
    [junit] Cobertura: Loaded information on 1142 classes.
    [junit] Cobertura: Saved information on 1142 classes.
    [junit] Testsuite: org.apache.cassandra.tools.SSTableImportTest
    [junit] Tests run: 5, Failures: 0, Errors: 0, Time elapsed: 9.046 sec
    [junit] 
    [junit] ------------- Standard Output ---------------
    [junit] Importing 2 keys...
    [junit] 2 keys imported successfully.
    [junit] Importing 2 keys...
    [junit] 2 keys imported successfully.
    [junit] Importing 2 keys...
    [junit] 2 keys imported successfully.
    [junit] Importing 3 keys...
    [junit] Importing 3 keys...
    [junit] 1 keys imported successfully.
    [junit] ------------- ---------------- ---------------
    [junit] ------------- Standard Error -----------------
    [junit] Line 2: Key 303630 is greater than previous, collection is not sorted properly.
Aborting import. You might need to delete SSTables manually.
    [junit] ------------- ---------------- ---------------
    [junit] Flushing results...
    [junit] Flushing results done
    [junit] Cobertura: Loaded information on 1142 classes.
    [junit] Cobertura: Saved information on 1142 classes.
    [junit] Testsuite: org.apache.cassandra.utils.BloomFilterTest
    [junit] Tests run: 7, Failures: 0, Errors: 0, Time elapsed: 1.035 sec
    [junit] 
    [junit] Flushing results...
    [junit] Flushing results done
    [junit] Cobertura: Loaded information on 1142 classes.
    [junit] Cobertura: Saved information on 1142 classes.
    [junit] Testsuite: org.apache.cassandra.utils.BoundedStatsDequeTest
    [junit] Tests run: 1, Failures: 0, Errors: 0, Time elapsed: 0.051 sec
    [junit] 
    [junit] Flushing results...
    [junit] Flushing results done
    [junit] Cobertura: Loaded information on 1142 classes.
    [junit] Cobertura: Saved information on 1142 classes.
    [junit] Testsuite: org.apache.cassandra.utils.ByteBufferUtilTest
    [junit] Tests run: 10, Failures: 0, Errors: 0, Time elapsed: 0.085 sec
    [junit] 
    [junit] Flushing results...
    [junit] Flushing results done
    [junit] Cobertura: Loaded information on 1142 classes.
    [junit] Cobertura: Saved information on 1142 classes.
    [junit] Testsuite: org.apache.cassandra.utils.BytesReadTrackerTest
    [junit] Tests run: 4, Failures: 0, Errors: 0, Time elapsed: 0.052 sec
    [junit] 
    [junit] Flushing results...
    [junit] Flushing results done
    [junit] Cobertura: Loaded information on 1142 classes.
    [junit] Cobertura: Saved information on 1142 classes.
    [junit] Testsuite: org.apache.cassandra.utils.EncodedStreamsTest
    [junit] Tests run: 4, Failures: 0, Errors: 0, Time elapsed: 9.185 sec
    [junit] 
    [junit] Flushing results...
    [junit] Flushing results done
    [junit] Cobertura: Loaded information on 1142 classes.
    [junit] Cobertura: Saved information on 1142 classes.
    [junit] Testsuite: org.apache.cassandra.utils.EstimatedHistogramTest
    [junit] Tests run: 5, Failures: 0, Errors: 0, Time elapsed: 0.067 sec
    [junit] 
    [junit] Flushing results...
    [junit] Flushing results done
    [junit] Cobertura: Loaded information on 1142 classes.
    [junit] Cobertura: Saved information on 1142 classes.
    [junit] Testsuite: org.apache.cassandra.utils.FBUtilitiesTest
    [junit] Tests run: 2, Failures: 0, Errors: 0, Time elapsed: 0.054 sec
    [junit] 
    [junit] Flushing results...
    [junit] Flushing results done
    [junit] Cobertura: Loaded information on 1142 classes.
    [junit] Cobertura: Saved information on 1142 classes.
    [junit] Testsuite: org.apache.cassandra.utils.HexTest
    [junit] Tests run: 2, Failures: 0, Errors: 0, Time elapsed: 0.071 sec
    [junit] 
    [junit] Flushing results...
    [junit] Flushing results done
    [junit] Cobertura: Loaded information on 1142 classes.
    [junit] Cobertura: Saved information on 1142 classes.
    [junit] Testsuite: org.apache.cassandra.utils.IntervalTest
    [junit] Tests run: 3, Failures: 0, Errors: 0, Time elapsed: 0.05 sec
    [junit] 
    [junit] Flushing results...
    [junit] Flushing results done
    [junit] Cobertura: Loaded information on 1142 classes.
    [junit] Cobertura: Saved information on 1142 classes.
    [junit] Testsuite: org.apache.cassandra.utils.IntervalTreeTest
    [junit] Tests run: 1, Failures: 0, Errors: 0, Time elapsed: 0.129 sec
    [junit] 
    [junit] Flushing results...
    [junit] Flushing results done
    [junit] Cobertura: Loaded information on 1142 classes.
    [junit] Cobertura: Saved information on 1142 classes.
    [junit] Testsuite: org.apache.cassandra.utils.LegacyBloomFilterTest
    [junit] Tests run: 6, Failures: 0, Errors: 0, Time elapsed: 1.498 sec
    [junit] 
    [junit] Flushing results...
    [junit] Flushing results done
    [junit] Cobertura: Loaded information on 1142 classes.
    [junit] Cobertura: Saved information on 1142 classes.
    [junit] Testsuite: org.apache.cassandra.utils.MergeIteratorTest
    [junit] Tests run: 1, Failures: 0, Errors: 0, Time elapsed: 0.071 sec
    [junit] 
    [junit] Flushing results...
    [junit] Flushing results done
    [junit] Cobertura: Loaded information on 1142 classes.
    [junit] Cobertura: Saved information on 1142 classes.
    [junit] Testsuite: org.apache.cassandra.utils.MerkleTreeTest
    [junit] Tests run: 12, Failures: 0, Errors: 0, Time elapsed: 0.618 sec
    [junit] 
    [junit] Flushing results...
    [junit] Flushing results done
    [junit] Cobertura: Loaded information on 1142 classes.
    [junit] Cobertura: Saved information on 1142 classes.
    [junit] Testsuite: org.apache.cassandra.utils.SemanticVersionTest
    [junit] Tests run: 4, Failures: 0, Errors: 0, Time elapsed: 0.055 sec
    [junit] 
    [junit] Flushing results...
    [junit] Flushing results done
    [junit] Cobertura: Loaded information on 1142 classes.
    [junit] Cobertura: Saved information on 1142 classes.
    [junit] Testsuite: org.apache.cassandra.utils.SerializationsTest
    [junit] Tests run: 4, Failures: 0, Errors: 0, Time elapsed: 10.152 sec
    [junit] 
    [junit] Flushing results...
    [junit] Flushing results done
    [junit] Cobertura: Loaded information on 1142 classes.
    [junit] Cobertura: Saved information on 1142 classes.
    [junit] Testsuite: org.apache.cassandra.utils.StreamingHistogramTest
    [junit] Tests run: 2, Failures: 0, Errors: 0, Time elapsed: 0.056 sec
    [junit] 
    [junit] Flushing results...
    [junit] Flushing results done
    [junit] Cobertura: Loaded information on 1142 classes.
    [junit] Cobertura: Saved information on 1142 classes.

cobertura-report:
[cobertura-report] Cobertura 1.9.4.1 - GNU GPL License (NO WARRANTY) - See COPYRIGHT file
[cobertura-report] Cobertura: Loaded information on 1142 classes.
[cobertura-report] Report time: 4826ms
[cobertura-report] Cobertura 1.9.4.1 - GNU GPL License (NO WARRANTY) - See COPYRIGHT file
[cobertura-report] Cobertura: Loaded information on 1142 classes.
[cobertura-report] Report time: 4741ms

codecoverage:

BUILD SUCCESSFUL
Total time: 18 minutes 14 seconds
Publishing Cobertura coverage report...
Publishing Cobertura coverage results...
Recording test results
No test report files were found. Configuration error?
Build step 'Publish JUnit test result report' changed build result to FAILURE

Mime
View raw message