cassandra-dev mailing list archives

Site index · List index
Message view « Date » · « Thread »
Top « Date » · « Thread »
From Apache Jenkins Server <jenk...@builds.apache.org>
Subject Build failed in Jenkins: Cassandra #1322
Date Fri, 04 May 2012 21:01:50 GMT
See <https://builds.apache.org/job/Cassandra/1322/>

------------------------------------------
Started by an SCM change
Building remotely on ubuntu4 in workspace <https://builds.apache.org/job/Cassandra/ws/>
Checkout:Cassandra / <https://builds.apache.org/job/Cassandra/ws/> - hudson.remoting.Channel@5d282110:ubuntu4
Using strategy: Default
Last Built Revision: Revision 090fe813a6b458fa5dde9db9a153882b3813438c (origin/trunk)
Checkout:Cassandra / <https://builds.apache.org/job/Cassandra/ws/> - hudson.remoting.LocalChannel@3a0f4f9c
Fetching changes from 1 remote Git repository
Fetching upstream changes from http://git-wip-us.apache.org/repos/asf/cassandra.git
Commencing build of Revision e24681e70ca130643908508eac9550ed26f78a4e (origin/trunk)
Checking out Revision e24681e70ca130643908508eac9550ed26f78a4e (origin/trunk)
FATAL: Could not apply tag jenkins-Cassandra-1322
hudson.plugins.git.GitException: Could not apply tag jenkins-Cassandra-1322
	at hudson.plugins.git.GitAPI.tag(GitAPI.java:730)
	at hudson.plugins.git.GitSCM$4.invoke(GitSCM.java:1272)
	at hudson.plugins.git.GitSCM$4.invoke(GitSCM.java:1220)
	at hudson.FilePath$FileCallableWrapper.call(FilePath.java:2154)
	at hudson.remoting.UserRequest.perform(UserRequest.java:118)
	at hudson.remoting.UserRequest.perform(UserRequest.java:48)
	at hudson.remoting.Request$2.run(Request.java:287)
	at hudson.remoting.InterceptingExecutorService$1.call(InterceptingExecutorService.java:72)
	at java.util.concurrent.FutureTask$Sync.innerRun(FutureTask.java:334)
	at java.util.concurrent.FutureTask.run(FutureTask.java:166)
	at java.util.concurrent.ThreadPoolExecutor.runWorker(ThreadPoolExecutor.java:1110)
	at java.util.concurrent.ThreadPoolExecutor$Worker.run(ThreadPoolExecutor.java:603)
	at java.lang.Thread.run(Thread.java:636)
Caused by: hudson.plugins.git.GitException: Error performing command: git tag -a -f -m Jenkins
Build #1322 jenkins-Cassandra-1322
Command "git tag -a -f -m Jenkins Build #1322 jenkins-Cassandra-1322" returned status code
128: 
*** Please tell me who you are.

Run

  git config --global user.email "you@example.com"
  git config --global user.name "Your Name"

to set your account's default identity.
Omit --global to set the identity only in this repository.

fatal: empty ident  <jenkins@janus.apache.org
> not allowed

	at hudson.plugins.git.GitAPI.launchCommandIn(GitAPI.java:776)
	at hudson.plugins.git.GitAPI.launchCommand(GitAPI.java:741)
	at hudson.plugins.git.GitAPI.launchCommand(GitAPI.java:751)
	at hudson.plugins.git.GitAPI.tag(GitAPI.java:728)
	... 12 more
Caused by: hudson.plugins.git.GitException: Command "git tag -a -f -m Jenkins Build #1322
jenkins-Cassandra-1322" returned status code 128: 
*** Please tell me who you are.

Run

  git config --global user.email "you@example.com"
  git config --global user.name "Your Name"

to set your account's default identity.
Omit --global to set the identity only in this repository.

fatal: empty ident  <jenkins@janus.apache.org
> not allowed

	at hudson.plugins.git.GitAPI.launchCommandIn(GitAPI.java:771)
	... 15 more

Mime
View raw message