cassandra-dev mailing list archives

Site index · List index
Message view « Date » · « Thread »
Top « Date » · « Thread »
From Apache Jenkins Server <jenk...@builds.apache.org>
Subject Build failed in Jenkins: Cassandra-quick #327
Date Sun, 06 May 2012 16:14:58 GMT
See <https://builds.apache.org/job/Cassandra-quick/327/>

------------------------------------------
[...truncated 413 lines...]
    [junit] 
    [junit] Testsuite: org.apache.cassandra.gms.SerializationsTest
    [junit] Tests run: 2, Failures: 0, Errors: 0, Time elapsed: 6.35 sec
    [junit] 
    [junit] Testsuite: org.apache.cassandra.hadoop.ColumnFamilyInputFormatTest
    [junit] Tests run: 1, Failures: 0, Errors: 0, Time elapsed: 0.207 sec
    [junit] 
    [junit] Testsuite: org.apache.cassandra.io.BloomFilterTrackerTest
    [junit] Tests run: 3, Failures: 0, Errors: 0, Time elapsed: 6.137 sec
    [junit] 
    [junit] Testsuite: org.apache.cassandra.io.CompactSerializerTest
    [junit] Tests run: 2, Failures: 0, Errors: 0, Time elapsed: 6.841 sec
    [junit] 
    [junit] Testsuite: org.apache.cassandra.io.LazilyCompactedRowTest
    [junit] Tests run: 7, Failures: 0, Errors: 0, Time elapsed: 8.253 sec
    [junit] 
    [junit] Testsuite: org.apache.cassandra.io.compress.CompressedRandomAccessReaderTest
    [junit] Tests run: 3, Failures: 0, Errors: 0, Time elapsed: 0.953 sec
    [junit] 
    [junit] ------------- Standard Error -----------------
    [junit]  WARN 16:11:09,581 open(null, O_RDONLY) failed, errno (14).
    [junit] ------------- ---------------- ---------------
    [junit] Testsuite: org.apache.cassandra.io.sstable.DescriptorTest
    [junit] Tests run: 3, Failures: 0, Errors: 0, Time elapsed: 0.059 sec
    [junit] 
    [junit] Testsuite: org.apache.cassandra.io.sstable.IndexHelperTest
    [junit] Tests run: 1, Failures: 0, Errors: 0, Time elapsed: 0.058 sec
    [junit] 
    [junit] Testsuite: org.apache.cassandra.io.sstable.LegacySSTableTest
    [junit] Tests run: 1, Failures: 0, Errors: 0, Time elapsed: 7.285 sec
    [junit] 
    [junit] Testsuite: org.apache.cassandra.io.sstable.SSTableMetadataSerializerTest
    [junit] Tests run: 1, Failures: 0, Errors: 0, Time elapsed: 0.135 sec
    [junit] 
    [junit] Testsuite: org.apache.cassandra.io.sstable.SSTableReaderTest
    [junit] Tests run: 7, Failures: 0, Errors: 0, Time elapsed: 6.724 sec
    [junit] 
    [junit] Testsuite: org.apache.cassandra.io.sstable.SSTableSimpleWriterTest
    [junit] Tests run: 1, Failures: 0, Errors: 0, Time elapsed: 6.21 sec
    [junit] 
    [junit] Testsuite: org.apache.cassandra.io.sstable.SSTableTest
    [junit] Tests run: 2, Failures: 0, Errors: 0, Time elapsed: 6.322 sec
    [junit] 
    [junit] Testsuite: org.apache.cassandra.io.util.BufferedRandomAccessFileTest
    [junit] Tests run: 18, Failures: 0, Errors: 0, Time elapsed: 0.945 sec
    [junit] 
    [junit] Testsuite: org.apache.cassandra.locator.DynamicEndpointSnitchTest
    [junit] Tests run: 1, Failures: 0, Errors: 0, Time elapsed: 1.945 sec
    [junit] 
    [junit] Testsuite: org.apache.cassandra.locator.EC2SnitchTest
    [junit] Tests run: 2, Failures: 0, Errors: 0, Time elapsed: 0.611 sec
    [junit] 
    [junit] Testsuite: org.apache.cassandra.locator.NetworkTopologyStrategyTest
    [junit] Tests run: 2, Failures: 0, Errors: 0, Time elapsed: 0.627 sec
    [junit] 
    [junit] Testsuite: org.apache.cassandra.locator.OldNetworkTopologyStrategyTest
    [junit] Tests run: 8, Failures: 0, Errors: 0, Time elapsed: 6.19 sec
    [junit] 
    [junit] ------------- Standard Output ---------------
    [junit] toStream : [(158873535527910577765226390751398592512,0], (0,34028236692093846346337460743176821145]]
    [junit] toFetch : [(127605887595351923798765477786913079296,148873535527910577765226390751398592512]]
    [junit] toStreamExpected : [(158873535527910577765226390751398592512,0], (0,34028236692093846346337460743176821145]]
    [junit] toFetchExpected : [(127605887595351923798765477786913079296,148873535527910577765226390751398592512]]
    [junit] ------------- ---------------- ---------------
    [junit] Testsuite: org.apache.cassandra.locator.ReplicationStrategyEndpointCacheTest
    [junit] Tests run: 2, Failures: 0, Errors: 0, Time elapsed: 6.031 sec
    [junit] 
    [junit] Testsuite: org.apache.cassandra.locator.SimpleStrategyTest
    [junit] Tests run: 4, Failures: 0, Errors: 0, Time elapsed: 6.058 sec
    [junit] 
    [junit] Testsuite: org.apache.cassandra.locator.TokenMetadataTest
    [junit] Tests run: 3, Failures: 0, Errors: 0, Time elapsed: 0.614 sec
    [junit] 
    [junit] Testsuite: org.apache.cassandra.service.AntiEntropyServiceCounterTest
    [junit] Tests run: 6, Failures: 0, Errors: 0, Time elapsed: 8.153 sec
    [junit] 
    [junit] ------------- Standard Error -----------------
    [junit]  WARN 16:12:16,979 No host ID found, created b3ff46ce-5711-493a-906a-4cc1cb89634d
(Note: This should happen exactly once per node).
    [junit]  WARN 16:12:17,158 Generated random token Token(bytes[3b703b23aa4835e62b7d9d0a76283c20]).
Random tokens will result in an unbalanced ring; see http://wiki.apache.org/cassandra/Operations
    [junit] ------------- ---------------- ---------------
    [junit] Testsuite: org.apache.cassandra.service.AntiEntropyServiceStandardTest
    [junit] Tests run: 6, Failures: 0, Errors: 0, Time elapsed: 8.298 sec
    [junit] 
    [junit] ------------- Standard Error -----------------
    [junit]  WARN 16:12:26,186 No host ID found, created ca667cfb-576a-4037-8da8-a5192b551e72
(Note: This should happen exactly once per node).
    [junit]  WARN 16:12:26,412 Generated random token Token(bytes[c4ab707e96ed2186531fa2a7071e0874]).
Random tokens will result in an unbalanced ring; see http://wiki.apache.org/cassandra/Operations
    [junit] ------------- ---------------- ---------------
    [junit] Testsuite: org.apache.cassandra.service.CassandraServerTest
    [junit] Tests run: 1, Failures: 0, Errors: 0, Time elapsed: 6.307 sec
    [junit] 
    [junit] Testsuite: org.apache.cassandra.service.EmbeddedCassandraServiceTest
    [junit] Tests run: 1, Failures: 0, Errors: 0, Time elapsed: 6.953 sec
    [junit] 
    [junit] ------------- Standard Error -----------------
    [junit]  WARN 16:12:42,744 Unable to lock JVM memory (ENOMEM). This can result in part
of the JVM being swapped out, especially with mmapped I/O enabled. Increase RLIMIT_MEMLOCK
or run Cassandra as root.
    [junit]  WARN 16:12:43,199 No host ID found, created 08e5c9a4-6961-4c60-8fe6-ca7ab62f3bde
(Note: This should happen exactly once per node).
    [junit]  WARN 16:12:43,384 Generated random token Token(bytes[cc72029c7f280b884dbe588371610ddc]).
Random tokens will result in an unbalanced ring; see http://wiki.apache.org/cassandra/Operations
    [junit] ------------- ---------------- ---------------
    [junit] Testsuite: org.apache.cassandra.service.InitClientTest
    [junit] Tests run: 1, Failures: 0, Errors: 0, Time elapsed: 1.184 sec
    [junit] 
    [junit] Testsuite: org.apache.cassandra.service.LeaveAndBootstrapTest
    [junit] Tests run: 6, Failures: 0, Errors: 0, Time elapsed: 8.834 sec
    [junit] 
    [junit] ------------- Standard Error -----------------
    [junit]  WARN 16:12:56,026 Node /127.0.0.3 'leaving' token mismatch. Long network partition?
    [junit] ERROR 16:12:56,680 Fatal exception in thread Thread[CompactionExecutor:5,1,main]
    [junit] java.lang.ClassCastException: org.apache.cassandra.dht.Token$KeyBound cannot be
cast to org.apache.cassandra.dht.Token
    [junit] 	at org.apache.cassandra.dht.BigIntegerToken.compareTo(BigIntegerToken.java:22)
    [junit] 	at org.apache.cassandra.dht.Range$1.compare(Range.java:386)
    [junit] 	at org.apache.cassandra.dht.Range$1.compare(Range.java:383)
    [junit] 	at java.util.Arrays.mergeSort(Arrays.java:1270)
    [junit] 	at java.util.Arrays.sort(Arrays.java:1210)
    [junit] 	at java.util.Collections.sort(Collections.java:159)
    [junit] 	at org.apache.cassandra.dht.Range.normalize(Range.java:382)
    [junit] 	at org.apache.cassandra.io.sstable.SSTableReader.getSampleIndexesForRanges(SSTableReader.java:548)
    [junit] 	at org.apache.cassandra.io.sstable.SSTableReader.estimatedKeysForRanges(SSTableReader.java:527)
    [junit] 	at org.apache.cassandra.db.compaction.SizeTieredCompactionStrategy.getNextBackgroundTask(SizeTieredCompactionStrategy.java:110)
    [junit] 	at org.apache.cassandra.db.compaction.CompactionManager$1.runMayThrow(CompactionManager.java:123)
    [junit] 	at org.apache.cassandra.utils.WrappedRunnable.run(WrappedRunnable.java:26)
    [junit] 	at java.util.concurrent.Executors$RunnableAdapter.call(Executors.java:441)
    [junit] 	at java.util.concurrent.FutureTask$Sync.innerRun(FutureTask.java:303)
    [junit] 	at java.util.concurrent.FutureTask.run(FutureTask.java:138)
    [junit] 	at java.util.concurrent.ThreadPoolExecutor$Worker.runTask(ThreadPoolExecutor.java:886)
    [junit] 	at java.util.concurrent.ThreadPoolExecutor$Worker.run(ThreadPoolExecutor.java:908)
    [junit] 	at java.lang.Thread.run(Thread.java:662)
    [junit] ------------- ---------------- ---------------
    [junit] Testsuite: org.apache.cassandra.service.MoveTest
    [junit] Tests run: 3, Failures: 0, Errors: 0, Time elapsed: 7.722 sec
    [junit] 
    [junit] Testsuite: org.apache.cassandra.service.RemoveTest
    [junit] Tests run: 3, Failures: 0, Errors: 0, Time elapsed: 10.036 sec
    [junit] 
    [junit] Testsuite: org.apache.cassandra.service.RowResolverTest
    [junit] Tests run: 8, Failures: 0, Errors: 0, Time elapsed: 6.079 sec
    [junit] 
    [junit] Testsuite: org.apache.cassandra.service.SerializationsTest
    [junit] Tests run: 2, Failures: 0, Errors: 0, Time elapsed: 5.739 sec
    [junit] 
    [junit] Testsuite: org.apache.cassandra.service.StorageProxyTest
    [junit] Tests run: 4, Failures: 0, Errors: 0, Time elapsed: 6.262 sec
    [junit] 
    [junit] Testsuite: org.apache.cassandra.service.StorageServiceClientTest
    [junit] Tests run: 1, Failures: 0, Errors: 0, Time elapsed: 2.803 sec
    [junit] 
    [junit] Testsuite: org.apache.cassandra.service.StorageServiceServerTest
    [junit] Tests run: 4, Failures: 0, Errors: 0, Time elapsed: 3.164 sec
    [junit] 
    [junit] ------------- Standard Error -----------------
    [junit]  WARN 16:13:43,099 No host ID found, created 7499abd8-4f2c-4dd0-86f8-8035fe7b6d2c
(Note: This should happen exactly once per node).
    [junit]  WARN 16:13:43,395 Generated random token Token(bytes[7262b9ae4fa4edc0573d1fe5785af066]).
Random tokens will result in an unbalanced ring; see http://wiki.apache.org/cassandra/Operations
    [junit] ------------- ---------------- ---------------
    [junit] Testsuite: org.apache.cassandra.streaming.BootstrapTest
    [junit] Tests run: 1, Failures: 0, Errors: 0, Time elapsed: 6.107 sec
    [junit] 
    [junit] Testsuite: org.apache.cassandra.streaming.SerializationsTest
    [junit] Tests run: 4, Failures: 0, Errors: 0, Time elapsed: 6.185 sec
    [junit] 
    [junit] Testsuite: org.apache.cassandra.streaming.StreamingTransferTest
    [junit] Tests run: 5, Failures: 0, Errors: 0, Time elapsed: 6.699 sec
    [junit] 
    [junit] ------------- Standard Error -----------------
    [junit]  WARN 16:14:05,433 No host ID found, created dd0a0ebd-5e53-4066-bf87-24b26d344132
(Note: This should happen exactly once per node).
    [junit]  WARN 16:14:05,604 Generated random token Token(bytes[0d2e9bae8db8388c63c7125b306833b8]).
Random tokens will result in an unbalanced ring; see http://wiki.apache.org/cassandra/Operations
    [junit] ------------- ---------------- ---------------
    [junit] Testsuite: org.apache.cassandra.thrift.ThriftValidationTest
    [junit] Tests run: 5, Failures: 0, Errors: 0, Time elapsed: 6.239 sec
    [junit] 
    [junit] Testsuite: org.apache.cassandra.tools.SSTableExportTest
    [junit] Tests run: 6, Failures: 0, Errors: 0, Time elapsed: 6.336 sec
    [junit] 
    [junit] ------------- Standard Output ---------------
    [junit] Importing 1 keys...
    [junit] 1 keys imported successfully.
    [junit] ------------- ---------------- ---------------
    [junit] Testsuite: org.apache.cassandra.tools.SSTableImportTest
    [junit] Tests run: 5, Failures: 0, Errors: 0, Time elapsed: 6.256 sec
    [junit] 
    [junit] ------------- Standard Output ---------------
    [junit] Importing 2 keys...
    [junit] 2 keys imported successfully.
    [junit] Importing 2 keys...
    [junit] 2 keys imported successfully.
    [junit] Importing 2 keys...
    [junit] 2 keys imported successfully.
    [junit] Importing 3 keys...
    [junit] Importing 3 keys...
    [junit] 1 keys imported successfully.
    [junit] ------------- ---------------- ---------------
    [junit] ------------- Standard Error -----------------
    [junit] Line 2: Key 303630 is greater than previous, collection is not sorted properly.
Aborting import. You might need to delete SSTables manually.
    [junit] ------------- ---------------- ---------------
    [junit] Testsuite: org.apache.cassandra.utils.BloomFilterTest
    [junit] Tests run: 7, Failures: 0, Errors: 0, Time elapsed: 0.52 sec
    [junit] 
    [junit] Testsuite: org.apache.cassandra.utils.BoundedStatsDequeTest
    [junit] Tests run: 1, Failures: 0, Errors: 0, Time elapsed: 0.056 sec
    [junit] 
    [junit] Testsuite: org.apache.cassandra.utils.ByteBufferUtilTest
    [junit] Tests run: 10, Failures: 0, Errors: 0, Time elapsed: 0.073 sec
    [junit] 
    [junit] Testsuite: org.apache.cassandra.utils.BytesReadTrackerTest
    [junit] Tests run: 4, Failures: 0, Errors: 0, Time elapsed: 0.058 sec
    [junit] 
    [junit] Testsuite: org.apache.cassandra.utils.EncodedStreamsTest
    [junit] Tests run: 4, Failures: 0, Errors: 0, Time elapsed: 6.328 sec
    [junit] 
    [junit] Testsuite: org.apache.cassandra.utils.EstimatedHistogramTest
    [junit] Tests run: 5, Failures: 0, Errors: 0, Time elapsed: 0.06 sec
    [junit] 
    [junit] Testsuite: org.apache.cassandra.utils.FBUtilitiesTest
    [junit] Tests run: 2, Failures: 0, Errors: 0, Time elapsed: 0.058 sec
    [junit] 
    [junit] Testsuite: org.apache.cassandra.utils.HexTest
    [junit] Tests run: 2, Failures: 0, Errors: 0, Time elapsed: 0.061 sec
    [junit] 
    [junit] Testsuite: org.apache.cassandra.utils.IntervalTest
    [junit] Tests run: 3, Failures: 0, Errors: 0, Time elapsed: 0.052 sec
    [junit] 
    [junit] Testsuite: org.apache.cassandra.utils.IntervalTreeTest
    [junit] Tests run: 1, Failures: 0, Errors: 0, Time elapsed: 0.154 sec
    [junit] 
    [junit] Testsuite: org.apache.cassandra.utils.LegacyBloomFilterTest
    [junit] Tests run: 6, Failures: 0, Errors: 0, Time elapsed: 0.444 sec
    [junit] 
    [junit] Testsuite: org.apache.cassandra.utils.MergeIteratorTest
    [junit] Tests run: 1, Failures: 0, Errors: 0, Time elapsed: 0.073 sec
    [junit] 
    [junit] Testsuite: org.apache.cassandra.utils.MerkleTreeTest
    [junit] Tests run: 12, Failures: 0, Errors: 0, Time elapsed: 0.617 sec
    [junit] 
    [junit] Testsuite: org.apache.cassandra.utils.SemanticVersionTest
    [junit] Tests run: 4, Failures: 0, Errors: 0, Time elapsed: 0.059 sec
    [junit] 
    [junit] Testsuite: org.apache.cassandra.utils.SerializationsTest
    [junit] Tests run: 4, Failures: 0, Errors: 0, Time elapsed: 8.066 sec
    [junit] 
    [junit] Testsuite: org.apache.cassandra.utils.StreamingHistogramTest
    [junit] Tests run: 2, Failures: 0, Errors: 0, Time elapsed: 0.059 sec
    [junit] 

BUILD FAILED
<https://builds.apache.org/job/Cassandra-quick/ws/build.xml>:1086: The following error
occurred while executing this line:
<https://builds.apache.org/job/Cassandra-quick/ws/build.xml>:1048: Some unit test(s)
failed.

Total time: 11 minutes 13 seconds
Build step 'Invoke Ant' marked build as failure
[TASKS] Skipping publisher since build result is FAILURE
Recording test results

Mime
View raw message