cassandra-dev mailing list archives

Site index · List index
Message view « Date » · « Thread »
Top « Date » · « Thread »
From Apache Jenkins Server <jenk...@builds.apache.org>
Subject Build failed in Jenkins: Cassandra-quick #266
Date Thu, 03 May 2012 23:57:42 GMT
See <https://builds.apache.org/job/Cassandra-quick/266/changes>

Changes:

[sylvain] Allow unreserved keywoards in property values too (following #4186)

[jbellis] fix compaction NPE when out of disk space and assertions disabled

[jbellis] ignore maxtimestamp unless it includes row tombstones correctly

------------------------------------------
[...truncated 428 lines...]
    [junit] 
    [junit] Testsuite: org.apache.cassandra.io.compress.CompressedRandomAccessReaderTest
    [junit] Tests run: 3, Failures: 0, Errors: 0, Time elapsed: 0.961 sec
    [junit] 
    [junit] ------------- Standard Error -----------------
    [junit]  WARN 23:53:51,591 open(null, O_RDONLY) failed, errno (14).
    [junit] ------------- ---------------- ---------------
    [junit] Testsuite: org.apache.cassandra.io.sstable.DescriptorTest
    [junit] Tests run: 3, Failures: 1, Errors: 0, Time elapsed: 0.063 sec
    [junit] 
    [junit] Testcase: testVersion(org.apache.cassandra.io.sstable.DescriptorTest):	FAILED
    [junit] null
    [junit] junit.framework.AssertionFailedError
    [junit] 	at org.apache.cassandra.io.sstable.DescriptorTest.testVersion(DescriptorTest.java:44)
    [junit] 
    [junit] 
    [junit] Test org.apache.cassandra.io.sstable.DescriptorTest FAILED
    [junit] Testsuite: org.apache.cassandra.io.sstable.IndexHelperTest
    [junit] Tests run: 1, Failures: 0, Errors: 0, Time elapsed: 0.058 sec
    [junit] 
    [junit] Testsuite: org.apache.cassandra.io.sstable.LegacySSTableTest
    [junit] Tests run: 1, Failures: 0, Errors: 0, Time elapsed: 7.503 sec
    [junit] 
    [junit] Testsuite: org.apache.cassandra.io.sstable.SSTableMetadataSerializerTest
    [junit] Tests run: 1, Failures: 0, Errors: 0, Time elapsed: 0.134 sec
    [junit] 
    [junit] Testsuite: org.apache.cassandra.io.sstable.SSTableReaderTest
    [junit] Tests run: 7, Failures: 0, Errors: 0, Time elapsed: 6.947 sec
    [junit] 
    [junit] Testsuite: org.apache.cassandra.io.sstable.SSTableSimpleWriterTest
    [junit] Tests run: 1, Failures: 0, Errors: 0, Time elapsed: 6.173 sec
    [junit] 
    [junit] Testsuite: org.apache.cassandra.io.sstable.SSTableTest
    [junit] Tests run: 2, Failures: 0, Errors: 0, Time elapsed: 6.331 sec
    [junit] 
    [junit] Testsuite: org.apache.cassandra.io.util.BufferedRandomAccessFileTest
    [junit] Tests run: 18, Failures: 0, Errors: 0, Time elapsed: 0.93 sec
    [junit] 
    [junit] Testsuite: org.apache.cassandra.locator.DynamicEndpointSnitchTest
    [junit] Tests run: 1, Failures: 0, Errors: 0, Time elapsed: 1.943 sec
    [junit] 
    [junit] Testsuite: org.apache.cassandra.locator.EC2SnitchTest
    [junit] Tests run: 2, Failures: 0, Errors: 0, Time elapsed: 0.617 sec
    [junit] 
    [junit] Testsuite: org.apache.cassandra.locator.NetworkTopologyStrategyTest
    [junit] Tests run: 2, Failures: 0, Errors: 0, Time elapsed: 0.658 sec
    [junit] 
    [junit] Testsuite: org.apache.cassandra.locator.OldNetworkTopologyStrategyTest
    [junit] Tests run: 8, Failures: 0, Errors: 0, Time elapsed: 6.163 sec
    [junit] 
    [junit] ------------- Standard Output ---------------
    [junit] toStream : [(158873535527910577765226390751398592512,0], (0,34028236692093846346337460743176821145]]
    [junit] toFetch : [(127605887595351923798765477786913079296,148873535527910577765226390751398592512]]
    [junit] toStreamExpected : [(158873535527910577765226390751398592512,0], (0,34028236692093846346337460743176821145]]
    [junit] toFetchExpected : [(127605887595351923798765477786913079296,148873535527910577765226390751398592512]]
    [junit] ------------- ---------------- ---------------
    [junit] Testsuite: org.apache.cassandra.locator.ReplicationStrategyEndpointCacheTest
    [junit] Tests run: 2, Failures: 0, Errors: 0, Time elapsed: 6.262 sec
    [junit] 
    [junit] Testsuite: org.apache.cassandra.locator.SimpleStrategyTest
    [junit] Tests run: 4, Failures: 0, Errors: 0, Time elapsed: 6.17 sec
    [junit] 
    [junit] Testsuite: org.apache.cassandra.locator.TokenMetadataTest
    [junit] Tests run: 3, Failures: 0, Errors: 0, Time elapsed: 0.613 sec
    [junit] 
    [junit] Testsuite: org.apache.cassandra.service.AntiEntropyServiceCounterTest
    [junit] Tests run: 6, Failures: 0, Errors: 0, Time elapsed: 8.117 sec
    [junit] 
    [junit] ------------- Standard Error -----------------
    [junit]  WARN 23:54:59,754 No host ID found, created b6cbb246-188b-4f6c-8328-d2c1935bb2c8
(Note: This should happen exactly once per node).
    [junit]  WARN 23:54:59,938 Generated random token Token(bytes[475a16380c7d931fd2fe6acf0029d585]).
Random tokens will result in an unbalanced ring; see http://wiki.apache.org/cassandra/Operations
    [junit] ------------- ---------------- ---------------
    [junit] Testsuite: org.apache.cassandra.service.AntiEntropyServiceStandardTest
    [junit] Tests run: 6, Failures: 0, Errors: 0, Time elapsed: 8.133 sec
    [junit] 
    [junit] ------------- Standard Error -----------------
    [junit]  WARN 23:55:09,009 No host ID found, created 3c772585-a2cf-4f43-a58a-acb7d0bab9c4
(Note: This should happen exactly once per node).
    [junit]  WARN 23:55:09,199 Generated random token Token(bytes[3ec8c67725bfd87c6b00d14caddd4fcf]).
Random tokens will result in an unbalanced ring; see http://wiki.apache.org/cassandra/Operations
    [junit] ------------- ---------------- ---------------
    [junit] Testsuite: org.apache.cassandra.service.CassandraServerTest
    [junit] Tests run: 1, Failures: 0, Errors: 0, Time elapsed: 6.534 sec
    [junit] 
    [junit] Testsuite: org.apache.cassandra.service.EmbeddedCassandraServiceTest
    [junit] Tests run: 1, Failures: 0, Errors: 0, Time elapsed: 7.075 sec
    [junit] 
    [junit] ------------- Standard Error -----------------
    [junit]  WARN 23:55:25,731 Unable to lock JVM memory (ENOMEM). This can result in part
of the JVM being swapped out, especially with mmapped I/O enabled. Increase RLIMIT_MEMLOCK
or run Cassandra as root.
    [junit]  WARN 23:55:26,186 No host ID found, created f39de4ad-e645-4209-bba3-38c0f3f4dd13
(Note: This should happen exactly once per node).
    [junit]  WARN 23:55:26,368 Generated random token Token(bytes[92673b56f1497293d1f7a932aeb91337]).
Random tokens will result in an unbalanced ring; see http://wiki.apache.org/cassandra/Operations
    [junit] ------------- ---------------- ---------------
    [junit] Testsuite: org.apache.cassandra.service.InitClientTest
    [junit] Tests run: 1, Failures: 0, Errors: 0, Time elapsed: 1.175 sec
    [junit] 
    [junit] Testsuite: org.apache.cassandra.service.LeaveAndBootstrapTest
    [junit] Tests run: 6, Failures: 0, Errors: 0, Time elapsed: 8.731 sec
    [junit] 
    [junit] ------------- Standard Error -----------------
    [junit]  WARN 23:55:39,125 Node /127.0.0.3 'leaving' token mismatch. Long network partition?
    [junit] ERROR 23:55:39,576 Fatal exception in thread Thread[CompactionExecutor:5,1,main]
    [junit] java.lang.ClassCastException: org.apache.cassandra.dht.Token$KeyBound cannot be
cast to org.apache.cassandra.dht.Token
    [junit] 	at org.apache.cassandra.dht.BigIntegerToken.compareTo(BigIntegerToken.java:22)
    [junit] 	at org.apache.cassandra.dht.Range$1.compare(Range.java:386)
    [junit] 	at org.apache.cassandra.dht.Range$1.compare(Range.java:383)
    [junit] 	at java.util.Arrays.mergeSort(Arrays.java:1270)
    [junit] 	at java.util.Arrays.sort(Arrays.java:1210)
    [junit] 	at java.util.Collections.sort(Collections.java:159)
    [junit] 	at org.apache.cassandra.dht.Range.normalize(Range.java:382)
    [junit] 	at org.apache.cassandra.io.sstable.SSTableReader.getSampleIndexesForRanges(SSTableReader.java:548)
    [junit] 	at org.apache.cassandra.io.sstable.SSTableReader.estimatedKeysForRanges(SSTableReader.java:527)
    [junit] 	at org.apache.cassandra.db.compaction.SizeTieredCompactionStrategy.getNextBackgroundTask(SizeTieredCompactionStrategy.java:110)
    [junit] 	at org.apache.cassandra.db.compaction.CompactionManager$1.runMayThrow(CompactionManager.java:123)
    [junit] 	at org.apache.cassandra.utils.WrappedRunnable.run(WrappedRunnable.java:26)
    [junit] 	at java.util.concurrent.Executors$RunnableAdapter.call(Executors.java:441)
    [junit] 	at java.util.concurrent.FutureTask$Sync.innerRun(FutureTask.java:303)
    [junit] 	at java.util.concurrent.FutureTask.run(FutureTask.java:138)
    [junit] 	at java.util.concurrent.ThreadPoolExecutor$Worker.runTask(ThreadPoolExecutor.java:886)
    [junit] 	at java.util.concurrent.ThreadPoolExecutor$Worker.run(ThreadPoolExecutor.java:908)
    [junit] 	at java.lang.Thread.run(Thread.java:662)
    [junit] ------------- ---------------- ---------------
    [junit] Testsuite: org.apache.cassandra.service.MoveTest
    [junit] Tests run: 3, Failures: 0, Errors: 0, Time elapsed: 7.533 sec
    [junit] 
    [junit] Testsuite: org.apache.cassandra.service.RemoveTest
    [junit] Tests run: 3, Failures: 0, Errors: 0, Time elapsed: 9.998 sec
    [junit] 
    [junit] Testsuite: org.apache.cassandra.service.RowResolverTest
    [junit] Tests run: 8, Failures: 0, Errors: 0, Time elapsed: 6.218 sec
    [junit] 
    [junit] Testsuite: org.apache.cassandra.service.SerializationsTest
    [junit] Tests run: 2, Failures: 0, Errors: 0, Time elapsed: 5.725 sec
    [junit] 
    [junit] Testsuite: org.apache.cassandra.service.StorageProxyTest
    [junit] Tests run: 4, Failures: 0, Errors: 0, Time elapsed: 6.329 sec
    [junit] 
    [junit] Testsuite: org.apache.cassandra.service.StorageServiceClientTest
    [junit] Tests run: 1, Failures: 0, Errors: 0, Time elapsed: 2.803 sec
    [junit] 
    [junit] Testsuite: org.apache.cassandra.service.StorageServiceServerTest
    [junit] Tests run: 4, Failures: 0, Errors: 0, Time elapsed: 3.141 sec
    [junit] 
    [junit] ------------- Standard Error -----------------
    [junit]  WARN 23:56:25,957 No host ID found, created 3584eef9-fe1d-43aa-8089-a2bf27f7a069
(Note: This should happen exactly once per node).
    [junit]  WARN 23:56:26,252 Generated random token Token(bytes[75d9f4430e6f7c7b63f181244399a3ce]).
Random tokens will result in an unbalanced ring; see http://wiki.apache.org/cassandra/Operations
    [junit] ------------- ---------------- ---------------
    [junit] Testsuite: org.apache.cassandra.streaming.BootstrapTest
    [junit] Tests run: 1, Failures: 0, Errors: 1, Time elapsed: 6.152 sec
    [junit] 
    [junit] Testcase: testGetNewNames(org.apache.cassandra.streaming.BootstrapTest):	Caused
an ERROR
    [junit] SSTable Keyspace1/Keyspace1-Standard1-f-500-Data.db is not compatible with current
version ia
    [junit] java.lang.UnsupportedOperationException: SSTable Keyspace1/Keyspace1-Standard1-f-500-Data.db
is not compatible with current version ia
    [junit] 	at org.apache.cassandra.streaming.StreamIn.getContextMapping(StreamIn.java:78)
    [junit] 	at org.apache.cassandra.streaming.BootstrapTest.testGetNewNames(BootstrapTest.java:43)
    [junit] 
    [junit] 
    [junit] Test org.apache.cassandra.streaming.BootstrapTest FAILED
    [junit] Testsuite: org.apache.cassandra.streaming.SerializationsTest
    [junit] Tests run: 4, Failures: 0, Errors: 0, Time elapsed: 6.225 sec
    [junit] 
    [junit] Testsuite: org.apache.cassandra.streaming.StreamingTransferTest
    [junit] Tests run: 5, Failures: 0, Errors: 0, Time elapsed: 6.673 sec
    [junit] 
    [junit] ------------- Standard Error -----------------
    [junit]  WARN 23:56:48,323 No host ID found, created 9334be01-aedd-4b3d-8ebb-91e076c80f33
(Note: This should happen exactly once per node).
    [junit]  WARN 23:56:48,496 Generated random token Token(bytes[3ff9c9bbabedd156ecf8443f6fb65c09]).
Random tokens will result in an unbalanced ring; see http://wiki.apache.org/cassandra/Operations
    [junit] ------------- ---------------- ---------------
    [junit] Testsuite: org.apache.cassandra.thrift.ThriftValidationTest
    [junit] Tests run: 5, Failures: 0, Errors: 0, Time elapsed: 6.194 sec
    [junit] 
    [junit] Testsuite: org.apache.cassandra.tools.SSTableExportTest
    [junit] Tests run: 6, Failures: 0, Errors: 0, Time elapsed: 6.896 sec
    [junit] 
    [junit] ------------- Standard Output ---------------
    [junit] Importing 1 keys...
    [junit] 1 keys imported successfully.
    [junit] ------------- ---------------- ---------------
    [junit] Testsuite: org.apache.cassandra.tools.SSTableImportTest
    [junit] Tests run: 5, Failures: 0, Errors: 0, Time elapsed: 6.397 sec
    [junit] 
    [junit] ------------- Standard Output ---------------
    [junit] Importing 2 keys...
    [junit] 2 keys imported successfully.
    [junit] Importing 2 keys...
    [junit] 2 keys imported successfully.
    [junit] Importing 2 keys...
    [junit] 2 keys imported successfully.
    [junit] Importing 3 keys...
    [junit] Importing 3 keys...
    [junit] 1 keys imported successfully.
    [junit] ------------- ---------------- ---------------
    [junit] ------------- Standard Error -----------------
    [junit] Line 2: Key 303630 is greater than previous, collection is not sorted properly.
Aborting import. You might need to delete SSTables manually.
    [junit] ------------- ---------------- ---------------
    [junit] Testsuite: org.apache.cassandra.utils.BloomFilterTest
    [junit] Tests run: 7, Failures: 0, Errors: 0, Time elapsed: 0.531 sec
    [junit] 
    [junit] Testsuite: org.apache.cassandra.utils.BoundedStatsDequeTest
    [junit] Tests run: 1, Failures: 0, Errors: 0, Time elapsed: 0.055 sec
    [junit] 
    [junit] Testsuite: org.apache.cassandra.utils.ByteBufferUtilTest
    [junit] Tests run: 10, Failures: 0, Errors: 0, Time elapsed: 0.073 sec
    [junit] 
    [junit] Testsuite: org.apache.cassandra.utils.BytesReadTrackerTest
    [junit] Tests run: 4, Failures: 0, Errors: 0, Time elapsed: 0.057 sec
    [junit] 
    [junit] Testsuite: org.apache.cassandra.utils.EncodedStreamsTest
    [junit] Tests run: 4, Failures: 0, Errors: 0, Time elapsed: 6.259 sec
    [junit] 
    [junit] Testsuite: org.apache.cassandra.utils.EstimatedHistogramTest
    [junit] Tests run: 5, Failures: 0, Errors: 0, Time elapsed: 0.06 sec
    [junit] 
    [junit] Testsuite: org.apache.cassandra.utils.FBUtilitiesTest
    [junit] Tests run: 2, Failures: 0, Errors: 0, Time elapsed: 0.059 sec
    [junit] 
    [junit] Testsuite: org.apache.cassandra.utils.HexTest
    [junit] Tests run: 2, Failures: 0, Errors: 0, Time elapsed: 0.061 sec
    [junit] 
    [junit] Testsuite: org.apache.cassandra.utils.IntervalTest
    [junit] Tests run: 3, Failures: 0, Errors: 0, Time elapsed: 0.052 sec
    [junit] 
    [junit] Testsuite: org.apache.cassandra.utils.IntervalTreeTest
    [junit] Tests run: 1, Failures: 0, Errors: 0, Time elapsed: 0.157 sec
    [junit] 
    [junit] Testsuite: org.apache.cassandra.utils.LegacyBloomFilterTest
    [junit] Tests run: 6, Failures: 0, Errors: 0, Time elapsed: 0.447 sec
    [junit] 
    [junit] Testsuite: org.apache.cassandra.utils.MergeIteratorTest
    [junit] Tests run: 1, Failures: 0, Errors: 0, Time elapsed: 0.073 sec
    [junit] 
    [junit] Testsuite: org.apache.cassandra.utils.MerkleTreeTest
    [junit] Tests run: 12, Failures: 0, Errors: 0, Time elapsed: 0.612 sec
    [junit] 
    [junit] Testsuite: org.apache.cassandra.utils.SemanticVersionTest
    [junit] Tests run: 4, Failures: 0, Errors: 0, Time elapsed: 0.06 sec
    [junit] 
    [junit] Testsuite: org.apache.cassandra.utils.SerializationsTest
    [junit] Tests run: 4, Failures: 0, Errors: 0, Time elapsed: 8.263 sec
    [junit] 
    [junit] Testsuite: org.apache.cassandra.utils.StreamingHistogramTest
    [junit] Tests run: 2, Failures: 0, Errors: 0, Time elapsed: 0.06 sec
    [junit] 

BUILD FAILED
<https://builds.apache.org/job/Cassandra-quick/ws/build.xml>:1086: The following error
occurred while executing this line:
<https://builds.apache.org/job/Cassandra-quick/ws/build.xml>:1048: Some unit test(s)
failed.

Total time: 11 minutes 17 seconds
Build step 'Invoke Ant' marked build as failure
[TASKS] Skipping publisher since build result is FAILURE
Recording test results

Mime
View raw message