cassandra-dev mailing list archives

Site index · List index
Message view « Date » · « Thread »
Top « Date » · « Thread »
From Apache Hudson Server <hud...@hudson.apache.org>
Subject Build failed in Jenkins: Cassandra #773
Date Fri, 11 Mar 2011 18:18:59 GMT
See <https://hudson.apache.org/hudson/job/Cassandra/773/changes>

Changes:

[jbellis] AES Counter Repair Improvements
patch by Alan Liang; reviewed by slebresne for CASSANDRA-2288

[jbellis] merge from 0.7

------------------------------------------
[...truncated 1862 lines...]
    [junit] Testsuite: org.apache.cassandra.dht.CollatingOrderPreservingPartitionerTest
    [junit] Tests run: 7, Failures: 0, Errors: 0, Time elapsed: 1.318 sec
    [junit] 
    [junit] Testsuite: org.apache.cassandra.dht.OrderPreservingPartitionerTest
    [junit] Tests run: 6, Failures: 0, Errors: 0, Time elapsed: 1.126 sec
    [junit] 
    [junit] Testsuite: org.apache.cassandra.dht.RandomPartitionerTest
    [junit] Tests run: 5, Failures: 0, Errors: 0, Time elapsed: 0.771 sec
    [junit] 
    [junit] Testsuite: org.apache.cassandra.dht.RangeTest
    [junit] Tests run: 13, Failures: 0, Errors: 0, Time elapsed: 0.482 sec
    [junit] 
    [junit] Testsuite: org.apache.cassandra.gms.ArrivalWindowTest
    [junit] Tests run: 1, Failures: 0, Errors: 0, Time elapsed: 0.119 sec
    [junit] 
    [junit] Testsuite: org.apache.cassandra.gms.GossipDigestTest
    [junit] Tests run: 1, Failures: 0, Errors: 0, Time elapsed: 0.053 sec
    [junit] 
    [junit] Testsuite: org.apache.cassandra.gms.SerializationsTest
    [junit] Tests run: 2, Failures: 0, Errors: 0, Time elapsed: 0.435 sec
    [junit] 
    [junit] Testsuite: org.apache.cassandra.hadoop.ColumnFamilyInputFormatTest
    [junit] Tests run: 1, Failures: 0, Errors: 0, Time elapsed: 0.192 sec
    [junit] 
    [junit] Testsuite: org.apache.cassandra.io.BloomFilterTrackerTest
    [junit] Tests run: 3, Failures: 0, Errors: 0, Time elapsed: 0.436 sec
    [junit] 
    [junit] Testsuite: org.apache.cassandra.io.CompactSerializerTest
    [junit] Tests run: 2, Failures: 0, Errors: 0, Time elapsed: 1.513 sec
    [junit] 
    [junit] Testsuite: org.apache.cassandra.io.LazilyCompactedRowTest
    [junit] Tests run: 7, Failures: 0, Errors: 0, Time elapsed: 17.266 sec
    [junit] 
    [junit] Testsuite: org.apache.cassandra.io.sstable.DescriptorTest
    [junit] Tests run: 1, Failures: 0, Errors: 0, Time elapsed: 0.054 sec
    [junit] 
    [junit] Testsuite: org.apache.cassandra.io.sstable.IndexHelperTest
    [junit] Tests run: 1, Failures: 0, Errors: 0, Time elapsed: 0.06 sec
    [junit] 
    [junit] Testsuite: org.apache.cassandra.io.sstable.LegacySSTableTest
    [junit] Tests run: 1, Failures: 0, Errors: 0, Time elapsed: 1.391 sec
    [junit] 
    [junit] ------------- Standard Error -----------------
    [junit]  WARN 18:15:43,539 Invalid file '.svn' in data directory <https://hudson.apache.org/hudson/job/Cassandra/ws/cassandra/test/data/legacy-sstables/e/Keyspace1.>
    [junit]  WARN 18:15:44,111 Invalid file '.svn' in data directory <https://hudson.apache.org/hudson/job/Cassandra/ws/cassandra/test/data/legacy-sstables/b/Keyspace1.>
    [junit] ------------- ---------------- ---------------
    [junit] Testsuite: org.apache.cassandra.io.sstable.SSTableReaderTest
    [junit] Tests run: 3, Failures: 0, Errors: 0, Time elapsed: 4.32 sec
    [junit] 
    [junit] Testsuite: org.apache.cassandra.io.sstable.SSTableTest
    [junit] Tests run: 2, Failures: 0, Errors: 0, Time elapsed: 1.493 sec
    [junit] 
    [junit] Testsuite: org.apache.cassandra.io.sstable.SSTableWriterCommutativeTest
    [junit] Tests run: 1, Failures: 0, Errors: 0, Time elapsed: 1.347 sec
    [junit] 
    [junit] Testsuite: org.apache.cassandra.io.sstable.SSTableWriterTest
    [junit] Tests run: 1, Failures: 0, Errors: 0, Time elapsed: 1.125 sec
    [junit] 
    [junit] Testsuite: org.apache.cassandra.io.util.BufferedRandomAccessFileTest
    [junit] Tests run: 20, Failures: 0, Errors: 0, Time elapsed: 2.808 sec
    [junit] 
    [junit] Testsuite: org.apache.cassandra.locator.DynamicEndpointSnitchTest
    [junit] Tests run: 1, Failures: 0, Errors: 0, Time elapsed: 6.183 sec
    [junit] 
    [junit] Testsuite: org.apache.cassandra.locator.NetworkTopologyStrategyTest
    [junit] Tests run: 1, Failures: 0, Errors: 0, Time elapsed: 0.435 sec
    [junit] 
    [junit] Testsuite: org.apache.cassandra.locator.OldNetworkTopologyStrategyTest
    [junit] Tests run: 3, Failures: 0, Errors: 0, Time elapsed: 0.449 sec
    [junit] 
    [junit] Testsuite: org.apache.cassandra.locator.ReplicationStrategyEndpointCacheTest
    [junit] Tests run: 2, Failures: 0, Errors: 0, Time elapsed: 0.594 sec
    [junit] 
    [junit] Testsuite: org.apache.cassandra.locator.SimpleStrategyTest
    [junit] Tests run: 4, Failures: 0, Errors: 0, Time elapsed: 0.664 sec
    [junit] 
    [junit] Testsuite: org.apache.cassandra.locator.TokenMetadataTest
    [junit] Tests run: 2, Failures: 0, Errors: 0, Time elapsed: 0.421 sec
    [junit] 
    [junit] Testsuite: org.apache.cassandra.service.AntiEntropyServiceCounterTest
    [junit] Tests run: 7, Failures: 0, Errors: 0, Time elapsed: 2.516 sec
    [junit] 
    [junit] ------------- Standard Error -----------------
    [junit]  WARN 18:16:14,640 Generated random token Token(bytes[6fc53933ffd4aeed8e65b2897b124bfd]).
Random tokens will result in an unbalanced ring; see http://wiki.apache.org/cassandra/Operations
    [junit] Exception in thread "Thread-4" java.lang.RuntimeException: java.lang.NullPointerException
    [junit] 	at org.apache.cassandra.utils.WrappedRunnable.run(WrappedRunnable.java:34)
    [junit] 	at org.apache.cassandra.streaming.StreamInSession.closeIfFinished(StreamInSession.java:169)
    [junit] 	at org.apache.cassandra.streaming.IncomingStreamReader.read(IncomingStreamReader.java:63)
    [junit] 	at org.apache.cassandra.net.IncomingTcpConnection.stream(IncomingTcpConnection.java:155)
    [junit] 	at org.apache.cassandra.net.IncomingTcpConnection.run(IncomingTcpConnection.java:93)
    [junit] Caused by: java.lang.NullPointerException
    [junit] 	at org.apache.cassandra.service.AntiEntropyService.completedRequest(AntiEntropyService.java:135)
    [junit] 	at org.apache.cassandra.service.AntiEntropyService$Differencer$Callback.runMayThrow(AntiEntropyService.java:528)
    [junit] 	at org.apache.cassandra.utils.WrappedRunnable.run(WrappedRunnable.java:30)
    [junit] 	... 4 more
    [junit] ------------- ---------------- ---------------
    [junit] Testsuite: org.apache.cassandra.service.AntiEntropyServiceStandardTest
    [junit] Tests run: 7, Failures: 0, Errors: 0, Time elapsed: 2.19 sec
    [junit] 
    [junit] ------------- Standard Error -----------------
    [junit]  WARN 18:16:18,003 Generated random token Token(bytes[76fc4910414e93a1390eb056c8dd15d1]).
Random tokens will result in an unbalanced ring; see http://wiki.apache.org/cassandra/Operations
    [junit] Exception in thread "Thread-4" java.lang.RuntimeException: java.lang.NullPointerException
    [junit] 	at org.apache.cassandra.utils.WrappedRunnable.run(WrappedRunnable.java:34)
    [junit] 	at org.apache.cassandra.streaming.StreamInSession.closeIfFinished(StreamInSession.java:169)
    [junit] 	at org.apache.cassandra.streaming.IncomingStreamReader.read(IncomingStreamReader.java:63)
    [junit] 	at org.apache.cassandra.net.IncomingTcpConnection.stream(IncomingTcpConnection.java:155)
    [junit] 	at org.apache.cassandra.net.IncomingTcpConnection.run(IncomingTcpConnection.java:93)
    [junit] Caused by: java.lang.NullPointerException
    [junit] 	at org.apache.cassandra.service.AntiEntropyService.completedRequest(AntiEntropyService.java:135)
    [junit] 	at org.apache.cassandra.service.AntiEntropyService$Differencer$Callback.runMayThrow(AntiEntropyService.java:528)
    [junit] 	at org.apache.cassandra.utils.WrappedRunnable.run(WrappedRunnable.java:30)
    [junit] 	... 4 more
    [junit] ------------- ---------------- ---------------
    [junit] Testsuite: org.apache.cassandra.service.AntiEntropyServiceTest
    [junit] Tests run: 7, Failures: 0, Errors: 0, Time elapsed: 2.25 sec
    [junit] 
    [junit] ------------- Standard Error -----------------
    [junit]  WARN 18:16:21,305 Generated random token Token(bytes[5768e2aaa0e6885089132abb2c225862]).
Random tokens will result in an unbalanced ring; see http://wiki.apache.org/cassandra/Operations
    [junit] Exception in thread "Thread-4" java.lang.RuntimeException: java.lang.NullPointerException
    [junit] 	at org.apache.cassandra.utils.WrappedRunnable.run(WrappedRunnable.java:34)
    [junit] 	at org.apache.cassandra.streaming.StreamInSession.closeIfFinished(StreamInSession.java:169)
    [junit] 	at org.apache.cassandra.streaming.IncomingStreamReader.read(IncomingStreamReader.java:63)
    [junit] 	at org.apache.cassandra.net.IncomingTcpConnection.stream(IncomingTcpConnection.java:155)
    [junit] 	at org.apache.cassandra.net.IncomingTcpConnection.run(IncomingTcpConnection.java:93)
    [junit] Caused by: java.lang.NullPointerException
    [junit] 	at org.apache.cassandra.service.AntiEntropyService.completedRequest(AntiEntropyService.java:135)
    [junit] 	at org.apache.cassandra.service.AntiEntropyService$Differencer$Callback.runMayThrow(AntiEntropyService.java:528)
    [junit] 	at org.apache.cassandra.utils.WrappedRunnable.run(WrappedRunnable.java:30)
    [junit] 	... 4 more
    [junit] ------------- ---------------- ---------------
    [junit] Testsuite: org.apache.cassandra.service.CassandraServerTest
    [junit] Tests run: 1, Failures: 0, Errors: 0, Time elapsed: 0.43 sec
    [junit] 
    [junit] Testsuite: org.apache.cassandra.service.ConsistencyLevelTest
    [junit] Tests run: 1, Failures: 0, Errors: 0, Time elapsed: 0.869 sec
    [junit] 
    [junit] Testsuite: org.apache.cassandra.service.EmbeddedCassandraServiceTest
    [junit] Tests run: 1, Failures: 0, Errors: 0, Time elapsed: 1.286 sec
    [junit] 
    [junit] ------------- Standard Error -----------------
    [junit]  WARN 18:16:27,283 Unable to lock JVM memory (ENOMEM). This can result in part
of the JVM being swapped out, especially with mmapped I/O enabled. Increase RLIMIT_MEMLOCK
or run Cassandra as root.
    [junit]  WARN 18:16:27,835 Generated random token Token(bytes[f4e8d55aff314963f1133a17f6c43139]).
Random tokens will result in an unbalanced ring; see http://wiki.apache.org/cassandra/Operations
    [junit] ------------- ---------------- ---------------
    [junit] Testsuite: org.apache.cassandra.service.InitClientTest
    [junit] Tests run: 1, Failures: 0, Errors: 0, Time elapsed: 5.425 sec
    [junit] 
    [junit] Testsuite: org.apache.cassandra.service.LeaveAndBootstrapTest
    [junit] Tests run: 6, Failures: 0, Errors: 0, Time elapsed: 3.586 sec
    [junit] 
    [junit] ------------- Standard Error -----------------
    [junit]  WARN 18:16:38,392 Node /127.0.0.3 'leaving' token mismatch. Long network partition?
    [junit] ------------- ---------------- ---------------
    [junit] Testsuite: org.apache.cassandra.service.MoveTest
    [junit] Tests run: 3, Failures: 0, Errors: 0, Time elapsed: 1.919 sec
    [junit] 
    [junit] Testsuite: org.apache.cassandra.service.RemoveTest
    [junit] Tests run: 5, Failures: 0, Errors: 0, Time elapsed: 2.951 sec
    [junit] 
    [junit] Testsuite: org.apache.cassandra.service.RowResolverTest
    [junit] Tests run: 5, Failures: 0, Errors: 0, Time elapsed: 0.449 sec
    [junit] 
    [junit] Testsuite: org.apache.cassandra.service.SerializationsTest
    [junit] Tests run: 2, Failures: 0, Errors: 0, Time elapsed: 0.456 sec
    [junit] 
    [junit] Testsuite: org.apache.cassandra.service.StorageProxyTest
    [junit] Tests run: 4, Failures: 0, Errors: 0, Time elapsed: 0.447 sec
    [junit] 
    [junit] Testsuite: org.apache.cassandra.service.StorageServiceClientTest
    [junit] Tests run: 1, Failures: 0, Errors: 0, Time elapsed: 5.466 sec
    [junit] 
    [junit] Testsuite: org.apache.cassandra.service.StorageServiceServerTest
    [junit] Tests run: 3, Failures: 0, Errors: 0, Time elapsed: 0.924 sec
    [junit] 
    [junit] ------------- Standard Error -----------------
    [junit]  WARN 18:16:57,518 Generated random token Token(bytes[83b74178ab274d59c35bc4e9fa3a17f9]).
Random tokens will result in an unbalanced ring; see http://wiki.apache.org/cassandra/Operations
    [junit] ------------- ---------------- ---------------
    [junit] Testsuite: org.apache.cassandra.streaming.BootstrapTest
    [junit] Tests run: 1, Failures: 0, Errors: 0, Time elapsed: 0.591 sec
    [junit] 
    [junit] Testsuite: org.apache.cassandra.streaming.SerializationsTest
    [junit] Tests run: 4, Failures: 0, Errors: 0, Time elapsed: 0.471 sec
    [junit] 
    [junit] Testsuite: org.apache.cassandra.streaming.StreamingTransferTest
    [junit] Tests run: 3, Failures: 0, Errors: 0, Time elapsed: 2.312 sec
    [junit] 
    [junit] ------------- Standard Error -----------------
    [junit]  WARN 18:17:01,713 Generated random token Token(bytes[30f09c7f3684b7d5a946e71b8dddbd95]).
Random tokens will result in an unbalanced ring; see http://wiki.apache.org/cassandra/Operations
    [junit] ------------- ---------------- ---------------
    [junit] Testsuite: org.apache.cassandra.thrift.ThriftValidationTest
    [junit] Tests run: 2, Failures: 0, Errors: 0, Time elapsed: 0.436 sec
    [junit] 
    [junit] Testsuite: org.apache.cassandra.tools.SSTableExportTest
    [junit] Tests run: 5, Failures: 0, Errors: 0, Time elapsed: 1.495 sec
    [junit] 
    [junit] ------------- Standard Output ---------------
    [junit] Importing 1 keys...
    [junit] 1 keys imported successfully.
    [junit] ------------- ---------------- ---------------
    [junit] Testsuite: org.apache.cassandra.tools.SSTableImportTest
    [junit] Tests run: 5, Failures: 0, Errors: 0, Time elapsed: 1.044 sec
    [junit] 
    [junit] ------------- Standard Output ---------------
    [junit] Importing 2 keys...
    [junit] 2 keys imported successfully.
    [junit] Importing 2 keys...
    [junit] 2 keys imported successfully.
    [junit] Importing 2 keys...
    [junit] 2 keys imported successfully.
    [junit] Importing 3 keys...
    [junit] Importing 3 keys...
    [junit] 1 keys imported successfully.
    [junit] ------------- ---------------- ---------------
    [junit] ------------- Standard Error -----------------
    [junit] Line 2: Key 303630 is greater than previous, collection is not sorted properly.
Aborting import. You might need to delete SSTables manually.
    [junit] ------------- ---------------- ---------------
    [junit] Testsuite: org.apache.cassandra.utils.BloomFilterTest
    [junit] Tests run: 7, Failures: 0, Errors: 0, Time elapsed: 0.681 sec
    [junit] 
    [junit] Testsuite: org.apache.cassandra.utils.BoundedStatsDequeTest
    [junit] Tests run: 1, Failures: 0, Errors: 0, Time elapsed: 0.053 sec
    [junit] 
    [junit] Testsuite: org.apache.cassandra.utils.ByteBufferUtilTest
    [junit] Tests run: 10, Failures: 0, Errors: 0, Time elapsed: 0.142 sec
    [junit] 
    [junit] Testsuite: org.apache.cassandra.utils.EstimatedHistogramTest
    [junit] Tests run: 4, Failures: 0, Errors: 0, Time elapsed: 0.055 sec
    [junit] 
    [junit] Testsuite: org.apache.cassandra.utils.FBUtilitiesTest
    [junit] Tests run: 5, Failures: 0, Errors: 0, Time elapsed: 0.135 sec
    [junit] 
    [junit] Testsuite: org.apache.cassandra.utils.LegacyBloomFilterTest
    [junit] Tests run: 6, Failures: 0, Errors: 0, Time elapsed: 0.622 sec
    [junit] 
    [junit] Testsuite: org.apache.cassandra.utils.MerkleTreeTest
    [junit] Tests run: 14, Failures: 0, Errors: 0, Time elapsed: 0.435 sec
    [junit] 
    [junit] Testsuite: org.apache.cassandra.utils.SerializationsTest
    [junit] Tests run: 3, Failures: 0, Errors: 0, Time elapsed: 0.658 sec
    [junit] 

BUILD FAILED
<https://hudson.apache.org/hudson/job/Cassandra/ws/cassandra/build.xml>:648: The following
error occurred while executing this line:
<https://hudson.apache.org/hudson/job/Cassandra/ws/cassandra/build.xml>:634: Some unit
test(s) failed.

Total time: 15 minutes 48 seconds
[TASKS] Skipping publisher since build result is FAILURE
Publishing Javadoc
Archiving artifacts
Recording test results


Mime
View raw message