cassandra-dev mailing list archives

Site index · List index
Message view « Date » · « Thread »
Top « Date » · « Thread »
From Apache Hudson Server <hud...@hudson.apache.org>
Subject Build failed in Jenkins: Cassandra-Coverage #1
Date Wed, 09 Mar 2011 09:37:17 GMT
See <https://hudson.apache.org/hudson/job/Cassandra-Coverage/1/>

------------------------------------------
[...truncated 1961 lines...]
    [junit] Testsuite: org.apache.cassandra.service.LeaveAndBootstrapTest
    [junit] Tests run: 6, Failures: 0, Errors: 0, Time elapsed: 3.505 sec
    [junit] 
    [junit] ------------- Standard Error -----------------
    [junit]  WARN 09:36:02,214 Node /127.0.0.3 'leaving' token mismatch. Long network partition?
    [junit] ------------- ---------------- ---------------
    [junit] Flushing results...
    [junit] Flushing results done
    [junit] Cobertura: Loaded information on 798 classes.
    [junit] Cobertura: Saved information on 798 classes.
    [junit] Testsuite: org.apache.cassandra.service.MoveTest
    [junit] Tests run: 3, Failures: 0, Errors: 0, Time elapsed: 2.343 sec
    [junit] 
    [junit] Flushing results...
    [junit] Flushing results done
    [junit] Cobertura: Loaded information on 798 classes.
    [junit] Cobertura: Saved information on 798 classes.
    [junit] Testsuite: org.apache.cassandra.service.RemoveTest
    [junit] Tests run: 5, Failures: 0, Errors: 0, Time elapsed: 5.555 sec
    [junit] 
    [junit] Flushing results...
    [junit] Flushing results done
    [junit] Cobertura: Loaded information on 798 classes.
    [junit] Cobertura: Saved information on 798 classes.
    [junit] Testsuite: org.apache.cassandra.service.RowResolverTest
    [junit] Tests run: 5, Failures: 0, Errors: 0, Time elapsed: 0.517 sec
    [junit] 
    [junit] Flushing results...
    [junit] Flushing results done
    [junit] Cobertura: Loaded information on 798 classes.
    [junit] Cobertura: Saved information on 798 classes.
    [junit] Testsuite: org.apache.cassandra.service.SerializationsTest
    [junit] Tests run: 2, Failures: 0, Errors: 1, Time elapsed: 0.576 sec
    [junit] 
    [junit] Testcase: testTreeResponseRead(org.apache.cassandra.service.SerializationsTest):
Caused an ERROR
    [junit] java.io.InvalidClassException: org.apache.cassandra.dht.BigIntegerToken; local
class incompatible: stream classdesc serialVersionUID = -5833589141319293006, local class
serialVersionUID = 2280189098581028124
    [junit] java.lang.RuntimeException: java.io.InvalidClassException: org.apache.cassandra.dht.BigIntegerToken;
local class incompatible: stream classdesc serialVersionUID = -5833589141319293006, local
class serialVersionUID = 2280189098581028124
    [junit] 	at org.apache.cassandra.service.AntiEntropyService$TreeResponseVerbHandler.deserialize(AntiEntropyService.java:639)
    [junit] 	at org.apache.cassandra.service.SerializationsTest.testTreeResponseRead(SerializationsTest.java:91)
    [junit] Caused by: java.io.InvalidClassException: org.apache.cassandra.dht.BigIntegerToken;
local class incompatible: stream classdesc serialVersionUID = -5833589141319293006, local
class serialVersionUID = 2280189098581028124
    [junit] 	at java.io.ObjectStreamClass.initNonProxy(ObjectStreamClass.java:562)
    [junit] 	at java.io.ObjectInputStream.readNonProxyDesc(ObjectInputStream.java:1583)
    [junit] 	at java.io.ObjectInputStream.readClassDesc(ObjectInputStream.java:1496)
    [junit] 	at java.io.ObjectInputStream.readOrdinaryObject(ObjectInputStream.java:1732)
    [junit] 	at java.io.ObjectInputStream.readObject0(ObjectInputStream.java:1329)
    [junit] 	at java.io.ObjectInputStream.defaultReadFields(ObjectInputStream.java:1947)
    [junit] 	at java.io.ObjectInputStream.readSerialData(ObjectInputStream.java:1871)
    [junit] 	at java.io.ObjectInputStream.readOrdinaryObject(ObjectInputStream.java:1753)
    [junit] 	at java.io.ObjectInputStream.readObject0(ObjectInputStream.java:1329)
    [junit] 	at java.io.ObjectInputStream.defaultReadFields(ObjectInputStream.java:1947)
    [junit] 	at java.io.ObjectInputStream.readSerialData(ObjectInputStream.java:1871)
    [junit] 	at java.io.ObjectInputStream.readOrdinaryObject(ObjectInputStream.java:1753)
    [junit] 	at java.io.ObjectInputStream.readObject0(ObjectInputStream.java:1329)
    [junit] 	at java.io.ObjectInputStream.defaultReadFields(ObjectInputStream.java:1947)
    [junit] 	at java.io.ObjectInputStream.readSerialData(ObjectInputStream.java:1871)
    [junit] 	at java.io.ObjectInputStream.readOrdinaryObject(ObjectInputStream.java:1753)
    [junit] 	at java.io.ObjectInputStream.readObject0(ObjectInputStream.java:1329)
    [junit] 	at java.io.ObjectInputStream.defaultReadFields(ObjectInputStream.java:1947)
    [junit] 	at java.io.ObjectInputStream.readSerialData(ObjectInputStream.java:1871)
    [junit] 	at java.io.ObjectInputStream.readOrdinaryObject(ObjectInputStream.java:1753)
    [junit] 	at java.io.ObjectInputStream.readObject0(ObjectInputStream.java:1329)
    [junit] 	at java.io.ObjectInputStream.defaultReadFields(ObjectInputStream.java:1947)
    [junit] 	at java.io.ObjectInputStream.readSerialData(ObjectInputStream.java:1871)
    [junit] 	at java.io.ObjectInputStream.readOrdinaryObject(ObjectInputStream.java:1753)
    [junit] 	at java.io.ObjectInputStream.readObject0(ObjectInputStream.java:1329)
    [junit] 	at java.io.ObjectInputStream.readObject(ObjectInputStream.java:351)
    [junit] 	at org.apache.cassandra.service.AntiEntropyService$TreeResponseVerbHandler.deserialize(AntiEntropyService.java:635)
    [junit] 
    [junit] 
    [junit] Flushing results...
    [junit] Flushing results done
    [junit] Cobertura: Loaded information on 798 classes.
    [junit] Cobertura: Saved information on 798 classes.
    [junit] Test org.apache.cassandra.service.SerializationsTest FAILED
    [junit] Testsuite: org.apache.cassandra.service.StorageProxyTest
    [junit] Tests run: 4, Failures: 0, Errors: 0, Time elapsed: 0.568 sec
    [junit] 
    [junit] Flushing results...
    [junit] Flushing results done
    [junit] Cobertura: Loaded information on 798 classes.
    [junit] Cobertura: Saved information on 798 classes.
    [junit] Testsuite: org.apache.cassandra.service.StorageServiceClientTest
    [junit] Tests run: 1, Failures: 0, Errors: 0, Time elapsed: 5.535 sec
    [junit] 
    [junit] Flushing results...
    [junit] Flushing results done
    [junit] Cobertura: Loaded information on 798 classes.
    [junit] Cobertura: Saved information on 798 classes.
    [junit] Testsuite: org.apache.cassandra.service.StorageServiceServerTest
    [junit] Tests run: 3, Failures: 0, Errors: 0, Time elapsed: 1.199 sec
    [junit] 
    [junit] ------------- Standard Error -----------------
    [junit]  WARN 09:36:32,631 Generated random token Token(bytes[22e6d3bc9f57e0b441a3b846e518d190]).
Random tokens will result in an unbalanced ring; see http://wiki.apache.org/cassandra/Operations
    [junit] ------------- ---------------- ---------------
    [junit] Flushing results...
    [junit] Flushing results done
    [junit] Cobertura: Loaded information on 798 classes.
    [junit] Cobertura: Saved information on 798 classes.
    [junit] Testsuite: org.apache.cassandra.streaming.BootstrapTest
    [junit] Tests run: 1, Failures: 0, Errors: 0, Time elapsed: 0.724 sec
    [junit] 
    [junit] ------------- Standard Error -----------------
    [junit]  WARN 09:36:35,297 Invalid file 'backups' in data directory build/test/cassandra/data/system.
    [junit]  WARN 09:36:35,299 Invalid file 'backups' in data directory build/test/cassandra/data/system.
    [junit]  WARN 09:36:35,300 Invalid file 'backups' in data directory build/test/cassandra/data/system.
    [junit]  WARN 09:36:35,302 Invalid file 'backups' in data directory build/test/cassandra/data/system.
    [junit]  WARN 09:36:35,303 Invalid file 'backups' in data directory build/test/cassandra/data/system.
    [junit]  WARN 09:36:35,305 Invalid file 'backups' in data directory build/test/cassandra/data/system.
    [junit]  WARN 09:36:35,306 Invalid file 'backups' in data directory build/test/cassandra/data/system.
    [junit]  WARN 09:36:35,308 Invalid file 'backups' in data directory build/test/cassandra/data/system.
    [junit]  WARN 09:36:35,395 Invalid file 'backups' in data directory build/test/cassandra/data/system.
    [junit]  WARN 09:36:35,397 Invalid file 'backups' in data directory build/test/cassandra/data/system.
    [junit] ------------- ---------------- ---------------
    [junit] Flushing results...
    [junit] Flushing results done
    [junit] Cobertura: Loaded information on 798 classes.
    [junit] Cobertura: Saved information on 798 classes.
    [junit] Testsuite: org.apache.cassandra.streaming.SerializationsTest
    [junit] Tests run: 4, Failures: 0, Errors: 0, Time elapsed: 0.584 sec
    [junit] 
    [junit] Flushing results...
    [junit] Flushing results done
    [junit] Cobertura: Loaded information on 798 classes.
    [junit] Cobertura: Saved information on 798 classes.
    [junit] Testsuite: org.apache.cassandra.streaming.StreamingTransferTest
    [junit] Tests run: 3, Failures: 0, Errors: 0, Time elapsed: 2.681 sec
    [junit] 
    [junit] ------------- Standard Error -----------------
    [junit]  WARN 09:36:41,011 Generated random token Token(bytes[b7d94b48f0e49c076c16063fb97a2581]).
Random tokens will result in an unbalanced ring; see http://wiki.apache.org/cassandra/Operations
    [junit]  WARN 09:36:41,831 Invalid file 'backups' in data directory build/test/cassandra/data/Keyspace1.
    [junit]  WARN 09:36:41,832 Invalid file 'backups' in data directory build/test/cassandra/data/Keyspace1.
    [junit]  WARN 09:36:42,256 Invalid file 'backups' in data directory build/test/cassandra/data/Keyspace1.
    [junit]  WARN 09:36:42,257 Invalid file 'backups' in data directory build/test/cassandra/data/Keyspace1.
    [junit]  WARN 09:36:42,337 Invalid file 'backups' in data directory build/test/cassandra/data/Keyspace1.
    [junit]  WARN 09:36:42,338 Invalid file 'backups' in data directory build/test/cassandra/data/Keyspace1.
    [junit]  WARN 09:36:42,774 Invalid file 'backups' in data directory build/test/cassandra/data/Keyspace1.
    [junit]  WARN 09:36:42,776 Invalid file 'backups' in data directory build/test/cassandra/data/Keyspace1.
    [junit]  WARN 09:36:42,855 Invalid file 'backups' in data directory build/test/cassandra/data/Keyspace1.
    [junit]  WARN 09:36:42,857 Invalid file 'backups' in data directory build/test/cassandra/data/Keyspace1.
    [junit]  WARN 09:36:42,922 Invalid file 'backups' in data directory build/test/cassandra/data/Keyspace1.
    [junit]  WARN 09:36:42,925 Invalid file 'backups' in data directory build/test/cassandra/data/Keyspace1.
    [junit] ------------- ---------------- ---------------
    [junit] Flushing results...
    [junit] Flushing results done
    [junit] Cobertura: Loaded information on 798 classes.
    [junit] Cobertura: Saved information on 798 classes.
    [junit] Testsuite: org.apache.cassandra.thrift.ThriftValidationTest
    [junit] Tests run: 2, Failures: 0, Errors: 0, Time elapsed: 0.517 sec
    [junit] 
    [junit] Flushing results...
    [junit] Flushing results done
    [junit] Cobertura: Loaded information on 798 classes.
    [junit] Cobertura: Saved information on 798 classes.
    [junit] Testsuite: org.apache.cassandra.tools.SSTableExportTest
    [junit] Tests run: 5, Failures: 0, Errors: 0, Time elapsed: 1.601 sec
    [junit] 
    [junit] ------------- Standard Output ---------------
    [junit] Importing 1 keys...
    [junit] 1 keys imported successfully.
    [junit] ------------- ---------------- ---------------
    [junit] Flushing results...
    [junit] Flushing results done
    [junit] Cobertura: Loaded information on 798 classes.
    [junit] Cobertura: Saved information on 798 classes.
    [junit] Testsuite: org.apache.cassandra.tools.SSTableImportTest
    [junit] Tests run: 5, Failures: 0, Errors: 0, Time elapsed: 1.341 sec
    [junit] 
    [junit] ------------- Standard Output ---------------
    [junit] Importing 2 keys...
    [junit] 2 keys imported successfully.
    [junit] Importing 2 keys...
    [junit] 2 keys imported successfully.
    [junit] Importing 2 keys...
    [junit] 2 keys imported successfully.
    [junit] Importing 3 keys...
    [junit] Importing 3 keys...
    [junit] 1 keys imported successfully.
    [junit] ------------- ---------------- ---------------
    [junit] ------------- Standard Error -----------------
    [junit] Line 2: Key 303630 is greater than previous, collection is not sorted properly.
Aborting import. You might need to delete SSTables manually.
    [junit] ------------- ---------------- ---------------
    [junit] Flushing results...
    [junit] Flushing results done
    [junit] Cobertura: Loaded information on 798 classes.
    [junit] Cobertura: Saved information on 798 classes.
    [junit] Testsuite: org.apache.cassandra.utils.BloomFilterTest
    [junit] Tests run: 7, Failures: 0, Errors: 0, Time elapsed: 2.423 sec
    [junit] 
    [junit] Flushing results...
    [junit] Flushing results done
    [junit] Cobertura: Loaded information on 798 classes.
    [junit] Cobertura: Saved information on 798 classes.
    [junit] Testsuite: org.apache.cassandra.utils.BoundedStatsDequeTest
    [junit] Tests run: 1, Failures: 0, Errors: 0, Time elapsed: 0.064 sec
    [junit] 
    [junit] Flushing results...
    [junit] Flushing results done
    [junit] Cobertura: Loaded information on 798 classes.
    [junit] Cobertura: Saved information on 798 classes.
    [junit] Testsuite: org.apache.cassandra.utils.ByteBufferUtilTest
    [junit] Tests run: 10, Failures: 0, Errors: 0, Time elapsed: 0.178 sec
    [junit] 
    [junit] Flushing results...
    [junit] Flushing results done
    [junit] Cobertura: Loaded information on 798 classes.
    [junit] Cobertura: Saved information on 798 classes.
    [junit] Testsuite: org.apache.cassandra.utils.EstimatedHistogramTest
    [junit] Tests run: 4, Failures: 0, Errors: 0, Time elapsed: 0.076 sec
    [junit] 
    [junit] Flushing results...
    [junit] Flushing results done
    [junit] Cobertura: Loaded information on 798 classes.
    [junit] Cobertura: Saved information on 798 classes.
    [junit] Testsuite: org.apache.cassandra.utils.FBUtilitiesTest
    [junit] Tests run: 5, Failures: 0, Errors: 0, Time elapsed: 0.168 sec
    [junit] 
    [junit] Flushing results...
    [junit] Flushing results done
    [junit] Cobertura: Loaded information on 798 classes.
    [junit] Cobertura: Saved information on 798 classes.
    [junit] Testsuite: org.apache.cassandra.utils.LegacyBloomFilterTest
    [junit] Tests run: 6, Failures: 0, Errors: 0, Time elapsed: 3.059 sec
    [junit] 
    [junit] Flushing results...
    [junit] Flushing results done
    [junit] Cobertura: Loaded information on 798 classes.
    [junit] Cobertura: Saved information on 798 classes.
    [junit] Testsuite: org.apache.cassandra.utils.MerkleTreeTest
    [junit] Tests run: 14, Failures: 0, Errors: 0, Time elapsed: 0.543 sec
    [junit] 
    [junit] Flushing results...
    [junit] Flushing results done
    [junit] Cobertura: Loaded information on 798 classes.
    [junit] Cobertura: Saved information on 798 classes.
    [junit] Testsuite: org.apache.cassandra.utils.SerializationsTest
    [junit] Tests run: 3, Failures: 0, Errors: 0, Time elapsed: 0.863 sec
    [junit] 
    [junit] Flushing results...
    [junit] Flushing results done
    [junit] Cobertura: Loaded information on 798 classes.
    [junit] Cobertura: Saved information on 798 classes.

BUILD FAILED
<https://hudson.apache.org/hudson/job/Cassandra-Coverage/ws/cassandra/build.xml>:639:
The following error occurred while executing this line:
<https://hudson.apache.org/hudson/job/Cassandra-Coverage/ws/cassandra/build.xml>:634:
Some unit test(s) failed.

Total time: 9 minutes 4 seconds
Recording test results
Skipping Cobertura coverage report as build was not UNSTABLE or better ...


Mime
View raw message