cassandra-dev mailing list archives

Site index · List index
Message view « Date » · « Thread »
Top « Date » · « Thread »
From Apache Hudson Server <hud...@hudson.zones.apache.org>
Subject Build failed in Hudson: Cassandra #358
Date Wed, 17 Feb 2010 20:07:40 GMT
See <http://hudson.zones.apache.org/hudson/job/Cassandra/358/>

------------------------------------------
[...truncated 1049 lines...]
    [junit] Cobertura: Loaded information on 685 classes.
    [junit] Cobertura: Saved information on 685 classes.
    [junit] Testsuite: org.apache.cassandra.db.RemoveSubColumnTest
    [junit] Tests run: 1, Failures: 0, Errors: 0, Time elapsed: 0.667 sec
    [junit] 
    [junit] Cobertura: Loaded information on 685 classes.
    [junit] Cobertura: Saved information on 685 classes.
    [junit] Testsuite: org.apache.cassandra.db.RemoveSuperColumnTest
    [junit] Tests run: 4, Failures: 0, Errors: 0, Time elapsed: 0.93 sec
    [junit] 
    [junit] Cobertura: Loaded information on 685 classes.
    [junit] Cobertura: Saved information on 685 classes.
    [junit] Testsuite: org.apache.cassandra.db.RowTest
    [junit] Tests run: 3, Failures: 0, Errors: 0, Time elapsed: 0.409 sec
    [junit] 
    [junit] Cobertura: Loaded information on 685 classes.
    [junit] Cobertura: Saved information on 685 classes.
    [junit] Testsuite: org.apache.cassandra.db.SuperColumnTest
    [junit] Tests run: 1, Failures: 0, Errors: 0, Time elapsed: 0.124 sec
    [junit] 
    [junit] Cobertura: Loaded information on 685 classes.
    [junit] Cobertura: Saved information on 685 classes.
    [junit] Testsuite: org.apache.cassandra.db.SystemTableTest
    [junit] Tests run: 2, Failures: 0, Errors: 0, Time elapsed: 0.622 sec
    [junit] 
    [junit] Cobertura: Loaded information on 685 classes.
    [junit] Cobertura: Saved information on 685 classes.
    [junit] Testsuite: org.apache.cassandra.db.TableTest
    [junit] Tests run: 9, Failures: 0, Errors: 0, Time elapsed: 2.682 sec
    [junit] 
    [junit] Cobertura: Loaded information on 685 classes.
    [junit] Cobertura: Saved information on 685 classes.
    [junit] Testsuite: org.apache.cassandra.db.TimeSortTest
    [junit] Tests run: 2, Failures: 0, Errors: 0, Time elapsed: 4.007 sec
    [junit] 
    [junit] Cobertura: Loaded information on 685 classes.
    [junit] Cobertura: Saved information on 685 classes.
    [junit] Testsuite: org.apache.cassandra.db.marshal.AsciiTypeTest
    [junit] Tests run: 1, Failures: 0, Errors: 0, Time elapsed: 0.128 sec
    [junit] 
    [junit] Cobertura: Loaded information on 685 classes.
    [junit] Cobertura: Saved information on 685 classes.
    [junit] Testsuite: org.apache.cassandra.db.marshal.BytesTypeTest
    [junit] Tests run: 1, Failures: 0, Errors: 0, Time elapsed: 0.128 sec
    [junit] 
    [junit] Cobertura: Loaded information on 685 classes.
    [junit] Cobertura: Saved information on 685 classes.
    [junit] Testsuite: org.apache.cassandra.db.marshal.UTF8TypeTest
    [junit] Tests run: 1, Failures: 0, Errors: 0, Time elapsed: 0.076 sec
    [junit] 
    [junit] Cobertura: Loaded information on 685 classes.
    [junit] Cobertura: Saved information on 685 classes.
    [junit] Testsuite: org.apache.cassandra.dht.BootStrapperTest
    [junit] Tests run: 2, Failures: 0, Errors: 0, Time elapsed: 1.343 sec
    [junit] 
    [junit] Cobertura: Loaded information on 685 classes.
    [junit] Cobertura: Saved information on 685 classes.
    [junit] Testsuite: org.apache.cassandra.dht.BoundsTest
    [junit] Tests run: 4, Failures: 0, Errors: 0, Time elapsed: 0.528 sec
    [junit] 
    [junit] Cobertura: Loaded information on 685 classes.
    [junit] Cobertura: Saved information on 685 classes.
    [junit] Testsuite: org.apache.cassandra.dht.CollatingOrderPreservingPartitionerTest
    [junit] Tests run: 8, Failures: 0, Errors: 0, Time elapsed: 12.188 sec
    [junit] 
    [junit] Cobertura: Loaded information on 685 classes.
    [junit] Cobertura: Saved information on 685 classes.
    [junit] Testsuite: org.apache.cassandra.dht.OrderPreservingPartitionerTest
    [junit] Tests run: 7, Failures: 0, Errors: 0, Time elapsed: 6.967 sec
    [junit] 
    [junit] Cobertura: Loaded information on 685 classes.
    [junit] Cobertura: Saved information on 685 classes.
    [junit] Testsuite: org.apache.cassandra.dht.RandomPartitionerTest
    [junit] Tests run: 6, Failures: 0, Errors: 0, Time elapsed: 3.218 sec
    [junit] 
    [junit] Cobertura: Loaded information on 685 classes.
    [junit] Cobertura: Saved information on 685 classes.
    [junit] Testsuite: org.apache.cassandra.dht.RangeIntersectionTest
    [junit] Tests run: 5, Failures: 0, Errors: 0, Time elapsed: 0.533 sec
    [junit] 
    [junit] Cobertura: Loaded information on 685 classes.
    [junit] Cobertura: Saved information on 685 classes.
    [junit] Testsuite: org.apache.cassandra.dht.RangeTest
    [junit] Tests run: 7, Failures: 0, Errors: 0, Time elapsed: 0.525 sec
    [junit] 
    [junit] Cobertura: Loaded information on 685 classes.
    [junit] Cobertura: Saved information on 685 classes.
    [junit] Testsuite: org.apache.cassandra.gms.ArrivalWindowTest
    [junit] Tests run: 1, Failures: 0, Errors: 0, Time elapsed: 0.118 sec
    [junit] 
    [junit] Cobertura: Loaded information on 685 classes.
    [junit] Cobertura: Saved information on 685 classes.
    [junit] Testsuite: org.apache.cassandra.gms.GossipDigestTest
    [junit] Tests run: 1, Failures: 0, Errors: 0, Time elapsed: 0.07 sec
    [junit] 
    [junit] Cobertura: Loaded information on 685 classes.
    [junit] Cobertura: Saved information on 685 classes.
    [junit] Testsuite: org.apache.cassandra.io.SSTableTest
    [junit] Tests run: 2, Failures: 0, Errors: 0, Time elapsed: 5.083 sec
    [junit] 
    [junit] Cobertura: Loaded information on 685 classes.
    [junit] Cobertura: Saved information on 685 classes.
    [junit] Testsuite: org.apache.cassandra.io.StreamingTest
    [junit] Tests run: 1, Failures: 0, Errors: 0, Time elapsed: 0.411 sec
    [junit] 
    [junit] Cobertura: Loaded information on 685 classes.
    [junit] Cobertura: Saved information on 685 classes.
    [junit] Testsuite: org.apache.cassandra.locator.RackUnawareStrategyTest
    [junit] Tests run: 4, Failures: 0, Errors: 0, Time elapsed: 0.577 sec
    [junit] 
    [junit] Cobertura: Loaded information on 685 classes.
    [junit] Cobertura: Saved information on 685 classes.
    [junit] Testsuite: org.apache.cassandra.service.AntiEntropyServiceTest
    [junit] Tests run: 8, Failures: 0, Errors: 0, Time elapsed: 11.533 sec
    [junit] 
    [junit] ------------- Standard Error -----------------
    [junit] ERROR 20:05:29,165 Error in executor futuretask
    [junit] java.util.concurrent.ExecutionException: java.lang.RuntimeException: No replica
strategy configured for ltable
    [junit] 	at java.util.concurrent.FutureTask$Sync.innerGet(FutureTask.java:222)
    [junit] 	at java.util.concurrent.FutureTask.get(FutureTask.java:83)
    [junit] 	at org.apache.cassandra.concurrent.DebuggableThreadPoolExecutor.afterExecute(DebuggableThreadPoolExecutor.java:65)
    [junit] 	at java.util.concurrent.ThreadPoolExecutor$Worker.runTask(ThreadPoolExecutor.java:888)
    [junit] 	at java.util.concurrent.ThreadPoolExecutor$Worker.run(ThreadPoolExecutor.java:908)
    [junit] 	at java.lang.Thread.run(Thread.java:619)
    [junit] Caused by: java.lang.RuntimeException: No replica strategy configured for ltable
    [junit] 	at org.apache.cassandra.service.StorageService.getReplicationStrategy(StorageService.java:245)
    [junit] 	at org.apache.cassandra.service.StorageService.getNaturalEndpoints(StorageService.java:1150)
    [junit] 	at org.apache.cassandra.service.AntiEntropyService.getNeighbors(AntiEntropyService.java:149)
    [junit] 	at org.apache.cassandra.service.AntiEntropyService.access$100(AntiEntropyService.java:88)
    [junit] 	at org.apache.cassandra.service.AntiEntropyService$Validator.call(AntiEntropyService.java:487)
    [junit] 	at java.util.concurrent.FutureTask$Sync.innerRun(FutureTask.java:303)
    [junit] 	at java.util.concurrent.FutureTask.run(FutureTask.java:138)
    [junit] 	at java.util.concurrent.ThreadPoolExecutor$Worker.runTask(ThreadPoolExecutor.java:886)
    [junit] 	... 2 more
    [junit] ERROR 20:05:31,949 Error in executor futuretask
    [junit] java.util.concurrent.ExecutionException: java.lang.RuntimeException: No replica
strategy configured for rtable
    [junit] 	at java.util.concurrent.FutureTask$Sync.innerGet(FutureTask.java:222)
    [junit] 	at java.util.concurrent.FutureTask.get(FutureTask.java:83)
    [junit] 	at org.apache.cassandra.concurrent.DebuggableThreadPoolExecutor.afterExecute(DebuggableThreadPoolExecutor.java:65)
    [junit] 	at java.util.concurrent.ThreadPoolExecutor$Worker.runTask(ThreadPoolExecutor.java:888)
    [junit] 	at java.util.concurrent.ThreadPoolExecutor$Worker.run(ThreadPoolExecutor.java:908)
    [junit] 	at java.lang.Thread.run(Thread.java:619)
    [junit] Caused by: java.lang.RuntimeException: No replica strategy configured for rtable
    [junit] 	at org.apache.cassandra.service.StorageService.getReplicationStrategy(StorageService.java:245)
    [junit] 	at org.apache.cassandra.service.StorageService.getNaturalEndpoints(StorageService.java:1150)
    [junit] 	at org.apache.cassandra.service.AntiEntropyService.getNeighbors(AntiEntropyService.java:149)
    [junit] 	at org.apache.cassandra.service.AntiEntropyService.access$100(AntiEntropyService.java:88)
    [junit] 	at org.apache.cassandra.service.AntiEntropyService$Validator.call(AntiEntropyService.java:487)
    [junit] 	at java.util.concurrent.FutureTask$Sync.innerRun(FutureTask.java:303)
    [junit] 	at java.util.concurrent.FutureTask.run(FutureTask.java:138)
    [junit] 	at java.util.concurrent.ThreadPoolExecutor$Worker.runTask(ThreadPoolExecutor.java:886)
    [junit] 	... 2 more
    [junit] ------------- ---------------- ---------------
    [junit] Cobertura: Loaded information on 685 classes.
    [junit] Cobertura: Saved information on 685 classes.
    [junit] Testsuite: org.apache.cassandra.service.CassandraServerTest
    [junit] Tests run: 1, Failures: 0, Errors: 0, Time elapsed: 0.355 sec
    [junit] 
    [junit] Cobertura: Loaded information on 685 classes.
    [junit] Cobertura: Saved information on 685 classes.
    [junit] Testsuite: org.apache.cassandra.service.EmbeddedCassandraServiceTest
    [junit] Tests run: 1, Failures: 0, Errors: 0, Time elapsed: 0.94 sec
    [junit] 
    [junit] Cobertura: Loaded information on 685 classes.
    [junit] Cobertura: Saved information on 685 classes.
    [junit] Testsuite: org.apache.cassandra.service.MoveTest
    [junit] Tests run: 6, Failures: 0, Errors: 0, Time elapsed: 0.958 sec
    [junit] 
    [junit] ------------- Standard Error -----------------
    [junit]  WARN 20:05:45,441 Node /127.0.0.3 'leaving' token mismatch. Long network partition?
    [junit] ------------- ---------------- ---------------
    [junit] Cobertura: Loaded information on 685 classes.
    [junit] Cobertura: Saved information on 685 classes.
    [junit] Testsuite: org.apache.cassandra.service.ReadResponseResolverTest
    [junit] Tests run: 5, Failures: 0, Errors: 0, Time elapsed: 0.44 sec
    [junit] 
    [junit] Cobertura: Loaded information on 685 classes.
    [junit] Cobertura: Saved information on 685 classes.
    [junit] Testsuite: org.apache.cassandra.service.StorageServiceClientTest
    [junit] Tests run: 1, Failures: 0, Errors: 0, Time elapsed: 0.598 sec
    [junit] 
    [junit] Cobertura: Loaded information on 685 classes.
    [junit] Cobertura: Saved information on 685 classes.
    [junit] Testsuite: org.apache.cassandra.service.StorageServiceServerTest
    [junit] Tests run: 1, Failures: 0, Errors: 0, Time elapsed: 0.695 sec
    [junit] 
    [junit] Cobertura: Loaded information on 685 classes.
    [junit] Cobertura: Saved information on 685 classes.
    [junit] Testsuite: org.apache.cassandra.streaming.BootstrapTest
    [junit] Tests run: 1, Failures: 0, Errors: 0, Time elapsed: 0.569 sec
    [junit] 
    [junit] Cobertura: Loaded information on 685 classes.
    [junit] Cobertura: Saved information on 685 classes.
    [junit] Testsuite: org.apache.cassandra.tools.SSTableExportTest
    [junit] Tests run: 4, Failures: 0, Errors: 0, Time elapsed: 0.832 sec
    [junit] 
    [junit] Cobertura: Loaded information on 685 classes.
    [junit] Cobertura: Saved information on 685 classes.
    [junit] Testsuite: org.apache.cassandra.tools.SSTableImportTest
    [junit] Tests run: 2, Failures: 0, Errors: 0, Time elapsed: 0.666 sec
    [junit] 
    [junit] Cobertura: Loaded information on 685 classes.
    [junit] Cobertura: Saved information on 685 classes.
    [junit] Testsuite: org.apache.cassandra.utils.BloomFilterTest
    [junit] Tests run: 6, Failures: 0, Errors: 0, Time elapsed: 2.486 sec
    [junit] 
    [junit] Cobertura: Loaded information on 685 classes.
    [junit] Cobertura: Saved information on 685 classes.
    [junit] Testsuite: org.apache.cassandra.utils.BoundedStatsDequeTest
    [junit] Tests run: 1, Failures: 0, Errors: 0, Time elapsed: 0.069 sec
    [junit] 
    [junit] Cobertura: Loaded information on 685 classes.
    [junit] Cobertura: Saved information on 685 classes.
    [junit] Testsuite: org.apache.cassandra.utils.FBUtilitiesTest
    [junit] Tests run: 2, Failures: 0, Errors: 0, Time elapsed: 0.148 sec
    [junit] 
    [junit] Cobertura: Loaded information on 685 classes.
    [junit] Cobertura: Saved information on 685 classes.
    [junit] Testsuite: org.apache.cassandra.utils.FilterTest
    [junit] Tests run: 1, Failures: 0, Errors: 0, Time elapsed: 1.634 sec
    [junit] 
    [junit] Cobertura: Loaded information on 685 classes.
    [junit] Cobertura: Saved information on 685 classes.
    [junit] Testsuite: org.apache.cassandra.utils.MerkleTreeTest
    [junit] Tests run: 14, Failures: 0, Errors: 0, Time elapsed: 0.703 sec
    [junit] 
    [junit] Cobertura: Loaded information on 685 classes.
    [junit] Cobertura: Saved information on 685 classes.

cobertura-report:
[cobertura-report] Cobertura 1.9.3 - GNU GPL License (NO WARRANTY) - See COPYRIGHT file
[cobertura-report] Cobertura: Loaded information on 685 classes.
[cobertura-report] Report time: 3905ms
[cobertura-report] Cobertura 1.9.3 - GNU GPL License (NO WARRANTY) - See COPYRIGHT file
[cobertura-report] Cobertura: Loaded information on 685 classes.
[cobertura-report] Report time: 4542ms

codecoverage:

BUILD SUCCESSFUL
Total time: 4 minutes 29 seconds
Publishing Javadoc
Archiving artifacts
Recording test results
[TASKS] Scanning workspace files for tasks...
[TASKS] Found 63 annotations (0 new, 11 high, 51 normal, 1 low)
[TASKS] Not changing build status, since no threshold has been exceeded
Publishing Cobertura coverage report...
No coverage results were found using the pattern 'cassandra/build/cobertura/report/coverage.xml'
relative to '<http://hudson.zones.apache.org/hudson/job/Cassandra/ws/cassandra'.>  Did
you enter a pattern relative to the correct directory?  Did you generate the XML report(s)
for Cobertura?


Mime
View raw message