cassandra-dev mailing list archives

Site index · List index
Message view « Date » · « Thread »
Top « Date » · « Thread »
From Apache Hudson Server <hud...@hudson.zones.apache.org>
Subject Build failed in Hudson: Cassandra #3
Date Sat, 28 Mar 2009 13:08:57 GMT
See http://hudson.zones.apache.org/hudson/job/Cassandra/3/changes

Changes:

[jbellis] r/m entire build dir on clean as suggested in #19

[jbellis] patch from Jun Rao make Thrift port configureable.  Also add sample to config/.
 fixes #10

[jbellis] move test output & classes to build/test.  fixes #18

[jbellis] apply patch from Jun Rao fixing issue #17 (improve the start-server and stop-server
script)

------------------------------------------
started
Building remotely on minerva.apache.org (Ubuntu)
Updating http://svn.apache.org/repos/asf/incubator/cassandra/trunk
U         conf/storage-conf.xml
U         src/org/apache/cassandra/service/CassandraServer.java
U         src/org/apache/cassandra/config/DatabaseDescriptor.java
U         bin/start-server
U         bin/stop-server
U         build.xml
At revision 759459
[cassandra] $ /home/hudson/tools/ant/latest/bin/ant -Dhadoop.version=0.19.0 clean build test
Buildfile: build.xml

clean:
   [delete] Deleting directory http://hudson.zones.apache.org/hudson/job/Cassandra/ws/cassandra/build


build-subprojects:

init:
    [mkdir] Created dir: http://hudson.zones.apache.org/hudson/job/Cassandra/ws/cassandra/build/classes

    [mkdir] Created dir: http://hudson.zones.apache.org/hudson/job/Cassandra/ws/cassandra/build/test/classes


build-project:
     [echo] cassandra: http://hudson.zones.apache.org/hudson/job/Cassandra/ws/cassandra/build.xml

    [javac] Compiling 315 source files to http://hudson.zones.apache.org/hudson/job/Cassandra/ws/cassandra/build/classes

    [javac] http://hudson.zones.apache.org/hudson/job/Cassandra/ws/cassandra/src/org/apache/cassandra/io/ChecksumManager.java
:454: warning: sun.misc.Cleaner is Sun proprietary API and may be removed in a future release
    [javac]                     sun.misc.Cleaner cleaner = (sun.misc.Cleaner)getCleanerMethod.invoke(buffer,new
Object[0]);
    [javac]                             ^
    [javac] http://hudson.zones.apache.org/hudson/job/Cassandra/ws/cassandra/src/org/apache/cassandra/io/ChecksumManager.java
:454: warning: sun.misc.Cleaner is Sun proprietary API and may be removed in a future release
    [javac]                     sun.misc.Cleaner cleaner = (sun.misc.Cleaner)getCleanerMethod.invoke(buffer,new
Object[0]);
    [javac]                                                         ^
    [javac] http://hudson.zones.apache.org/hudson/job/Cassandra/ws/cassandra/src/org/apache/cassandra/io/SequenceFile.java
:435: warning: sun.misc.Cleaner is Sun proprietary API and may be removed in a future release
    [javac]                                                     sun.misc.Cleaner cleaner =
(sun.misc.Cleaner)getCleanerMethod.invoke(buffer,new Object[0]);
    [javac]                                                             ^
    [javac] http://hudson.zones.apache.org/hudson/job/Cassandra/ws/cassandra/src/org/apache/cassandra/io/SequenceFile.java
:435: warning: sun.misc.Cleaner is Sun proprietary API and may be removed in a future release
    [javac]                                                     sun.misc.Cleaner cleaner =
(sun.misc.Cleaner)getCleanerMethod.invoke(buffer,new Object[0]);
    [javac]                                                                              
          ^
    [javac] Note: Some input files use or override a deprecated API.
    [javac] Note: Recompile with -Xlint:deprecation for details.
    [javac] Note: Some input files use unchecked or unsafe operations.
    [javac] Note: Recompile with -Xlint:unchecked for details.
    [javac] 4 warnings

build:

build-subprojects:

init:

build-project:
     [echo] cassandra: http://hudson.zones.apache.org/hudson/job/Cassandra/ws/cassandra/build.xml


build:

build-test:
    [javac] Compiling 15 source files to http://hudson.zones.apache.org/hudson/job/Cassandra/ws/cassandra/build/test/classes


test:
     [echo] running tests
   [testng] [Parser] Running:
   [testng]   Ant suite
   [testng] 
   [testng] FAILED CONFIGURATION: @BeforeMethod cleanup
   [testng] java.lang.NullPointerException
   [testng] 	at org.apache.cassandra.ServerTest.cleanup(Unknown Source)
   [testng] ... Removed 24 stack frames
   [testng] SKIPPED CONFIGURATION: @BeforeMethod cleanup
   [testng] SKIPPED CONFIGURATION: @BeforeMethod cleanup
   [testng] SKIPPED CONFIGURATION: @BeforeMethod cleanup
   [testng] SKIPPED CONFIGURATION: @BeforeMethod cleanup
   [testng] SKIPPED CONFIGURATION: @BeforeMethod cleanup
   [testng] SKIPPED CONFIGURATION: @BeforeMethod cleanup
   [testng] PASSED: testLT
   [testng] PASSED: testGT
   [testng] PASSED: testRange
   [testng] PASSED: testSmall
   [testng] PASSED: testRandom
   [testng] FAILED: testSingleColumn
   [testng] java.lang.ExceptionInInitializerError
   [testng] 	at org.apache.cassandra.db.ColumnFamily.createColumnFactoryAndColumnSerializer(ColumnFamily.java:152)
   [testng] 	at org.apache.cassandra.db.ColumnFamily.<init>(ColumnFamily.java:130)
   [testng] 	at org.apache.cassandra.db.ColumnFamily.<init>(ColumnFamily.java:135)
   [testng] 	at org.apache.cassandra.db.ColumnFamilyTest.testSingleColumn(Unknown Source)
   [testng] Caused by: java.lang.RuntimeException: java.io.IOException: No such file or directory
   [testng] 	at org.apache.cassandra.config.DatabaseDescriptor.<clinit>(DatabaseDescriptor.java:421)
   [testng] 	... 26 more
   [testng] Caused by: java.io.IOException: No such file or directory
   [testng] 	at java.io.UnixFileSystem.createFileExclusively(Native Method)
   [testng] 	at java.io.File.createNewFile(File.java:883)
   [testng] 	at org.apache.cassandra.io.SequenceFile$Writer.init(SequenceFile.java:100)
   [testng] 	at org.apache.cassandra.io.SequenceFile$Writer.<init>(SequenceFile.java:86)
   [testng] 	at org.apache.cassandra.io.SequenceFile.writer(SequenceFile.java:1440)
   [testng] 	at org.apache.cassandra.db.Table$TableMetadata.instance(Table.java:89)
   [testng] 	at org.apache.cassandra.config.DatabaseDescriptor.storeMetadata(DatabaseDescriptor.java:438)
   [testng] 	at org.apache.cassandra.config.DatabaseDescriptor.<clinit>(DatabaseDescriptor.java:417)
   [testng] 	... 26 more
   [testng] ... Removed 22 stack frames
   [testng] FAILED: testManyColumns
   [testng] java.lang.NoClassDefFoundError: Could not initialize class org.apache.cassandra.config.DatabaseDescriptor
   [testng] 	at org.apache.cassandra.db.ColumnFamily.createColumnFactoryAndColumnSerializer(ColumnFamily.java:152)
   [testng] 	at org.apache.cassandra.db.ColumnFamily.<init>(ColumnFamily.java:130)
   [testng] 	at org.apache.cassandra.db.ColumnFamily.<init>(ColumnFamily.java:135)
   [testng] 	at org.apache.cassandra.db.ColumnFamilyTest.testManyColumns(Unknown Source)
   [testng] ... Removed 22 stack frames
   [testng] FAILED: testOpen
   [testng] java.lang.NoClassDefFoundError: Could not initialize class org.apache.cassandra.config.DatabaseDescriptor
   [testng] 	at org.apache.cassandra.service.StorageService.<clinit>(StorageService.java:449)
   [testng] 	at org.apache.cassandra.analytics.AnalyticsContext.<init>(AnalyticsContext.java:148)
   [testng] 	at org.apache.cassandra.analytics.AnalyticsContext.instance(AnalyticsContext.java:778)
   [testng] 	at org.apache.cassandra.analytics.DBAnalyticsSource.<init>(DBAnalyticsSource.java:72)
   [testng] 	at org.apache.cassandra.db.Table.<init>(Table.java:618)
   [testng] 	at org.apache.cassandra.db.Table.open(Table.java:435)
   [testng] 	at org.apache.cassandra.db.TableTest.testOpen(Unknown Source)
   [testng] ... Removed 22 stack frames
   [testng] SKIPPED: testRemoveSuperColumn
   [testng] SKIPPED: testRemove
   [testng] SKIPPED: testMain
   [testng] SKIPPED: testMain
   [testng] SKIPPED: testMain
   [testng] SKIPPED: testDoRecovery
   [testng] SKIPPED: testMain
   [testng] 
   [testng] ===============================================
   [testng]     Ant test
   [testng]     Tests run: 15, Failures: 3, Skips: 7
   [testng]     Configuration Failures: 1, Skips: 6
   [testng] ===============================================
   [testng] 
   [testng] 
   [testng] ===============================================
   [testng] Ant suite
   [testng] Total tests run: 15, Failures: 3, Skips: 7
   [testng] Configuration Failures: 1, Skips: 6
   [testng] ===============================================
   [testng] 

BUILD FAILED
http://hudson.zones.apache.org/hudson/job/Cassandra/ws/cassandra/build.xml :110: The tests
failed.

Total time: 5 seconds


Mime
View raw message