cassandra-commits mailing list archives

Site index · List index
Message view « Date » · « Thread »
Top « Date » · « Thread »
From "Jason Brown (JIRA)" <j...@apache.org>
Subject [jira] [Commented] (CASSANDRA-11635) test-clientutil-jar unit test fails
Date Wed, 10 Aug 2016 18:25:20 GMT

    [ https://issues.apache.org/jira/browse/CASSANDRA-11635?page=com.atlassian.jira.plugin.system.issuetabpanels:comment-tabpanel&focusedCommentId=15415726#comment-15415726
] 

Jason Brown commented on CASSANDRA-11635:
-----------------------------------------

+1, as well. The clientutil jar might have been useful back in the thrift days, but those
days are gone.

> test-clientutil-jar unit test fails
> -----------------------------------
>
>                 Key: CASSANDRA-11635
>                 URL: https://issues.apache.org/jira/browse/CASSANDRA-11635
>             Project: Cassandra
>          Issue Type: Test
>          Components: Testing
>            Reporter: Michael Shuler
>            Assignee: Sylvain Lebresne
>              Labels: unittest
>             Fix For: 2.2.x, 3.0.x, 3.x
>
>
> {noformat}
> test-clientutil-jar:
>     [junit] Testsuite: org.apache.cassandra.serializers.ClientUtilsTest
>     [junit] Tests run: 1, Failures: 0, Errors: 1, Skipped: 0, Time elapsed: 0.314 sec
>     [junit] 
>     [junit] Testcase: test(org.apache.cassandra.serializers.ClientUtilsTest):   Caused
an ERROR
>     [junit] org/apache/cassandra/utils/SigarLibrary
>     [junit] java.lang.NoClassDefFoundError: org/apache/cassandra/utils/SigarLibrary
>     [junit]     at org.apache.cassandra.utils.UUIDGen.hash(UUIDGen.java:328)
>     [junit]     at org.apache.cassandra.utils.UUIDGen.makeNode(UUIDGen.java:307)
>     [junit]     at org.apache.cassandra.utils.UUIDGen.makeClockSeqAndNode(UUIDGen.java:256)
>     [junit]     at org.apache.cassandra.utils.UUIDGen.<clinit>(UUIDGen.java:39)
>     [junit]     at org.apache.cassandra.serializers.ClientUtilsTest.test(ClientUtilsTest.java:56)
>     [junit] Caused by: java.lang.ClassNotFoundException: org.apache.cassandra.utils.SigarLibrary
>     [junit]     at java.net.URLClassLoader.findClass(URLClassLoader.java:381)
>     [junit]     at java.lang.ClassLoader.loadClass(ClassLoader.java:424)
>     [junit]     at sun.misc.Launcher$AppClassLoader.loadClass(Launcher.java:331)
>     [junit]     at java.lang.ClassLoader.loadClass(ClassLoader.java:357)
>     [junit] 
>     [junit] 
>     [junit] Test org.apache.cassandra.serializers.ClientUtilsTest FAILED
> BUILD FAILED
> {noformat}
> I'll see if I can find a spot where this passes, but it appears to have been failing
for a long time.



--
This message was sent by Atlassian JIRA
(v6.3.4#6332)

Mime
View raw message