cassandra-commits mailing list archives

Site index · List index
Message view « Date » · « Thread »
Top « Date » · « Thread »
From "Sylvain Lebresne (JIRA)" <j...@apache.org>
Subject [jira] [Commented] (CASSANDRA-11126) select_distinct_with_deletions_test failing on non-vnode environments
Date Tue, 26 Jul 2016 16:21:20 GMT

    [ https://issues.apache.org/jira/browse/CASSANDRA-11126?page=com.atlassian.jira.plugin.system.issuetabpanels:comment-tabpanel&focusedCommentId=15394030#comment-15394030
] 

Sylvain Lebresne commented on CASSANDRA-11126:
----------------------------------------------

I probably should have got to that test sooner, but something has changed with the upgrade
test and [~mambocab] instructions above are outdated. I tried messing with the {{OVERRIDE_MANIFEST}}
in {{upgrade_manifest.py}} as that sounded the new way to do things, but the farther I've
got is:
{noformat}
$ DISABLE_VNODES=yes KEEP_TEST_DIR=yes PRINT_DEBUG=3.0 dtest -s -v upgrade_tests/cql_tests.py:TestCQL.select_distinct_with_deletions_test
 
DISABLE_VNODES environment variable deprecated. Use `./run_dtests.py --vnodes false` instead.
select_distinct_with_deletions_test (upgrade_tests.cql_tests.TestCQL) ... ERROR

======================================================================
ERROR: select_distinct_with_deletions_test (upgrade_tests.cql_tests.TestCQL)
----------------------------------------------------------------------
Traceback (most recent call last):
  File "/home/pcmanus/Git/cassandra-dtest/upgrade_tests/upgrade_base.py", line 53, in setUp
    .format(self.UPGRADE_PATH.starting_version, self.UPGRADE_PATH.starting_meta.java_version))
AttributeError: 'NoneType' object has no attribute 'starting_version'

----------------------------------------------------------------------
Ran 1 test in 0.001s

FAILED (errors=1)
{noformat}
and I'm not really sure where to go from there.

I also don't know if this test is still run somewhere so I don't really know if it's still
a genuine failure or not.

> select_distinct_with_deletions_test failing on non-vnode environments
> ---------------------------------------------------------------------
>
>                 Key: CASSANDRA-11126
>                 URL: https://issues.apache.org/jira/browse/CASSANDRA-11126
>             Project: Cassandra
>          Issue Type: Bug
>            Reporter: Ryan McGuire
>            Assignee: Sylvain Lebresne
>              Labels: dtest
>             Fix For: 3.0.x
>
>
> Looks like this was fixed in CASSANDRA-10762, but not for non-vnode environments:
> {code}
> $ DISABLE_VNODES=yes KEEP_TEST_DIR=yes CASSANDRA_VERSION=git:cassandra-3.0 PRINT_DEBUG=true
nosetests -s -v upgrade_tests/cql_tests.py:TestCQLNodes2RF1.select_distinct_with_deletions_test
> select_distinct_with_deletions_test (upgrade_tests.cql_tests.TestCQLNodes2RF1) ... cluster
ccm directory: /tmp/dtest-UXb0un
> http://git-wip-us.apache.org/repos/asf/cassandra.git git:cassandra-3.0
> Custom init_config not found. Setting defaults.
> Done setting configuration options:
> {   'num_tokens': None,
>     'phi_convict_threshold': 5,
>     'range_request_timeout_in_ms': 10000,
>     'read_request_timeout_in_ms': 10000,
>     'request_timeout_in_ms': 10000,
>     'truncate_request_timeout_in_ms': 10000,
>     'write_request_timeout_in_ms': 10000}
> getting default job version for 3.0.3
> UpgradePath(starting_version='binary:2.2.3', upgrade_version=None)
> starting from 2.2.3
> upgrading to {'install_dir': '/home/ryan/.ccm/repository/gitCOLONcassandra-3.0'}
> Querying upgraded node
> FAIL
> ======================================================================
> FAIL: select_distinct_with_deletions_test (upgrade_tests.cql_tests.TestCQLNodes2RF1)
> ----------------------------------------------------------------------
> Traceback (most recent call last):
>   File "/home/ryan/git/datastax/cassandra-dtest/upgrade_tests/cql_tests.py", line 3360,
in select_distinct_with_deletions_test
>     self.assertEqual(9, len(rows))
> AssertionError: 9 != 8
> -------------------- >> begin captured logging << --------------------
> dtest: DEBUG: cluster ccm directory: /tmp/dtest-UXb0un
> dtest: DEBUG: Custom init_config not found. Setting defaults.
> dtest: DEBUG: Done setting configuration options:
> {   'num_tokens': None,
>     'phi_convict_threshold': 5,
>     'range_request_timeout_in_ms': 10000,
>     'read_request_timeout_in_ms': 10000,
>     'request_timeout_in_ms': 10000,
>     'truncate_request_timeout_in_ms': 10000,
>     'write_request_timeout_in_ms': 10000}
> dtest: DEBUG: getting default job version for 3.0.3
> dtest: DEBUG: UpgradePath(starting_version='binary:2.2.3', upgrade_version=None)
> dtest: DEBUG: starting from 2.2.3
> dtest: DEBUG: upgrading to {'install_dir': '/home/ryan/.ccm/repository/gitCOLONcassandra-3.0'}
> dtest: DEBUG: Querying upgraded node
> --------------------- >> end captured logging << ---------------------
> ----------------------------------------------------------------------
> Ran 1 test in 56.022s
> FAILED (failures=1)
> {code}



--
This message was sent by Atlassian JIRA
(v6.3.4#6332)

Mime
View raw message