cassandra-commits mailing list archives

Site index · List index
Message view « Date » · « Thread »
Top « Date » · « Thread »
From "Alan Boudreault (JIRA)" <j...@apache.org>
Subject [jira] [Created] (CASSANDRA-10974) disk_balance_bootstrap_test is failing on trunk
Date Wed, 06 Jan 2016 18:07:39 GMT
Alan Boudreault created CASSANDRA-10974:
-------------------------------------------

             Summary: disk_balance_bootstrap_test is failing on trunk
                 Key: CASSANDRA-10974
                 URL: https://issues.apache.org/jira/browse/CASSANDRA-10974
             Project: Cassandra
          Issue Type: Bug
          Components: Tools
            Reporter: Alan Boudreault
             Fix For: 3.2


{code}
======================================================================
FAIL: disk_balance_bootstrap_test (disk_balance_test.TestDiskBalance)
----------------------------------------------------------------------
Traceback (most recent call last):
  File "/home/aboudreault/git/cstar/cassandra-dtest/disk_balance_test.py", line 51, in disk_balance_bootstrap_test
    self.assert_balanced(node)
  File "/home/aboudreault/git/cstar/cassandra-dtest/disk_balance_test.py", line 127, in assert_balanced
    assert_almost_equal(*sums, error=0.2, error_message=node.name)
  File "/home/aboudreault/git/cstar/cassandra-dtest/assertions.py", line 65, in assert_almost_equal
    assert vmin > vmax * (1.0 - error) or vmin == vmax, "values not within %.2f%% of the
max: %s (%s)" % (error * 100, args, kwargs['error_message'])
AssertionError: values not within 20.00% of the max: (529955, 386060, 473640) (node4)
-------------------- >> begin captured logging << --------------------
dtest: DEBUG: cluster ccm directory: /tmp/dtest-nNoQzp
--------------------- >> end captured logging << ---------------------

----------------------------------------------------------------------
Ran 1 test in 114.862s

FAILED (failures=1)

{code}



--
This message was sent by Atlassian JIRA
(v6.3.4#6332)

Mime
View raw message