cassandra-commits mailing list archives

Site index · List index
Message view « Date » · « Thread »
Top « Date » · « Thread »
From "Marcus Eriksson (JIRA)" <j...@apache.org>
Subject [jira] [Resolved] (CASSANDRA-10973) disk_balance_decommission_test is failing on trunk
Date Mon, 18 Jan 2016 14:48:40 GMT

     [ https://issues.apache.org/jira/browse/CASSANDRA-10973?page=com.atlassian.jira.plugin.system.issuetabpanels:all-tabpanel
]

Marcus Eriksson resolved CASSANDRA-10973.
-----------------------------------------
       Resolution: Duplicate
    Fix Version/s:     (was: 3.x)

> disk_balance_decommission_test is failing on trunk
> --------------------------------------------------
>
>                 Key: CASSANDRA-10973
>                 URL: https://issues.apache.org/jira/browse/CASSANDRA-10973
>             Project: Cassandra
>          Issue Type: Bug
>          Components: Tools
>            Reporter: Alan Boudreault
>            Assignee: Marcus Eriksson
>              Labels: dtest
>
> http://cassci.datastax.com/job/trunk_dtest/891/testReport/junit/disk_balance_test/TestDiskBalance/disk_balance_decommission_test/
> {code}
> ======================================================================
> FAIL: disk_balance_decommission_test (disk_balance_test.TestDiskBalance)
> ----------------------------------------------------------------------
> Traceback (most recent call last):
>   File "/home/aboudreault/git/cstar/cassandra-dtest/disk_balance_test.py", line 74, in
disk_balance_decommission_test
>     self.assert_balanced(node)
>   File "/home/aboudreault/git/cstar/cassandra-dtest/disk_balance_test.py", line 127,
in assert_balanced
>     assert_almost_equal(*sums, error=0.2, error_message=node.name)
>   File "/home/aboudreault/git/cstar/cassandra-dtest/assertions.py", line 65, in assert_almost_equal
>     assert vmin > vmax * (1.0 - error) or vmin == vmax, "values not within %.2f%%
of the max: %s (%s)" % (error * 100, args, kwargs['error_message'])
> AssertionError: values not within 20.00% of the max: (482095, 477840, 612940) (node2)
> -------------------- >> begin captured logging << --------------------
> dtest: DEBUG: cluster ccm directory: /tmp/dtest-SLbi3e
> --------------------- >> end captured logging << ---------------------
> ----------------------------------------------------------------------
> Ran 1 test in 121.295s
> FAILED (failures=1)
> {code}



--
This message was sent by Atlassian JIRA
(v6.3.4#6332)

Mime
View raw message