cassandra-commits mailing list archives

Site index · List index
Message view « Date » · « Thread »
Top « Date » · « Thread »
From "Meerabo Shah (JIRA)" <j...@apache.org>
Subject [jira] [Created] (CASSANDRA-10568) LegacySSTableTest failed on cassandra 2.1.10
Date Thu, 22 Oct 2015 08:29:27 GMT
Meerabo Shah created CASSANDRA-10568:
----------------------------------------

             Summary: LegacySSTableTest failed on cassandra 2.1.10
                 Key: CASSANDRA-10568
                 URL: https://issues.apache.org/jira/browse/CASSANDRA-10568
             Project: Cassandra
          Issue Type: Bug
          Components: Tests
         Environment: s390x RHEL7 IBM Systemz
            Reporter: Meerabo Shah
             Fix For: 2.1.10


    [junit] ------------- ---------------- ---------------
    [junit] ------------- Standard Error -----------------
    [junit] Failed to read jb
    [junit] ------------- ---------------- ---------------
    [junit] Testcase: testStreaming(org.apache.cassandra.io.sstable.LegacySSTableTest): FAILED
    [junit] null
    [junit] junit.framework.AssertionFailedError
    [junit]     at org.apache.cassandra.io.sstable.IndexSummary.<init>(IndexSummary.java:80)
    [junit]     at org.apache.cassandra.io.sstable.IndexSummary$IndexSummarySerializer.deserialize(IndexSummary.java:317)
    [junit]     at org.apache.cassandra.io.sstable.SSTableReader.loadSummary(SSTableReader.java:877)
    [junit]     at org.apache.cassandra.io.sstable.SSTableReader.load(SSTableReader.java:730)
    [junit]     at org.apache.cassandra.io.sstable.SSTableReader.load(SSTableReader.java:692)
    [junit]     at org.apache.cassandra.io.sstable.SSTableReader.open(SSTableReader.java:480)
    [junit]     at org.apache.cassandra.io.sstable.SSTableReader.open(SSTableReader.java:376)
    [junit]     at org.apache.cassandra.io.sstable.SSTableReader.open(SSTableReader.java:371)
    [junit]     at org.apache.cassandra.io.sstable.SSTableReader.open(SSTableReader.java:363)
    [junit]     at org.apache.cassandra.io.sstable.LegacySSTableTest.testStreaming(LegacySSTableTest.java:115)
    [junit]     at org.apache.cassandra.io.sstable.LegacySSTableTest.testStreaming(LegacySSTableTest.java:110)
    [junit]
    [junit]
    [junit] Testcase: testVersions(org.apache.cassandra.io.sstable.LegacySSTableTest):  FAILED
    [junit] null
    [junit] junit.framework.AssertionFailedError
    [junit]     at org.apache.cassandra.io.sstable.IndexSummary.<init>(IndexSummary.java:80)
    [junit]     at org.apache.cassandra.io.sstable.IndexSummary$IndexSummarySerializer.deserialize(IndexSummary.java:317)
    [junit]     at org.apache.cassandra.io.sstable.SSTableReader.loadSummary(SSTableReader.java:877)
    [junit]     at org.apache.cassandra.io.sstable.SSTableReader.load(SSTableReader.java:730)
    [junit]     at org.apache.cassandra.io.sstable.SSTableReader.load(SSTableReader.java:692)
    [junit]     at org.apache.cassandra.io.sstable.SSTableReader.open(SSTableReader.java:480)
    [junit]     at org.apache.cassandra.io.sstable.SSTableReader.open(SSTableReader.java:376)
    [junit]     at org.apache.cassandra.io.sstable.SSTableReader.open(SSTableReader.java:371)
    [junit]     at org.apache.cassandra.io.sstable.SSTableReader.open(SSTableReader.java:363)
    [junit]     at org.apache.cassandra.io.sstable.LegacySSTableTest.testVersion(LegacySSTableTest.java:165)
    [junit]     at org.apache.cassandra.io.sstable.LegacySSTableTest.testVersions(LegacySSTableTest.java:154)
    [junit]
    [junit]
    [junit] Test org.apache.cassandra.io.sstable.LegacySSTableTest FAILED
[junitreport] Processing /apache-cassandra-2.1.10-src/build/test/TESTS-TestSuites.xml to /tmp/null1914220216
[junitreport] Loading stylesheet jar:file:/apache-ant-1.9.2/lib/ant-junit.jar!/org/apache/tools/ant/taskdefs/optional/junit/xsl/junit-frames.xsl
[junitreport] Transform time: 2188ms
[junitreport] Deleting: /tmp/null1914220216

BUILD FAILED



--
This message was sent by Atlassian JIRA
(v6.3.4#6332)

Mime
View raw message