cassandra-commits mailing list archives

Site index · List index
Message view « Date » · « Thread »
Top « Date » · « Thread »
From "Meerabo Shah (JIRA)" <j...@apache.org>
Subject [jira] [Updated] (CASSANDRA-10564) AntiCompactionTest failed on cassandra 2.1.10 due to antiCompactionSizeTest method failed on s390x
Date Thu, 22 Oct 2015 07:30:27 GMT

     [ https://issues.apache.org/jira/browse/CASSANDRA-10564?page=com.atlassian.jira.plugin.system.issuetabpanels:all-tabpanel
]

Meerabo Shah updated CASSANDRA-10564:
-------------------------------------
    Description: 
testlist:
     [echo] running test bucket 0 tests
    [junit] Picked up JAVA_TOOL_OPTIONS: -Dfile.encoding=UTF8
    [junit] Testsuite: org.apache.cassandra.db.compaction.AntiCompactionTest
    [junit] Testsuite: org.apache.cassandra.db.compaction.AntiCompactionTest
    [junit] Tests run: 1, Failures: 0, Errors: 1, Skipped: 0, Time elapsed: 0 sec
    [junit]
    [junit] Testcase: org.apache.cassandra.db.compaction.AntiCompactionTest:antiCompactionSizeTest:
    Caused an ERROR
    [junit] Timeout occurred. Please note the time in the report does not reflect the time
until the timeout.
    [junit] junit.framework.AssertionFailedError: Timeout occurred. Please note the time in
the report does not reflect the time until the timeout.
    [junit]     at java.lang.Thread.run(Thread.java:745)
    [junit]
    [junit]
    [junit] Test org.apache.cassandra.db.compaction.AntiCompactionTest FAILED (timeout)
[junitreport] Processing /apache-cassandra-2.1.10-src/build/test/TESTS-TestSuites.xml to /tmp/null155310269
[junitreport] Loading stylesheet jar:file:/apache-ant-1.9.2/lib/ant-junit.jar!/org/apache/tools/ant/taskdefs/optional/junit/xsl/junit-frames.xsl
[junitreport] Transform time: 1421ms
[junitreport] Deleting: /tmp/null155310269

BUILD FAILED
/apache-cassandra-2.1.10-src/build.xml:1146: Some test bucket 0 test(s) failed.

Total time: 1 minute 11 seconds


> AntiCompactionTest failed on cassandra 2.1.10 due to antiCompactionSizeTest method failed
on s390x
> --------------------------------------------------------------------------------------------------
>
>                 Key: CASSANDRA-10564
>                 URL: https://issues.apache.org/jira/browse/CASSANDRA-10564
>             Project: Cassandra
>          Issue Type: Bug
>          Components: Tests
>         Environment: s390x - RHEL7 IBM systemz
>            Reporter: Meerabo Shah
>            Priority: Blocker
>             Fix For: 2.1.10
>
>
> testlist:
>      [echo] running test bucket 0 tests
>     [junit] Picked up JAVA_TOOL_OPTIONS: -Dfile.encoding=UTF8
>     [junit] Testsuite: org.apache.cassandra.db.compaction.AntiCompactionTest
>     [junit] Testsuite: org.apache.cassandra.db.compaction.AntiCompactionTest
>     [junit] Tests run: 1, Failures: 0, Errors: 1, Skipped: 0, Time elapsed: 0 sec
>     [junit]
>     [junit] Testcase: org.apache.cassandra.db.compaction.AntiCompactionTest:antiCompactionSizeTest:
    Caused an ERROR
>     [junit] Timeout occurred. Please note the time in the report does not reflect the
time until the timeout.
>     [junit] junit.framework.AssertionFailedError: Timeout occurred. Please note the time
in the report does not reflect the time until the timeout.
>     [junit]     at java.lang.Thread.run(Thread.java:745)
>     [junit]
>     [junit]
>     [junit] Test org.apache.cassandra.db.compaction.AntiCompactionTest FAILED (timeout)
> [junitreport] Processing /apache-cassandra-2.1.10-src/build/test/TESTS-TestSuites.xml
to /tmp/null155310269
> [junitreport] Loading stylesheet jar:file:/apache-ant-1.9.2/lib/ant-junit.jar!/org/apache/tools/ant/taskdefs/optional/junit/xsl/junit-frames.xsl
> [junitreport] Transform time: 1421ms
> [junitreport] Deleting: /tmp/null155310269
> BUILD FAILED
> /apache-cassandra-2.1.10-src/build.xml:1146: Some test bucket 0 test(s) failed.
> Total time: 1 minute 11 seconds



--
This message was sent by Atlassian JIRA
(v6.3.4#6332)

Mime
View raw message