cassandra-commits mailing list archives

Site index · List index
Message view « Date » · « Thread »
Top « Date » · « Thread »
From "Ariel Weisberg (JIRA)" <j...@apache.org>
Subject [jira] [Commented] (CASSANDRA-9514) TrackerTest.testAddSSTables fails in 2.2 and trunk
Date Fri, 29 May 2015 21:46:18 GMT

    [ https://issues.apache.org/jira/browse/CASSANDRA-9514?page=com.atlassian.jira.plugin.system.issuetabpanels:comment-tabpanel&focusedCommentId=14565477#comment-14565477
] 

Ariel Weisberg commented on CASSANDRA-9514:
-------------------------------------------

I ran this in a loop on my desktop to try and reproduce I got 
{noformat}
    [junit] Testsuite: org.apache.cassandra.db.lifecycle.TrackerTest
    [junit] Tests run: 7, Failures: 1, Errors: 0, Skipped: 0, Time elapsed: 1.444 sec
    [junit] 
    [junit] ------------- Standard Output ---------------
    [junit] WARN  21:42:19 JNA link failure, one or more native method will be unavailable.
    [junit] WARN  21:42:19 JNA link failure, one or more native method will be unavailable.
    [junit] ERROR 21:42:20 Error in ThreadPoolExecutor
    [junit] java.lang.AssertionError: Data component is missing for sstablebuild/test/cassandra/data:0/system/local-7ad54392bcdd35a684174e047860b377/la-4-big
    [junit] 	at org.apache.cassandra.io.sstable.format.SSTableReader.open(SSTableReader.java:418)
~[main/:na]
    [junit] 	at org.apache.cassandra.io.sstable.format.SSTableReader.open(SSTableReader.java:350)
~[main/:na]
    [junit] 	at org.apache.cassandra.io.sstable.format.SSTableReader$4.run(SSTableReader.java:480)
~[main/:na]
    [junit] 	at java.util.concurrent.Executors$RunnableAdapter.call(Executors.java:511) ~[na:1.8.0_25]
    [junit] 	at java.util.concurrent.FutureTask.run(FutureTask.java:266) ~[na:1.8.0_25]
    [junit] 	at java.util.concurrent.ThreadPoolExecutor.runWorker(ThreadPoolExecutor.java:1142)
~[na:1.8.0_25]
    [junit] 	at java.util.concurrent.ThreadPoolExecutor$Worker.run(ThreadPoolExecutor.java:617)
[na:1.8.0_25]
    [junit] 	at java.lang.Thread.run(Thread.java:745) [na:1.8.0_25]
    [junit] ERROR 21:42:20 Error in ThreadPoolExecutor
    [junit] java.lang.AssertionError: Data component is missing for sstablebuild/test/cassandra/data:0/system/local-7ad54392bcdd35a684174e047860b377/la-4-big
    [junit] 	at org.apache.cassandra.io.sstable.format.SSTableReader.open(SSTableReader.java:418)
~[main/:na]
    [junit] 	at org.apache.cassandra.io.sstable.format.SSTableReader.open(SSTableReader.java:350)
~[main/:na]
    [junit] 	at org.apache.cassandra.io.sstable.format.SSTableReader$4.run(SSTableReader.java:480)
~[main/:na]
    [junit] 	at java.util.concurrent.Executors$RunnableAdapter.call(Executors.java:511) ~[na:1.8.0_25]
    [junit] 	at java.util.concurrent.FutureTask.run(FutureTask.java:266) ~[na:1.8.0_25]
    [junit] 	at java.util.concurrent.ThreadPoolExecutor.runWorker(ThreadPoolExecutor.java:1142)
~[na:1.8.0_25]
    [junit] 	at java.util.concurrent.ThreadPoolExecutor$Worker.run(ThreadPoolExecutor.java:617)
[na:1.8.0_25]
    [junit] 	at java.lang.Thread.run(Thread.java:745) [na:1.8.0_25]
    [junit] ------------- ---------------- ---------------
    [junit] Testcase: testTryModify(org.apache.cassandra.db.lifecycle.TrackerTest):	FAILED
    [junit] null
    [junit] junit.framework.AssertionFailedError: null
    [junit] 	at org.apache.cassandra.db.lifecycle.TrackerTest.testTryModify(TrackerTest.java:81)
{noformat}

Might want to take care of both under one ticket.

Attaching system.log from this as well.

> TrackerTest.testAddSSTables fails in 2.2 and trunk
> --------------------------------------------------
>
>                 Key: CASSANDRA-9514
>                 URL: https://issues.apache.org/jira/browse/CASSANDRA-9514
>             Project: Cassandra
>          Issue Type: Test
>          Components: Tests
>            Reporter: Michael Shuler
>              Labels: test-failure
>             Fix For: 3.x, 2.2.x
>
>
> Error:
> {{expected:<1> but was:<2>}}
> http://cassci.datastax.com/job/cassandra-2.2_testall/33/testReport/org.apache.cassandra.db.lifecycle/TrackerTest/testTryModify/
> http://cassci.datastax.com/job/trunk_testall/125/testReport/org.apache.cassandra.db.lifecycle/TrackerTest/testDropSSTables/



--
This message was sent by Atlassian JIRA
(v6.3.4#6332)

Mime
View raw message