cassandra-commits mailing list archives

Site index · List index
Message view « Date » · « Thread »
Top « Date » · « Thread »
From "Joshua McKenzie (JIRA)" <j...@apache.org>
Subject [jira] [Updated] (CASSANDRA-7265) DataOutputTest unit test failure on Windows
Date Wed, 28 May 2014 21:19:01 GMT

     [ https://issues.apache.org/jira/browse/CASSANDRA-7265?page=com.atlassian.jira.plugin.system.issuetabpanels:all-tabpanel
]

Joshua McKenzie updated CASSANDRA-7265:
---------------------------------------

      Tester:   (was: Ala' Alkhaldi)
    Assignee: Ala' Alkhaldi  (was: Joshua McKenzie)
      Labels: Windows patch  (was: patch)

> DataOutputTest unit test failure on Windows
> -------------------------------------------
>
>                 Key: CASSANDRA-7265
>                 URL: https://issues.apache.org/jira/browse/CASSANDRA-7265
>             Project: Cassandra
>          Issue Type: Sub-task
>            Reporter: Joshua McKenzie
>            Assignee: Ala' Alkhaldi
>            Priority: Minor
>              Labels: Windows, patch
>             Fix For: 3.0
>
>         Attachments: cassandra-7265_v1.txt
>
>
>     [junit] Testsuite: org.apache.cassandra.io.util.DataOutputTest
>     [junit] Tests run: 8, Failures: 3, Errors: 0, Skipped: 0, Time elapsed: 1.525 sec
>     [junit]
>     [junit] ------------- Standard Output ---------------
>     [junit] WARN  15:58:13 JNA link failure, one or more native method will be unavailable.
>     [junit] WARN  15:58:13 JNA link failure, one or more native method will be unavailable.
>     [junit] ------------- ---------------- ---------------
>     [junit] Testcase: testSequentialWriter(org.apache.cassandra.io.util.DataOutputTest):
   FAILED
>     [junit]
>     [junit] junit.framework.AssertionFailedError:
>     [junit]     at org.apache.cassandra.io.util.DataOutputTest.testSequentialWriter(DataOutputTest.java:142)
>     [junit]
>     [junit]
>     [junit] Testcase: testRandomAccessFile(org.apache.cassandra.io.util.DataOutputTest):
   FAILED
>     [junit]
>     [junit] junit.framework.AssertionFailedError:
>     [junit]     at org.apache.cassandra.io.util.DataOutputTest.testRandomAccessFile(DataOutputTest.java:127)
>     [junit]
>     [junit]
>     [junit] Testcase: testFileOutputStream(org.apache.cassandra.io.util.DataOutputTest):
   FAILED
>     [junit]
>     [junit] junit.framework.AssertionFailedError:
>     [junit]     at org.apache.cassandra.io.util.DataOutputTest.testFileOutputStream(DataOutputTest.java:108)
>     [junit]
>     [junit]
>     [junit] Test org.apache.cassandra.io.util.DataOutputTest FAILED



--
This message was sent by Atlassian JIRA
(v6.2#6252)

Mime
View raw message