cassandra-commits mailing list archives

Site index · List index
Message view « Date » · « Thread »
Top « Date » · « Thread »
From "Michael Shuler (JIRA)" <j...@apache.org>
Subject [jira] [Updated] (CASSANDRA-7009) topology_test dtest fails in 2.1
Date Tue, 06 May 2014 22:46:17 GMT

     [ https://issues.apache.org/jira/browse/CASSANDRA-7009?page=com.atlassian.jira.plugin.system.issuetabpanels:all-tabpanel
]

Michael Shuler updated CASSANDRA-7009:
--------------------------------------

    Labels: qa-resolved  (was: )

> topology_test dtest fails in 2.1
> --------------------------------
>
>                 Key: CASSANDRA-7009
>                 URL: https://issues.apache.org/jira/browse/CASSANDRA-7009
>             Project: Cassandra
>          Issue Type: Test
>          Components: Tests
>            Reporter: Michael Shuler
>            Assignee: Brandon Williams
>            Priority: Blocker
>              Labels: qa-resolved
>             Fix For: 2.1 beta2
>
>
> {noformat}
> $ export MAX_HEAP_SIZE="1G"; export HEAP_NEWSIZE="256M"; PRINT_DEBUG=true nosetests --nocapture
--nologcapture --verbosity=3 topology_test.py
> nose.config: INFO: Ignoring files matching ['^\\.', '^_', '^setup\\.py$']
> decomission_test (topology_test.TestTopology) ... cluster ccm directory: /tmp/dtest-UhiFiQ
> FAIL
> move_single_node_test (topology_test.TestTopology) ... cluster ccm directory: /tmp/dtest-x1q7pp
> ok
> movement_test (topology_test.TestTopology) ... cluster ccm directory: /tmp/dtest-t6AuXA
> error: For input string: "\-9223372036854775808"
> -- StackTrace --
> java.io.IOException: For input string: "\-9223372036854775808"
>         at org.apache.cassandra.service.StorageService.move(StorageService.java:3044)
>         at sun.reflect.NativeMethodAccessorImpl.invoke0(Native Method)
>         at sun.reflect.NativeMethodAccessorImpl.invoke(NativeMethodAccessorImpl.java:57)
>         at sun.reflect.DelegatingMethodAccessorImpl.invoke(DelegatingMethodAccessorImpl.java:43)
>         at java.lang.reflect.Method.invoke(Method.java:606)
>         at sun.reflect.misc.Trampoline.invoke(MethodUtil.java:75)
>         at sun.reflect.GeneratedMethodAccessor2.invoke(Unknown Source)
>         at sun.reflect.DelegatingMethodAccessorImpl.invoke(DelegatingMethodAccessorImpl.java:43)
>         at java.lang.reflect.Method.invoke(Method.java:606)
>         at sun.reflect.misc.MethodUtil.invoke(MethodUtil.java:279)
>         at com.sun.jmx.mbeanserver.StandardMBeanIntrospector.invokeM2(StandardMBeanIntrospector.java:112)
>         at com.sun.jmx.mbeanserver.StandardMBeanIntrospector.invokeM2(StandardMBeanIntrospector.java:46)
>         at com.sun.jmx.mbeanserver.MBeanIntrospector.invokeM(MBeanIntrospector.java:237)
>         at com.sun.jmx.mbeanserver.PerInterface.invoke(PerInterface.java:138)
>         at com.sun.jmx.mbeanserver.MBeanSupport.invoke(MBeanSupport.java:252)
>         at com.sun.jmx.interceptor.DefaultMBeanServerInterceptor.invoke(DefaultMBeanServerInterceptor.java:819)
>         at com.sun.jmx.mbeanserver.JmxMBeanServer.invoke(JmxMBeanServer.java:801)
>         at javax.management.remote.rmi.RMIConnectionImpl.doOperation(RMIConnectionImpl.java:1487)
>         at javax.management.remote.rmi.RMIConnectionImpl.access$300(RMIConnectionImpl.java:97)
>         at javax.management.remote.rmi.RMIConnectionImpl$PrivilegedOperation.run(RMIConnectionImpl.java:1328)
>         at javax.management.remote.rmi.RMIConnectionImpl.doPrivilegedOperation(RMIConnectionImpl.java:1420)
>         at javax.management.remote.rmi.RMIConnectionImpl.invoke(RMIConnectionImpl.java:848)
>         at sun.reflect.NativeMethodAccessorImpl.invoke0(Native Method)
>         at sun.reflect.NativeMethodAccessorImpl.invoke(NativeMethodAccessorImpl.java:57)
>         at sun.reflect.DelegatingMethodAccessorImpl.invoke(DelegatingMethodAccessorImpl.java:43)
>         at java.lang.reflect.Method.invoke(Method.java:606)
>         at sun.rmi.server.UnicastServerRef.dispatch(UnicastServerRef.java:322)
>         at sun.rmi.transport.Transport$1.run(Transport.java:177)
>         at sun.rmi.transport.Transport$1.run(Transport.java:174)
>         at java.security.AccessController.doPrivileged(Native Method)
>         at sun.rmi.transport.Transport.serviceCall(Transport.java:173)
>         at sun.rmi.transport.tcp.TCPTransport.handleMessages(TCPTransport.java:556)
>         at sun.rmi.transport.tcp.TCPTransport$ConnectionHandler.run0(TCPTransport.java:811)
>         at sun.rmi.transport.tcp.TCPTransport$ConnectionHandler.run(TCPTransport.java:670)
>         at java.util.concurrent.ThreadPoolExecutor.runWorker(ThreadPoolExecutor.java:1145)
>         at java.util.concurrent.ThreadPoolExecutor$Worker.run(ThreadPoolExecutor.java:615)
>         at java.lang.Thread.run(Thread.java:744)
> error: For input string: "\-3074457345618258603"
> -- StackTrace --
> java.io.IOException: For input string: "\-3074457345618258603"
>         at org.apache.cassandra.service.StorageService.move(StorageService.java:3044)
>         at sun.reflect.NativeMethodAccessorImpl.invoke0(Native Method)
>         at sun.reflect.NativeMethodAccessorImpl.invoke(NativeMethodAccessorImpl.java:57)
>         at sun.reflect.DelegatingMethodAccessorImpl.invoke(DelegatingMethodAccessorImpl.java:43)
>         at java.lang.reflect.Method.invoke(Method.java:606)
>         at sun.reflect.misc.Trampoline.invoke(MethodUtil.java:75)
>         at sun.reflect.GeneratedMethodAccessor2.invoke(Unknown Source)
>         at sun.reflect.DelegatingMethodAccessorImpl.invoke(DelegatingMethodAccessorImpl.java:43)
>         at java.lang.reflect.Method.invoke(Method.java:606)
>         at sun.reflect.misc.MethodUtil.invoke(MethodUtil.java:279)
>         at com.sun.jmx.mbeanserver.StandardMBeanIntrospector.invokeM2(StandardMBeanIntrospector.java:112)
>         at com.sun.jmx.mbeanserver.StandardMBeanIntrospector.invokeM2(StandardMBeanIntrospector.java:46)
>         at com.sun.jmx.mbeanserver.MBeanIntrospector.invokeM(MBeanIntrospector.java:237)
>         at com.sun.jmx.mbeanserver.PerInterface.invoke(PerInterface.java:138)
>         at com.sun.jmx.mbeanserver.MBeanSupport.invoke(MBeanSupport.java:252)
>         at com.sun.jmx.interceptor.DefaultMBeanServerInterceptor.invoke(DefaultMBeanServerInterceptor.java:819)
>         at com.sun.jmx.mbeanserver.JmxMBeanServer.invoke(JmxMBeanServer.java:801)
>         at javax.management.remote.rmi.RMIConnectionImpl.doOperation(RMIConnectionImpl.java:1487)
>         at javax.management.remote.rmi.RMIConnectionImpl.access$300(RMIConnectionImpl.java:97)
>         at javax.management.remote.rmi.RMIConnectionImpl$PrivilegedOperation.run(RMIConnectionImpl.java:1328)
>         at javax.management.remote.rmi.RMIConnectionImpl.doPrivilegedOperation(RMIConnectionImpl.java:1420)
>         at javax.management.remote.rmi.RMIConnectionImpl.invoke(RMIConnectionImpl.java:848)
>         at sun.reflect.NativeMethodAccessorImpl.invoke0(Native Method)
>         at sun.reflect.NativeMethodAccessorImpl.invoke(NativeMethodAccessorImpl.java:57)
>         at sun.reflect.DelegatingMethodAccessorImpl.invoke(DelegatingMethodAccessorImpl.java:43)
>         at java.lang.reflect.Method.invoke(Method.java:606)
>         at sun.rmi.server.UnicastServerRef.dispatch(UnicastServerRef.java:322)
>         at sun.rmi.transport.Transport$1.run(Transport.java:177)
>         at sun.rmi.transport.Transport$1.run(Transport.java:174)
>         at java.security.AccessController.doPrivileged(Native Method)
>         at sun.rmi.transport.Transport.serviceCall(Transport.java:173)
>         at sun.rmi.transport.tcp.TCPTransport.handleMessages(TCPTransport.java:556)
>         at sun.rmi.transport.tcp.TCPTransport$ConnectionHandler.run0(TCPTransport.java:811)
>         at sun.rmi.transport.tcp.TCPTransport$ConnectionHandler.run(TCPTransport.java:670)
>         at java.util.concurrent.ThreadPoolExecutor.runWorker(ThreadPoolExecutor.java:1145)
>         at java.util.concurrent.ThreadPoolExecutor$Worker.run(ThreadPoolExecutor.java:615)
>         at java.lang.Thread.run(Thread.java:744)
> error: For input string: "\3074457345618258602"
> -- StackTrace --
> java.io.IOException: For input string: "\3074457345618258602"
>         at org.apache.cassandra.service.StorageService.move(StorageService.java:3044)
>         at sun.reflect.NativeMethodAccessorImpl.invoke0(Native Method)
>         at sun.reflect.NativeMethodAccessorImpl.invoke(NativeMethodAccessorImpl.java:57)
>         at sun.reflect.DelegatingMethodAccessorImpl.invoke(DelegatingMethodAccessorImpl.java:43)
>         at java.lang.reflect.Method.invoke(Method.java:606)
>         at sun.reflect.misc.Trampoline.invoke(MethodUtil.java:75)
>         at sun.reflect.GeneratedMethodAccessor2.invoke(Unknown Source)
>         at sun.reflect.DelegatingMethodAccessorImpl.invoke(DelegatingMethodAccessorImpl.java:43)
>         at java.lang.reflect.Method.invoke(Method.java:606)
>         at sun.reflect.misc.MethodUtil.invoke(MethodUtil.java:279)
>         at com.sun.jmx.mbeanserver.StandardMBeanIntrospector.invokeM2(StandardMBeanIntrospector.java:112)
>         at com.sun.jmx.mbeanserver.StandardMBeanIntrospector.invokeM2(StandardMBeanIntrospector.java:46)
>         at com.sun.jmx.mbeanserver.MBeanIntrospector.invokeM(MBeanIntrospector.java:237)
>         at com.sun.jmx.mbeanserver.PerInterface.invoke(PerInterface.java:138)
>         at com.sun.jmx.mbeanserver.MBeanSupport.invoke(MBeanSupport.java:252)
>         at com.sun.jmx.interceptor.DefaultMBeanServerInterceptor.invoke(DefaultMBeanServerInterceptor.java:819)
>         at com.sun.jmx.mbeanserver.JmxMBeanServer.invoke(JmxMBeanServer.java:801)
>         at javax.management.remote.rmi.RMIConnectionImpl.doOperation(RMIConnectionImpl.java:1487)
>         at javax.management.remote.rmi.RMIConnectionImpl.access$300(RMIConnectionImpl.java:97)
>         at javax.management.remote.rmi.RMIConnectionImpl$PrivilegedOperation.run(RMIConnectionImpl.java:1328)
>         at javax.management.remote.rmi.RMIConnectionImpl.doPrivilegedOperation(RMIConnectionImpl.java:1420)
>         at javax.management.remote.rmi.RMIConnectionImpl.invoke(RMIConnectionImpl.java:848)
>         at sun.reflect.NativeMethodAccessorImpl.invoke0(Native Method)
>         at sun.reflect.NativeMethodAccessorImpl.invoke(NativeMethodAccessorImpl.java:57)
>         at sun.reflect.DelegatingMethodAccessorImpl.invoke(DelegatingMethodAccessorImpl.java:43)
>         at java.lang.reflect.Method.invoke(Method.java:606)
>         at sun.rmi.server.UnicastServerRef.dispatch(UnicastServerRef.java:322)
>         at sun.rmi.transport.Transport$1.run(Transport.java:177)
>         at sun.rmi.transport.Transport$1.run(Transport.java:174)
>         at java.security.AccessController.doPrivileged(Native Method)
>         at sun.rmi.transport.Transport.serviceCall(Transport.java:173)
>         at sun.rmi.transport.tcp.TCPTransport.handleMessages(TCPTransport.java:556)
>         at sun.rmi.transport.tcp.TCPTransport$ConnectionHandler.run0(TCPTransport.java:811)
>         at sun.rmi.transport.tcp.TCPTransport$ConnectionHandler.run(TCPTransport.java:670)
>         at java.util.concurrent.ThreadPoolExecutor.runWorker(ThreadPoolExecutor.java:1145)
>         at java.util.concurrent.ThreadPoolExecutor$Worker.run(ThreadPoolExecutor.java:615)
>         at java.lang.Thread.run(Thread.java:744)
> FAIL
> replace_test (topology_test.TestTopology) ... cluster ccm directory: /tmp/dtest-NuYsY5
> ERROR
> Error saving log: [Errno 2] No such file or directory: '/tmp/dtest-NuYsY5/test/node4/logs/system.log'
> ERROR
> ======================================================================
> ERROR: replace_test (topology_test.TestTopology)
> ----------------------------------------------------------------------
> Traceback (most recent call last):
>   File "/home/mshuler/git/cassandra-dtest/tools.py", line 224, in wrapped
>     f(obj)
>   File "/home/mshuler/git/cassandra-dtest/topology_test.py", line 139, in replace_test
>     node4.start(replace_token=tokens[2])
>   File "/home/mshuler/git/ccm/ccmlib/node.py", line 427, in start
>     raise NodeError("Error starting node %s" % self.name, process)
> NodeError: Error starting node node4
> ======================================================================
> ERROR: replace_test (topology_test.TestTopology)
> ----------------------------------------------------------------------
> Traceback (most recent call last):
>   File "/home/mshuler/git/cassandra-dtest/dtest.py", line 199, in tearDown
>     errors = list(self.__filter_errors([ msg for msg, i in node.grep_log("ERROR")]))
>   File "/home/mshuler/git/ccm/ccmlib/node.py", line 222, in grep_log
>     with open(self.logfilename()) as f:
> IOError: [Errno 2] No such file or directory: '/tmp/dtest-NuYsY5/test/node4/logs/system.log'
> ======================================================================
> FAIL: decomission_test (topology_test.TestTopology)
> ----------------------------------------------------------------------
> Traceback (most recent call last):
>   File "/home/mshuler/git/cassandra-dtest/tools.py", line 224, in wrapped
>     f(obj)
>   File "/home/mshuler/git/cassandra-dtest/topology_test.py", line 69, in decomission_test
>     assert_almost_equal(*sizes)
>   File "/home/mshuler/git/cassandra-dtest/assertions.py", line 26, in assert_almost_equal
>     assert vmin > vmax * (1.0 - error), "values not within %.2f%% of the max: %s"
% (error * 100, args)
> AssertionError: values not within 16.00% of the max: (0, 0, 0, 0)
> ======================================================================
> FAIL: movement_test (topology_test.TestTopology)
> ----------------------------------------------------------------------
> Traceback (most recent call last):
>   File "/home/mshuler/git/cassandra-dtest/tools.py", line 224, in wrapped
>     f(obj)
>   File "/home/mshuler/git/cassandra-dtest/topology_test.py", line 47, in movement_test
>     assert_almost_equal(sizes[0], sizes[1])
>   File "/home/mshuler/git/cassandra-dtest/assertions.py", line 26, in assert_almost_equal
>     assert vmin > vmax * (1.0 - error), "values not within %.2f%% of the max: %s"
% (error * 100, args)
> AssertionError: values not within 16.00% of the max: (0, 0)
> ----------------------------------------------------------------------
> Ran 4 tests in 169.513s
> FAILED (errors=2, failures=2)
> {noformat}



--
This message was sent by Atlassian JIRA
(v6.2#6252)

Mime
View raw message