cassandra-builds mailing list archives

Site index · List index
Message view « Date » · « Thread »
Top « Date » · « Thread »
From Apache Jenkins Server <jenk...@builds.apache.org>
Subject Build complete: Cassandra-3.0 #181 [UNSTABLE] 07706662104fd7d471379a5ba1155c7e4fb71618
Date Mon, 16 Aug 2021 23:47:46 GMT
-------------------------------------------------------------------------------
Build Cassandra-3.0 #181 Still Unstable
URL: https://ci-cassandra.apache.org/job/Cassandra-3.0/181/
-------------------------------------------------------------------------------
Changes:
[a.penya.garcia] Build tests in CircleCI build job


-------------------------------------------------------------------------------
Failed Tests:
15 tests failed.
FAILED:  org.apache.cassandra.distributed.test.SimpleReadWriteTest.coordinatorWriteTest
FAILED:  org.apache.cassandra.db.ScrubTest.testScrubCorruptedCounterRow
FAILED:  dtest-upgrade.upgrade_internal_auth_test.TestAuthUpgrade.test_upgrade_legacy_table
FAILED:  dtest-large-novnode.replace_address_test.TestReplaceAddress.test_restart_failed_replace
FAILED:  dtest-large.replace_address_test.TestReplaceAddress.test_restart_failed_replace
FAILED:  dtest-novnode.offline_tools_test.TestOfflineTools.test_sstableverify
FAILED:  dtest-upgrade.upgrade_internal_auth_test.TestAuthUpgrade.test_upgrade_to_30
FAILED:  dtest-upgrade.upgrade_tests.thrift_upgrade_test.TestUpgradeSuperColumnsThrough.test_dense_supercolumn
FAILED:  dtest-upgrade.upgrade_tests.thrift_upgrade_test.TestUpgradeSuperColumnsThrough.test_sparse_supercolumn
FAILED:  dtest.offline_tools_test.TestOfflineTools.test_sstableverify
FAILED:  org.apache.cassandra.concurrent.LongSharedExecutorPoolTest.testPromptnessOfExecution
FAILED:  org.apache.cassandra.concurrent.LongSharedExecutorPoolTest.testPromptnessOfExecution
FAILED:  org.apache.cassandra.concurrent.LongSharedExecutorPoolTest.testPromptnessOfExecution
FAILED:  org.apache.cassandra.concurrent.LongSharedExecutorPoolTest.testPromptnessOfExecution
FAILED:  org.apache.cassandra.concurrent.LongSharedExecutorPoolTest.testPromptnessOfExecution

-------------------------------------------------------------------------------
For complete test report and logs see https://nightlies.apache.org/cassandra/Cassandra-3.0/181/

Mime
View raw message