cassandra-builds mailing list archives

Site index · List index
Message view « Date » · « Thread »
Top « Date » · « Thread »
From Apache Jenkins Server <jenk...@builds.apache.org>
Subject Build complete: Cassandra-trunk #612 [UNSTABLE] 7cc6331bb211dbe2bb6b156c66c38ce3b2023446
Date Fri, 09 Jul 2021 06:36:08 GMT
-------------------------------------------------------------------------------
Build Cassandra-trunk #612 Still Unstable
URL: https://ci-cassandra.apache.org/job/Cassandra-trunk/612/
-------------------------------------------------------------------------------
Changes:
[Michael Semb Wever] Prepare debian changelog for 4.0.0


-------------------------------------------------------------------------------
Failed Tests:
47 tests failed.
FAILED:  dtest-upgrade.upgrade_tests.upgrade_through_versions_test.TestProtoV4Upgrade_AllVersions_RandomPartitioner_EndsAt_Trunk_HEAD.test_rolling_upgrade_with_internode_ssl
FAILED:  org.apache.cassandra.distributed.upgrade.MixedModeFrom2UnloggedBatchTest.testSimpleStrategy22to30
FAILED:  org.apache.cassandra.distributed.upgrade.MixedModeFrom2UnloggedBatchTest.testSimpleStrategy22to3X
FAILED:  org.apache.cassandra.distributed.upgrade.MixedModeReadRepairWriteTest.mixedModeReadRepairInsert
FAILED:  org.apache.cassandra.distributed.upgrade.MixedModeReadRepairWriteTest.mixedModeReadRepairUpdate
FAILED:  org.apache.cassandra.distributed.upgrade.CompactStorage3to4UpgradeTest.testNullClusteringValues
FAILED:  org.apache.cassandra.distributed.upgrade.MixedModeReadTest.mixedModeReadColumnSubsetDigestCheck
FAILED:  org.apache.cassandra.distributed.upgrade.UpgradeTest.simpleUpgradeWithNetworkAndGossipTest
FAILED:  org.apache.cassandra.distributed.upgrade.MixedModeFrom2ReplicationTest.testSimpleStrategy22to30
FAILED:  org.apache.cassandra.distributed.upgrade.MixedModeFrom2ReplicationTest.testSimpleStrategy22to3X
FAILED:  org.apache.cassandra.net.ConnectionTest.testMessageDeliveryOnReconnect-compression
FAILED:  org.apache.cassandra.distributed.upgrade.MixedModeFrom3UnloggedBatchTest.testSimpleStrategy30to4
FAILED:  org.apache.cassandra.distributed.upgrade.MixedModeFrom3UnloggedBatchTest.testSimpleStrategy3Xto4
FAILED:  org.apache.cassandra.distributed.upgrade.MixedModeFrom3UnloggedBatchTest.testSimpleStrategy30to3X
FAILED:  org.apache.cassandra.distributed.upgrade.MixedModeGossipTest.testStatusFieldShouldExistInOldVersionNodesEdgeCase
FAILED:  org.apache.cassandra.distributed.upgrade.MixedModeGossipTest.testStatusFieldShouldExistInOldVersionNodes
FAILED:  org.apache.cassandra.distributed.upgrade.PagingTest.testReads
FAILED:  org.apache.cassandra.distributed.upgrade.Pre40MessageFilterTest.reserializePre40RequestPaxosWithNetworkTest
FAILED:  org.apache.cassandra.distributed.upgrade.Pre40MessageFilterTest.reserializePre40RequestPaxosWithoutNetworkTest
FAILED:  org.apache.cassandra.distributed.upgrade.MixedModeAvailabilityV3XTest.testAvailabilityV3XToV4
FAILED:  org.apache.cassandra.distributed.upgrade.ReadRepairCompactStorageUpgradeTest.mixedModeReadRepairCompactStorage
FAILED:  org.apache.cassandra.distributed.upgrade.MixedModeFrom3LoggedBatchTest.testSimpleStrategy30to4
FAILED:  org.apache.cassandra.distributed.upgrade.MixedModeFrom3LoggedBatchTest.testSimpleStrategy3Xto4
FAILED:  org.apache.cassandra.distributed.upgrade.MixedModeFrom3LoggedBatchTest.testSimpleStrategy30to3X
FAILED:  org.apache.cassandra.distributed.upgrade.MixedModeAvailabilityV30Test.testAvailabilityV30ToV4
FAILED:  org.apache.cassandra.distributed.upgrade.MixedModeAvailabilityV30Test.testAvailabilityV30ToV3X
FAILED:  org.apache.cassandra.distributed.upgrade.MixedModeConsistencyV22Test.testConsistencyV22ToV30
FAILED:  org.apache.cassandra.distributed.upgrade.MixedModeConsistencyV22Test.testConsistencyV22ToV3X
FAILED:  org.apache.cassandra.distributed.upgrade.MixedModeConsistencyV30Test.testConsistencyV30ToV3X
FAILED:  org.apache.cassandra.distributed.upgrade.MixedModeConsistencyV30Test.testConsistencyV30ToV4
FAILED:  org.apache.cassandra.distributed.upgrade.MixedModeReadRepairDeleteTest.mixedModeReadRepairDeleteRow
FAILED:  org.apache.cassandra.distributed.upgrade.MixedModeReadRepairDeleteTest.mixedModeReadRepairDeletePartition
FAILED:  org.apache.cassandra.distributed.upgrade.GroupByTest.testReads
FAILED:  org.apache.cassandra.distributed.upgrade.MixedModeRepairTest.testRepairDuringMajorUpgrade
FAILED:  org.apache.cassandra.distributed.upgrade.MixedModeAvailabilityV22Test.testAvailabilityV22ToV30
FAILED:  org.apache.cassandra.distributed.upgrade.MixedModeAvailabilityV22Test.testAvailabilityV22ToV3X
FAILED:  org.apache.cassandra.distributed.upgrade.MixedModeFrom3ReplicationTest.testSimpleStrategy30to4
FAILED:  org.apache.cassandra.distributed.upgrade.MixedModeFrom3ReplicationTest.testSimpleStrategy3Xto4
FAILED:  org.apache.cassandra.distributed.upgrade.MixedModeFrom3ReplicationTest.testSimpleStrategy30to3X
FAILED:  org.apache.cassandra.distributed.upgrade.CompactStorageUpgradeTest.compactStoragePagingTest
FAILED:  org.apache.cassandra.distributed.upgrade.CompactStorageUpgradeTest.compactStorageColumnDeleteTest
FAILED:  org.apache.cassandra.distributed.upgrade.CompactStorageUpgradeTest.compactStorageImplicitNullInClusteringTest
FAILED:  org.apache.cassandra.distributed.upgrade.CompactStorageUpgradeTest.compactStorageHiddenColumnTest
FAILED:  org.apache.cassandra.distributed.upgrade.CompactStorageUpgradeTest.compactStorageUpgradeTest
FAILED:  org.apache.cassandra.distributed.upgrade.MixedModeConsistencyV3XTest.testConsistencyV3XToV4
FAILED:  org.apache.cassandra.distributed.upgrade.MixedModeFrom2LoggedBatchTest.testSimpleStrategy22to30
FAILED:  org.apache.cassandra.distributed.upgrade.MixedModeFrom2LoggedBatchTest.testSimpleStrategy22to3X

-------------------------------------------------------------------------------
For complete test report and logs see https://nightlies.apache.org/cassandra/Cassandra-trunk/612/

Mime
View raw message