cassandra-builds mailing list archives

Site index · List index
Message view « Date » · « Thread »
Top « Date » · « Thread »
From Apache Jenkins Server <jenk...@builds.apache.org>
Subject Build complete: Cassandra-3.11 #148 [UNSTABLE] 4bfe68717d9a419ab6a0b3a681478b39117dee80
Date Thu, 22 Apr 2021 10:13:09 GMT
-------------------------------------------------------------------------------
Build Cassandra-3.11 #148 Still Unstable
URL: https://ci-cassandra.apache.org/job/Cassandra-3.11/148/
-------------------------------------------------------------------------------
Changes:
[Berenguer Blasi] Flaky CassandraIndexTest


-------------------------------------------------------------------------------
Failed Tests:
36 tests failed.
FAILED:  dtest-offheap.materialized_views_test.TestMaterializedViews.test_view_metadata_cleanup
FAILED:  dtest-offheap.secondary_indexes_test.TestSecondaryIndexes.test_6924_dropping_ks
FAILED:  dtest-offheap.thrift_hsha_test.TestThriftHSHA.test_6285
FAILED:  dtest-upgrade.upgrade_tests.upgrade_through_versions_test.TestUpgrade_current_2_1_x_To_indev_3_11_x.test_rolling_upgrade
FAILED:  dtest-upgrade.upgrade_tests.upgrade_through_versions_test.TestUpgrade_current_2_1_x_To_indev_3_11_x.test_rolling_upgrade_with_internode_ssl
FAILED:  dtest.repair_tests.incremental_repair_test.TestIncRepair.test_multiple_repair
FAILED:  dtest-novnode.secondary_indexes_test.TestSecondaryIndexes.test_6924_dropping_ks
FAILED:  dtest-upgrade.upgrade_internal_auth_test.TestAuthUpgrade.test_upgrade_legacy_table
FAILED:  org.apache.cassandra.concurrent.LongSharedExecutorPoolTest.testPromptnessOfExecution
FAILED:  org.apache.cassandra.concurrent.LongSharedExecutorPoolTest.testPromptnessOfExecution
FAILED:  org.apache.cassandra.concurrent.LongSharedExecutorPoolTest.testPromptnessOfExecution
FAILED:  org.apache.cassandra.concurrent.LongSharedExecutorPoolTest.testPromptnessOfExecution
FAILED:  org.apache.cassandra.concurrent.LongSharedExecutorPoolTest.testPromptnessOfExecution
FAILED:  org.apache.cassandra.utils.memory.LongBufferPoolTest.testAllocate
FAILED:  org.apache.cassandra.utils.memory.LongBufferPoolTest.testAllocate
FAILED:  org.apache.cassandra.utils.memory.LongBufferPoolTest.testAllocate
FAILED:  org.apache.cassandra.utils.memory.LongBufferPoolTest.testAllocate
FAILED:  org.apache.cassandra.utils.memory.LongBufferPoolTest.testAllocate
FAILED:  dtest-offheap.counter_test.TestCounters.test_13691
FAILED:  dtest-offheap.counter_test.TestCounters.test_13691
FAILED:  dtest-upgrade.upgrade_tests.thrift_upgrade_test.TestUpgradeSuperColumnsThrough.test_dense_supercolumn
FAILED:  dtest-upgrade.upgrade_tests.thrift_upgrade_test.TestUpgradeSuperColumnsThrough.test_sparse_supercolumn
FAILED:  cqlshlib.python2.jdk8.no_cython.test.test_cqlsh_output.TestCqlshOutput.test_boolean_output
FAILED:  cqlshlib.python2.jdk8.no_cython.test.test_cqlsh_output.TestCqlshOutput.test_columnless_key_output
FAILED:  cqlshlib.python2.jdk8.no_cython.test.test_cqlsh_output.TestCqlshOutput.test_count_output
FAILED:  cqlshlib.python2.jdk8.no_cython.test.test_cqlsh_output.TestCqlshOutput.test_null_output
FAILED:  cqlshlib.python2.jdk8.no_cython.test.test_cqlsh_output.TestCqlshOutput.test_numeric_output
FAILED:  cqlshlib.python2.jdk8.no_cython.test.test_cqlsh_output.TestCqlshOutput.test_static_cf_output
FAILED:  cqlshlib.python2.jdk8.no_cython.test.test_cqlsh_output.TestCqlshOutput.test_string_output_ascii
FAILED:  cqlshlib.python2.jdk8.cython.test.test_cqlsh_output.TestCqlshOutput.test_boolean_output
FAILED:  cqlshlib.python2.jdk8.cython.test.test_cqlsh_output.TestCqlshOutput.test_columnless_key_output
FAILED:  cqlshlib.python2.jdk8.cython.test.test_cqlsh_output.TestCqlshOutput.test_count_output
FAILED:  cqlshlib.python2.jdk8.cython.test.test_cqlsh_output.TestCqlshOutput.test_null_output
FAILED:  cqlshlib.python2.jdk8.cython.test.test_cqlsh_output.TestCqlshOutput.test_numeric_output
FAILED:  cqlshlib.python2.jdk8.cython.test.test_cqlsh_output.TestCqlshOutput.test_static_cf_output
FAILED:  cqlshlib.python2.jdk8.cython.test.test_cqlsh_output.TestCqlshOutput.test_string_output_ascii

-------------------------------------------------------------------------------
For complete test report and logs see https://nightlies.apache.org/cassandra/Cassandra-3.11/148/

Mime
View raw message