carbondata-commits mailing list archives

Site index · List index
Message view « Date » · « Thread »
Top « Date » · « Thread »
From Apache Jenkins Server <jenk...@builds.apache.org>
Subject Build failed in Jenkins: carbondata-master-spark-2.1 #3086
Date Mon, 29 Oct 2018 06:22:52 GMT
See <https://builds.apache.org/job/carbondata-master-spark-2.1/3086/display/redirect?page=changes>

Changes:

[xuchuanyin] [CARBONDATA-3050][Doc] Remove unused parameter doc

------------------------------------------
[...truncated 51.21 KB...]
new code performance time: 0 ms
filteredValueCnt: 0
old code performance time: 2663 ms
new code performance time: 2591 ms
Tests run: 3, Failures: 0, Errors: 0, Skipped: 0, Time elapsed: 8.227 sec - in org.apache.carbondata.core.scan.filter.executer.IncludeFilterExecuterImplTest
Running org.apache.carbondata.core.scan.filter.FilterUtilTest
Tests run: 31, Failures: 0, Errors: 0, Skipped: 0, Time elapsed: 1.177 sec - in org.apache.carbondata.core.scan.filter.FilterUtilTest
Running org.apache.carbondata.core.scan.filter.FilterExpressionProcessorTest
Tests run: 1, Failures: 0, Errors: 0, Skipped: 0, Time elapsed: 0.015 sec - in org.apache.carbondata.core.scan.filter.FilterExpressionProcessorTest
Running org.apache.carbondata.core.scan.expression.ColumnExpressionTest
Tests run: 3, Failures: 0, Errors: 0, Skipped: 0, Time elapsed: 0.275 sec - in org.apache.carbondata.core.scan.expression.ColumnExpressionTest
Running org.apache.carbondata.core.scan.expression.ExpressionResultTest
Tests run: 66, Failures: 0, Errors: 0, Skipped: 0, Time elapsed: 0.029 sec - in org.apache.carbondata.core.scan.expression.ExpressionResultTest
Running org.apache.carbondata.core.scan.expression.conditional.ListExpressionUnitTest
Tests run: 2, Failures: 0, Errors: 0, Skipped: 0, Time elapsed: 0 sec - in org.apache.carbondata.core.scan.expression.conditional.ListExpressionUnitTest
Running org.apache.carbondata.core.scan.expression.conditional.LessThanExpressionUnitTest
Tests run: 17, Failures: 0, Errors: 0, Skipped: 0, Time elapsed: 2.161 sec - in org.apache.carbondata.core.scan.expression.conditional.LessThanExpressionUnitTest
Running org.apache.carbondata.core.scan.expression.conditional.InExpressionUnitTest
Tests run: 10, Failures: 0, Errors: 0, Skipped: 0, Time elapsed: 1.199 sec - in org.apache.carbondata.core.scan.expression.conditional.InExpressionUnitTest
Running org.apache.carbondata.core.scan.expression.conditional.EqualToExpressionUnitTest
Tests run: 15, Failures: 0, Errors: 0, Skipped: 0, Time elapsed: 1.986 sec - in org.apache.carbondata.core.scan.expression.conditional.EqualToExpressionUnitTest
Running org.apache.carbondata.core.scan.expression.conditional.NotInExpressionUnitTest
Tests run: 11, Failures: 0, Errors: 0, Skipped: 0, Time elapsed: 1.105 sec - in org.apache.carbondata.core.scan.expression.conditional.NotInExpressionUnitTest
Running org.apache.carbondata.core.scan.expression.conditional.GreaterThanEqualToExpressionUnitTest
Tests run: 18, Failures: 0, Errors: 0, Skipped: 0, Time elapsed: 2.108 sec - in org.apache.carbondata.core.scan.expression.conditional.GreaterThanEqualToExpressionUnitTest
Running org.apache.carbondata.core.scan.expression.conditional.GreaterThanExpressionUnitTest
Tests run: 17, Failures: 0, Errors: 0, Skipped: 0, Time elapsed: 2.065 sec - in org.apache.carbondata.core.scan.expression.conditional.GreaterThanExpressionUnitTest
Running org.apache.carbondata.core.scan.expression.conditional.NotEqualsExpressionUnitTest
Tests run: 20, Failures: 0, Errors: 0, Skipped: 0, Time elapsed: 2.83 sec - in org.apache.carbondata.core.scan.expression.conditional.NotEqualsExpressionUnitTest
Running org.apache.carbondata.core.scan.expression.conditional.LessThanEqualToExpressionUnitTest
Tests run: 16, Failures: 0, Errors: 0, Skipped: 0, Time elapsed: 2.017 sec - in org.apache.carbondata.core.scan.expression.conditional.LessThanEqualToExpressionUnitTest
Running org.apache.carbondata.core.scan.expression.LiteralExpressionTest
Tests run: 3, Failures: 0, Errors: 0, Skipped: 0, Time elapsed: 0.002 sec - in org.apache.carbondata.core.scan.expression.LiteralExpressionTest
Running org.apache.carbondata.core.scan.expression.logical.OrExpressionTest
Tests run: 7, Failures: 0, Errors: 0, Skipped: 0, Time elapsed: 0.643 sec - in org.apache.carbondata.core.scan.expression.logical.OrExpressionTest
Running org.apache.carbondata.core.scan.expression.logical.TrueExpressionTest
Tests run: 3, Failures: 0, Errors: 0, Skipped: 0, Time elapsed: 0.001 sec - in org.apache.carbondata.core.scan.expression.logical.TrueExpressionTest
Running org.apache.carbondata.core.scan.expression.logical.FalseExpressionTest
Tests run: 3, Failures: 0, Errors: 0, Skipped: 0, Time elapsed: 0 sec - in org.apache.carbondata.core.scan.expression.logical.FalseExpressionTest
Running org.apache.carbondata.core.scan.expression.logical.RangeExpressionTest
Tests run: 7, Failures: 0, Errors: 0, Skipped: 0, Time elapsed: 0.703 sec - in org.apache.carbondata.core.scan.expression.logical.RangeExpressionTest
Running org.apache.carbondata.core.scan.expression.logical.AndExpressionTest
Tests run: 7, Failures: 0, Errors: 0, Skipped: 0, Time elapsed: 0.732 sec - in org.apache.carbondata.core.scan.expression.logical.AndExpressionTest
Running org.apache.carbondata.core.scan.complextypes.StructQueryTypeTest
Tests run: 2, Failures: 0, Errors: 0, Skipped: 0, Time elapsed: 0.191 sec - in org.apache.carbondata.core.scan.complextypes.StructQueryTypeTest
Running org.apache.carbondata.core.scan.complextypes.ArrayQueryTypeTest
Tests run: 2, Failures: 0, Errors: 0, Skipped: 0, Time elapsed: 0.002 sec - in org.apache.carbondata.core.scan.complextypes.ArrayQueryTypeTest
Running org.apache.carbondata.core.scan.complextypes.PrimitiveQueryTypeTest
Tests run: 2, Failures: 0, Errors: 0, Skipped: 0, Time elapsed: 0.34 sec - in org.apache.carbondata.core.scan.complextypes.PrimitiveQueryTypeTest
Running org.apache.carbondata.core.scan.wrappers.ByteArrayWrapperTest
Tests run: 10, Failures: 0, Errors: 0, Skipped: 0, Time elapsed: 0.008 sec - in org.apache.carbondata.core.scan.wrappers.ByteArrayWrapperTest
Running org.apache.carbondata.core.scan.executor.util.RestructureUtilTest
Tests run: 2, Failures: 0, Errors: 0, Skipped: 0, Time elapsed: 0.014 sec - in org.apache.carbondata.core.scan.executor.util.RestructureUtilTest
Running org.apache.carbondata.core.scan.executor.util.QueryUtilTest
Tests run: 10, Failures: 0, Errors: 0, Skipped: 0, Time elapsed: 0.015 sec - in org.apache.carbondata.core.scan.executor.util.QueryUtilTest
Running org.apache.carbondata.core.scan.result.RowBatchTest
Tests run: 6, Failures: 0, Errors: 0, Skipped: 0, Time elapsed: 0.143 sec - in org.apache.carbondata.core.scan.result.RowBatchTest

Results :

Tests run: 862, Failures: 0, Errors: 0, Skipped: 0

[JENKINS] Recording test results
[WARNING] Attempt to (de-)serialize anonymous class hudson.maven.reporters.SurefireArchiver$2;
see: https://jenkins.io/redirect/serialization-of-anonymous-classes/
[INFO] 
[INFO] --- maven-jar-plugin:2.5:jar (default-jar) @ carbondata-core ---
[INFO] Building jar: <https://builds.apache.org/job/carbondata-master-spark-2.1/ws/core/target/carbondata-core-1.6.0-SNAPSHOT.jar>
[INFO] 
[INFO] --- maven-site-plugin:3.4:attach-descriptor (attach-descriptor) @ carbondata-core ---
[INFO] 
[INFO] --- jacoco-maven-plugin:0.7.9:prepare-agent-integration (default-prepare-agent-integration)
@ carbondata-core ---
[INFO] argLine set to -javaagent:/home/jenkins/jenkins-slave/maven-repositories/0/org/jacoco/org.jacoco.agent/0.7.9/org.jacoco.agent-0.7.9-runtime.jar=destfile=<https://builds.apache.org/job/carbondata-master-spark-2.1/ws/core/target/jacoco-it.exec,append=true>
[INFO] 
[INFO] --- maven-checkstyle-plugin:2.17:check (default) @ carbondata-core ---
[INFO] Starting audit...
Audit done.
[INFO] 
[INFO] --- scalastyle-maven-plugin:0.8.0:check (default) @ carbondata-core ---
[WARNING] sourceDirectory is not specified or does not exist value=<https://builds.apache.org/job/carbondata-master-spark-2.1/ws/core/src/main/scala>
Saving to outputFile=<https://builds.apache.org/job/carbondata-master-spark-2.1/ws/core/target/scalastyle-output.xml>
Processed 0 file(s)
Found 0 errors
Found 0 warnings
Found 0 infos
Finished in 2 ms
[INFO] 
[INFO] --- jacoco-maven-plugin:0.7.9:report (default-report) @ carbondata-core ---
[INFO] Loading execution data file <https://builds.apache.org/job/carbondata-master-spark-2.1/ws/core/target/jacoco.exec>
[INFO] Analyzed bundle 'Apache CarbonData :: Core' with 747 classes
[INFO] 
[INFO] --- jacoco-maven-plugin:0.7.9:report-integration (default-report-integration) @ carbondata-core
---
[INFO] Skipping JaCoCo execution due to missing execution data file.
[INFO] 
[INFO] --- jacoco-maven-plugin:0.7.9:check (default-check) @ carbondata-core ---
[INFO] Loading execution data file <https://builds.apache.org/job/carbondata-master-spark-2.1/ws/core/target/jacoco.exec>
[INFO] Analyzed bundle 'carbondata-core' with 0 classes
[INFO] All coverage checks have been met.
[INFO] 
[INFO] --- maven-install-plugin:2.5.2:install (default-install) @ carbondata-core ---
[INFO] Installing <https://builds.apache.org/job/carbondata-master-spark-2.1/ws/core/target/carbondata-core-1.6.0-SNAPSHOT.jar>
to /home/jenkins/jenkins-slave/maven-repositories/0/org/apache/carbondata/carbondata-core/1.6.0-SNAPSHOT/carbondata-core-1.6.0-SNAPSHOT.jar
[INFO] Installing <https://builds.apache.org/job/carbondata-master-spark-2.1/ws/core/pom.xml>
to /home/jenkins/jenkins-slave/maven-repositories/0/org/apache/carbondata/carbondata-core/1.6.0-SNAPSHOT/carbondata-core-1.6.0-SNAPSHOT.pom
[INFO]                                                                         
[INFO] ------------------------------------------------------------------------
[INFO] Building Apache CarbonData :: Processing 1.6.0-SNAPSHOT
[INFO] ------------------------------------------------------------------------
[INFO] 
[INFO] --- maven-clean-plugin:2.5:clean (default-clean) @ carbondata-processing ---
[INFO] Deleting <https://builds.apache.org/job/carbondata-master-spark-2.1/ws/processing/target>
[INFO] 
[INFO] --- jacoco-maven-plugin:0.7.9:prepare-agent (default-prepare-agent) @ carbondata-processing
---
[INFO] argLine set to -javaagent:/home/jenkins/jenkins-slave/maven-repositories/0/org/jacoco/org.jacoco.agent/0.7.9/org.jacoco.agent-0.7.9-runtime.jar=destfile=<https://builds.apache.org/job/carbondata-master-spark-2.1/ws/processing/target/jacoco.exec,append=true>
[INFO] 
[INFO] --- maven-remote-resources-plugin:1.5:process (default) @ carbondata-processing ---
[INFO] 
[INFO] --- maven-resources-plugin:2.7:resources (default-resources) @ carbondata-processing
---
[INFO] Using 'UTF-8' encoding to copy filtered resources.
[INFO] Copying 1 resource
[INFO] Copying 1 resource
[INFO] Copying 3 resources
[INFO] 
[INFO] --- maven-compiler-plugin:3.2:compile (default-compile) @ carbondata-processing ---
[INFO] Changes detected - recompiling the module!
[INFO] Compiling 148 source files to <https://builds.apache.org/job/carbondata-master-spark-2.1/ws/processing/target/classes>
[INFO] <https://builds.apache.org/job/carbondata-master-spark-2.1/ws/processing/src/main/java/org/apache/carbondata/processing/sort/sortdata/SortParameters.java>:
Some input files use or override a deprecated API.
[INFO] <https://builds.apache.org/job/carbondata-master-spark-2.1/ws/processing/src/main/java/org/apache/carbondata/processing/sort/sortdata/SortParameters.java>:
Recompile with -Xlint:deprecation for details.
[INFO] <https://builds.apache.org/job/carbondata-master-spark-2.1/ws/processing/src/main/java/org/apache/carbondata/processing/loading/sort/impl/UnsafeParallelReadMergeSorterWithColumnRangeImpl.java>:
Some input files use unchecked or unsafe operations.
[INFO] <https://builds.apache.org/job/carbondata-master-spark-2.1/ws/processing/src/main/java/org/apache/carbondata/processing/loading/sort/impl/UnsafeParallelReadMergeSorterWithColumnRangeImpl.java>:
Recompile with -Xlint:unchecked for details.
[INFO] -------------------------------------------------------------
[ERROR] COMPILATION ERROR : 
[INFO] -------------------------------------------------------------
[ERROR] <https://builds.apache.org/job/carbondata-master-spark-2.1/ws/processing/src/main/java/org/apache/carbondata/processing/store/writer/v3/CarbonFactDataWriterImplV3.java>:[107,22]
cannot find symbol
  symbol:   method putToExtra_info(java.lang.String,java.lang.String)
  location: variable convertFileMeta of type org.apache.carbondata.format.FileFooter3
[ERROR] <https://builds.apache.org/job/carbondata-master-spark-2.1/ws/processing/src/main/java/org/apache/carbondata/processing/store/writer/v3/CarbonFactDataWriterImplV3.java>:[110,22]
cannot find symbol
  symbol:   method putToExtra_info(java.lang.String,java.lang.String)
  location: variable convertFileMeta of type org.apache.carbondata.format.FileFooter3
[INFO] 2 errors 
[INFO] -------------------------------------------------------------
[INFO] ------------------------------------------------------------------------
[INFO] Reactor Summary:
[INFO] 
[INFO] Apache CarbonData :: Parent ........................ SUCCESS [ 10.942 s]
[INFO] Apache CarbonData :: Common ........................ SUCCESS [ 17.932 s]
[INFO] Apache CarbonData :: Core .......................... SUCCESS [03:17 min]
[INFO] Apache CarbonData :: Processing .................... FAILURE [  4.449 s]
[INFO] Apache CarbonData :: Hadoop ........................ SKIPPED
[INFO] Apache CarbonData :: Streaming ..................... SKIPPED
[INFO] Apache CarbonData :: Store SDK ..................... SKIPPED
[INFO] Apache CarbonData :: Spark Datasource .............. SKIPPED
[INFO] Apache CarbonData :: Spark Common .................. SKIPPED
[INFO] Apache CarbonData :: CLI ........................... SKIPPED
[INFO] Apache CarbonData :: Search ........................ SKIPPED
[INFO] Apache CarbonData :: Lucene Index DataMap .......... SKIPPED
[INFO] Apache CarbonData :: Bloom Index DataMap ........... SKIPPED
[INFO] Apache CarbonData :: Spark2 ........................ SKIPPED
[INFO] Apache CarbonData :: Spark Common Test ............. SKIPPED
[INFO] Apache CarbonData :: DataMap Examples .............. SKIPPED
[INFO] Apache CarbonData :: Assembly ...................... SKIPPED
[INFO] Apache CarbonData :: Hive .......................... SKIPPED
[INFO] Apache CarbonData :: presto ........................ SKIPPED
[INFO] Apache CarbonData :: Spark2 Examples ............... SKIPPED
[INFO] ------------------------------------------------------------------------
[INFO] BUILD FAILURE
[INFO] ------------------------------------------------------------------------
[INFO] Total time: 04:20 min
[INFO] Finished at: 2018-10-29T06:22:06+00:00
[INFO] Final Memory: 88M/1940M
[INFO] ------------------------------------------------------------------------
[ERROR] Failed to execute goal org.apache.maven.plugins:maven-compiler-plugin:3.2:compile
(default-compile) on project carbondata-processing: Compilation failure: Compilation failure:
[ERROR] <https://builds.apache.org/job/carbondata-master-spark-2.1/ws/processing/src/main/java/org/apache/carbondata/processing/store/writer/v3/CarbonFactDataWriterImplV3.java>:[107,22]
cannot find symbol
[ERROR] symbol:   method putToExtra_info(java.lang.String,java.lang.String)
[ERROR] location: variable convertFileMeta of type org.apache.carbondata.format.FileFooter3
[ERROR] <https://builds.apache.org/job/carbondata-master-spark-2.1/ws/processing/src/main/java/org/apache/carbondata/processing/store/writer/v3/CarbonFactDataWriterImplV3.java>:[110,22]
cannot find symbol
[ERROR] symbol:   method putToExtra_info(java.lang.String,java.lang.String)
[ERROR] location: variable convertFileMeta of type org.apache.carbondata.format.FileFooter3
[ERROR] -> [Help 1]
org.apache.maven.lifecycle.LifecycleExecutionException: Failed to execute goal org.apache.maven.plugins:maven-compiler-plugin:3.2:compile
(default-compile) on project carbondata-processing: Compilation failure
	at org.apache.maven.lifecycle.internal.MojoExecutor.execute(MojoExecutor.java:212)
	at org.apache.maven.lifecycle.internal.MojoExecutor.execute(MojoExecutor.java:153)
	at org.apache.maven.lifecycle.internal.MojoExecutor.execute(MojoExecutor.java:145)
	at org.apache.maven.lifecycle.internal.LifecycleModuleBuilder.buildProject(LifecycleModuleBuilder.java:116)
	at org.apache.maven.lifecycle.internal.LifecycleModuleBuilder.buildProject(LifecycleModuleBuilder.java:80)
	at org.apache.maven.lifecycle.internal.builder.singlethreaded.SingleThreadedBuilder.build(SingleThreadedBuilder.java:51)
	at org.apache.maven.lifecycle.internal.LifecycleStarter.execute(LifecycleStarter.java:128)
	at org.apache.maven.DefaultMaven.doExecute(DefaultMaven.java:307)
	at org.apache.maven.DefaultMaven.doExecute(DefaultMaven.java:193)
	at org.apache.maven.DefaultMaven.execute(DefaultMaven.java:106)
	at org.jvnet.hudson.maven3.launcher.Maven33Launcher.main(Maven33Launcher.java:129)
	at sun.reflect.NativeMethodAccessorImpl.invoke0(Native Method)
	at sun.reflect.NativeMethodAccessorImpl.invoke(NativeMethodAccessorImpl.java:62)
	at sun.reflect.DelegatingMethodAccessorImpl.invoke(DelegatingMethodAccessorImpl.java:43)
	at java.lang.reflect.Method.invoke(Method.java:498)
	at org.codehaus.plexus.classworlds.launcher.Launcher.launchStandard(Launcher.java:330)
	at org.codehaus.plexus.classworlds.launcher.Launcher.launch(Launcher.java:238)
	at jenkins.maven3.agent.Maven33Main.launch(Maven33Main.java:176)
	at sun.reflect.NativeMethodAccessorImpl.invoke0(Native Method)
	at sun.reflect.NativeMethodAccessorImpl.invoke(NativeMethodAccessorImpl.java:62)
	at sun.reflect.DelegatingMethodAccessorImpl.invoke(DelegatingMethodAccessorImpl.java:43)
	at java.lang.reflect.Method.invoke(Method.java:498)
	at hudson.maven.Maven3Builder.call(Maven3Builder.java:139)
	at hudson.maven.Maven3Builder.call(Maven3Builder.java:70)
	at hudson.remoting.UserRequest.perform(UserRequest.java:212)
	at hudson.remoting.UserRequest.perform(UserRequest.java:54)
	at hudson.remoting.Request$2.run(Request.java:369)
	at hudson.remoting.InterceptingExecutorService$1.call(InterceptingExecutorService.java:72)
	at java.util.concurrent.FutureTask.run(FutureTask.java:266)
	at java.util.concurrent.ThreadPoolExecutor.runWorker(ThreadPoolExecutor.java:1149)
	at java.util.concurrent.ThreadPoolExecutor$Worker.run(ThreadPoolExecutor.java:624)
	at java.lang.Thread.run(Thread.java:748)
Caused by: org.apache.maven.plugin.compiler.CompilationFailureException: Compilation failure
	at org.apache.maven.plugin.compiler.AbstractCompilerMojo.execute(AbstractCompilerMojo.java:909)
	at org.apache.maven.plugin.compiler.CompilerMojo.execute(CompilerMojo.java:129)
	at org.apache.maven.plugin.DefaultBuildPluginManager.executeMojo(DefaultBuildPluginManager.java:134)
	at org.apache.maven.lifecycle.internal.MojoExecutor.execute(MojoExecutor.java:207)
	... 31 more
[ERROR] 
[ERROR] Re-run Maven using the -X switch to enable full debug logging.
[ERROR] 
[ERROR] For more information about the errors and possible solutions, please read the following
articles:
[ERROR] [Help 1] http://cwiki.apache.org/confluence/display/MAVEN/MojoFailureException
[ERROR] 
[ERROR] After correcting the problems, you can resume the build with the command
[ERROR]   mvn <goals> -rf :carbondata-processing
[JENKINS] Archiving <https://builds.apache.org/job/carbondata-master-spark-2.1/ws/processing/pom.xml>
to org.apache.carbondata/carbondata-processing/1.6.0-SNAPSHOT/carbondata-processing-1.6.0-SNAPSHOT.pom
[JENKINS] Archiving <https://builds.apache.org/job/carbondata-master-spark-2.1/ws/datamap/examples/pom.xml>
to org.apache.carbondata/carbondata-datamap-examples/1.6.0-SNAPSHOT/carbondata-datamap-examples-1.6.0-SNAPSHOT.pom
[JENKINS] Archiving <https://builds.apache.org/job/carbondata-master-spark-2.1/ws/store/search/pom.xml>
to org.apache.carbondata/carbondata-search/1.6.0-SNAPSHOT/carbondata-search-1.6.0-SNAPSHOT.pom
[JENKINS] Archiving <https://builds.apache.org/job/carbondata-master-spark-2.1/ws/streaming/pom.xml>
to org.apache.carbondata/carbondata-streaming/1.6.0-SNAPSHOT/carbondata-streaming-1.6.0-SNAPSHOT.pom
[JENKINS] Archiving <https://builds.apache.org/job/carbondata-master-spark-2.1/ws/integration/spark-common/pom.xml>
to org.apache.carbondata/carbondata-spark-common/1.6.0-SNAPSHOT/carbondata-spark-common-1.6.0-SNAPSHOT.pom
[JENKINS] Archiving <https://builds.apache.org/job/carbondata-master-spark-2.1/ws/datamap/lucene/pom.xml>
to org.apache.carbondata/carbondata-lucene/1.6.0-SNAPSHOT/carbondata-lucene-1.6.0-SNAPSHOT.pom
[JENKINS] Archiving <https://builds.apache.org/job/carbondata-master-spark-2.1/ws/integration/hive/pom.xml>
to org.apache.carbondata/carbondata-hive/1.6.0-SNAPSHOT/carbondata-hive-1.6.0-SNAPSHOT.pom
[JENKINS] Archiving <https://builds.apache.org/job/carbondata-master-spark-2.1/ws/common/pom.xml>
to org.apache.carbondata/carbondata-common/1.6.0-SNAPSHOT/carbondata-common-1.6.0-SNAPSHOT.pom
[JENKINS] Archiving <https://builds.apache.org/job/carbondata-master-spark-2.1/ws/common/target/carbondata-common-1.6.0-SNAPSHOT.jar>
to org.apache.carbondata/carbondata-common/1.6.0-SNAPSHOT/carbondata-common-1.6.0-SNAPSHOT.jar
[JENKINS] Archiving <https://builds.apache.org/job/carbondata-master-spark-2.1/ws/examples/spark2/pom.xml>
to org.apache.carbondata/carbondata-examples-spark2/1.6.0-SNAPSHOT/carbondata-examples-spark2-1.6.0-SNAPSHOT.pom
[JENKINS] Archiving <https://builds.apache.org/job/carbondata-master-spark-2.1/ws/integration/spark2/pom.xml>
to org.apache.carbondata/carbondata-spark2/1.6.0-SNAPSHOT/carbondata-spark2-1.6.0-SNAPSHOT.pom
[JENKINS] Archiving <https://builds.apache.org/job/carbondata-master-spark-2.1/ws/tools/cli/pom.xml>
to org.apache.carbondata/carbondata-cli/1.6.0-SNAPSHOT/carbondata-cli-1.6.0-SNAPSHOT.pom
[JENKINS] Archiving <https://builds.apache.org/job/carbondata-master-spark-2.1/ws/datamap/bloom/pom.xml>
to org.apache.carbondata/carbondata-bloom/1.6.0-SNAPSHOT/carbondata-bloom-1.6.0-SNAPSHOT.pom
[JENKINS] Archiving <https://builds.apache.org/job/carbondata-master-spark-2.1/ws/assembly/pom.xml>
to org.apache.carbondata/carbondata-assembly/1.6.0-SNAPSHOT/carbondata-assembly-1.6.0-SNAPSHOT.pom
[JENKINS] Archiving <https://builds.apache.org/job/carbondata-master-spark-2.1/ws/pom.xml>
to org.apache.carbondata/carbondata-parent/1.6.0-SNAPSHOT/carbondata-parent-1.6.0-SNAPSHOT.pom
[JENKINS] Archiving <https://builds.apache.org/job/carbondata-master-spark-2.1/ws/core/pom.xml>
to org.apache.carbondata/carbondata-core/1.6.0-SNAPSHOT/carbondata-core-1.6.0-SNAPSHOT.pom
[JENKINS] Archiving <https://builds.apache.org/job/carbondata-master-spark-2.1/ws/core/target/carbondata-core-1.6.0-SNAPSHOT.jar>
to org.apache.carbondata/carbondata-core/1.6.0-SNAPSHOT/carbondata-core-1.6.0-SNAPSHOT.jar
[JENKINS] Archiving <https://builds.apache.org/job/carbondata-master-spark-2.1/ws/hadoop/pom.xml>
to org.apache.carbondata/carbondata-hadoop/1.6.0-SNAPSHOT/carbondata-hadoop-1.6.0-SNAPSHOT.pom
[JENKINS] Archiving <https://builds.apache.org/job/carbondata-master-spark-2.1/ws/integration/spark-datasource/pom.xml>
to org.apache.carbondata/carbondata-spark-datasource/1.6.0-SNAPSHOT/carbondata-spark-datasource-1.6.0-SNAPSHOT.pom
[JENKINS] Archiving <https://builds.apache.org/job/carbondata-master-spark-2.1/ws/integration/presto/pom.xml>
to org.apache.carbondata/carbondata-presto/1.6.0-SNAPSHOT/carbondata-presto-1.6.0-SNAPSHOT.pom
[JENKINS] Archiving <https://builds.apache.org/job/carbondata-master-spark-2.1/ws/integration/spark-common-test/pom.xml>
to org.apache.carbondata/carbondata-spark-common-test/1.6.0-SNAPSHOT/carbondata-spark-common-test-1.6.0-SNAPSHOT.pom
[JENKINS] Archiving <https://builds.apache.org/job/carbondata-master-spark-2.1/ws/store/sdk/pom.xml>
to org.apache.carbondata/carbondata-store-sdk/1.6.0-SNAPSHOT/carbondata-store-sdk-1.6.0-SNAPSHOT.pom
Sending e-mails to: commits@carbondata.apache.org
channel stopped
Not sending mail to unregistered user jacky.likun@qq.com
Not sending mail to unregistered user kunalkapoor642@gmail.com

Mime
View raw message