carbondata-commits mailing list archives

Site index · List index
Message view « Date » · « Thread »
Top « Date » · « Thread »
From Apache Jenkins Server <jenk...@builds.apache.org>
Subject Build failed in Jenkins: carbondata-master-spark-2.1 #3049
Date Sat, 20 Oct 2018 13:33:22 GMT
See <https://builds.apache.org/job/carbondata-master-spark-2.1/3049/display/redirect?page=changes>

Changes:

[441586683] [HOTFIX] Upgrade pom version to 1.6-SNAPSHOT

------------------------------------------
[...truncated 268.18 KB...]
[INFO] Downloaded: http://repo1.maven.org/maven2/com/google/code/gson/gson/2.4/gson-2.4.pom
(9 KB at 618.4 KB/sec)
[INFO] Downloading: http://repo1.maven.org/maven2/org/apache/hadoop/hadoop-hdfs/2.7.2/hadoop-hdfs-2.7.2.pom
[INFO] Downloaded: http://repo1.maven.org/maven2/org/apache/hadoop/hadoop-hdfs/2.7.2/hadoop-hdfs-2.7.2.pom
(24 KB at 1164.2 KB/sec)
[INFO] Downloading: http://repo1.maven.org/maven2/commons-daemon/commons-daemon/1.0.13/commons-daemon-1.0.13.pom
[INFO] Downloaded: http://repo1.maven.org/maven2/commons-daemon/commons-daemon/1.0.13/commons-daemon-1.0.13.pom
(5 KB at 303.4 KB/sec)
[INFO] Downloading: http://repo1.maven.org/maven2/io/netty/netty/3.6.2.Final/netty-3.6.2.Final.pom
[INFO] Downloaded: http://repo1.maven.org/maven2/io/netty/netty/3.6.2.Final/netty-3.6.2.Final.pom
(26 KB at 1968.4 KB/sec)
[INFO] Downloading: http://repo1.maven.org/maven2/org/fusesource/leveldbjni/leveldbjni-all/1.8/leveldbjni-all-1.8.pom
[INFO] Downloaded: http://repo1.maven.org/maven2/org/fusesource/leveldbjni/leveldbjni-all/1.8/leveldbjni-all-1.8.pom
(8 KB at 542.8 KB/sec)
[INFO] Downloading: http://repo1.maven.org/maven2/org/fusesource/leveldbjni/leveldbjni-project/1.8/leveldbjni-project-1.8.pom
[INFO] Downloaded: http://repo1.maven.org/maven2/org/fusesource/leveldbjni/leveldbjni-project/1.8/leveldbjni-project-1.8.pom
(10 KB at 721.5 KB/sec)
[INFO] Downloading: http://repo1.maven.org/maven2/org/fusesource/fusesource-pom/1.9/fusesource-pom-1.9.pom
[INFO] Downloaded: http://repo1.maven.org/maven2/org/fusesource/fusesource-pom/1.9/fusesource-pom-1.9.pom
(15 KB at 1111.1 KB/sec)
[INFO] Downloading: http://repo1.maven.org/maven2/org/apache/hadoop/hadoop-client/2.7.2/hadoop-client-2.7.2.pom
[INFO] Downloaded: http://repo1.maven.org/maven2/org/apache/hadoop/hadoop-client/2.7.2/hadoop-client-2.7.2.pom
(10 KB at 763.0 KB/sec)
[INFO] Downloading: http://repo1.maven.org/maven2/org/apache/hadoop/hadoop-mapreduce-client-app/2.7.2/hadoop-mapreduce-client-app-2.7.2.pom
[INFO] Downloaded: http://repo1.maven.org/maven2/org/apache/hadoop/hadoop-mapreduce-client-app/2.7.2/hadoop-mapreduce-client-app-2.7.2.pom
(5 KB at 269.8 KB/sec)
[INFO] Downloading: http://repo1.maven.org/maven2/org/apache/hadoop/hadoop-mapreduce-client/2.7.2/hadoop-mapreduce-client-2.7.2.pom
[INFO] Downloaded: http://repo1.maven.org/maven2/org/apache/hadoop/hadoop-mapreduce-client/2.7.2/hadoop-mapreduce-client-2.7.2.pom
(7 KB at 429.0 KB/sec)
[INFO] Downloading: http://repo1.maven.org/maven2/org/apache/hadoop/hadoop-mapreduce-client-common/2.7.2/hadoop-mapreduce-client-common-2.7.2.pom
[INFO] Downloaded: http://repo1.maven.org/maven2/org/apache/hadoop/hadoop-mapreduce-client-common/2.7.2/hadoop-mapreduce-client-common-2.7.2.pom
(4 KB at 250.8 KB/sec)
[INFO] Downloading: http://repo1.maven.org/maven2/org/apache/hadoop/hadoop-yarn-common/2.7.2/hadoop-yarn-common-2.7.2.pom
[INFO] Downloaded: http://repo1.maven.org/maven2/org/apache/hadoop/hadoop-yarn-common/2.7.2/hadoop-yarn-common-2.7.2.pom
(10 KB at 768.0 KB/sec)
[INFO] Downloading: http://repo1.maven.org/maven2/org/apache/hadoop/hadoop-yarn/2.7.2/hadoop-yarn-2.7.2.pom
[INFO] Downloaded: http://repo1.maven.org/maven2/org/apache/hadoop/hadoop-yarn/2.7.2/hadoop-yarn-2.7.2.pom
(4 KB at 268.7 KB/sec)
[INFO] Downloading: http://repo1.maven.org/maven2/org/apache/hadoop/hadoop-yarn-api/2.7.2/hadoop-yarn-api-2.7.2.pom
[INFO] Downloaded: http://repo1.maven.org/maven2/org/apache/hadoop/hadoop-yarn-api/2.7.2/hadoop-yarn-api-2.7.2.pom
(5 KB at 292.1 KB/sec)
[INFO] Downloading: http://repo1.maven.org/maven2/com/sun/jersey/jersey-client/1.9/jersey-client-1.9.pom
[INFO] Downloaded: http://repo1.maven.org/maven2/com/sun/jersey/jersey-client/1.9/jersey-client-1.9.pom
(7 KB at 484.0 KB/sec)
[INFO] Downloading: http://repo1.maven.org/maven2/org/codehaus/jackson/jackson-jaxrs/1.9.13/jackson-jaxrs-1.9.13.pom
[INFO] Downloaded: http://repo1.maven.org/maven2/org/codehaus/jackson/jackson-jaxrs/1.9.13/jackson-jaxrs-1.9.13.pom
(2 KB at 142.9 KB/sec)
[INFO] Downloading: http://repo1.maven.org/maven2/org/codehaus/jackson/jackson-xc/1.9.13/jackson-xc-1.9.13.pom
[INFO] Downloaded: http://repo1.maven.org/maven2/org/codehaus/jackson/jackson-xc/1.9.13/jackson-xc-1.9.13.pom
(2 KB at 143.2 KB/sec)
[INFO] Downloading: http://repo1.maven.org/maven2/com/google/inject/guice/3.0/guice-3.0.pom
[INFO] Downloaded: http://repo1.maven.org/maven2/com/google/inject/guice/3.0/guice-3.0.pom
(8 KB at 547.0 KB/sec)
[INFO] Downloading: http://repo1.maven.org/maven2/com/google/inject/guice-parent/3.0/guice-parent-3.0.pom
[INFO] Downloaded: http://repo1.maven.org/maven2/com/google/inject/guice-parent/3.0/guice-parent-3.0.pom
(13 KB at 1055.9 KB/sec)
[INFO] Downloading: http://repo1.maven.org/maven2/com/google/google/5/google-5.pom
[INFO] Downloaded: http://repo1.maven.org/maven2/com/google/google/5/google-5.pom (3 KB at
184.6 KB/sec)
[INFO] Downloading: http://repo1.maven.org/maven2/javax/inject/javax.inject/1/javax.inject-1.pom
[INFO] Downloaded: http://repo1.maven.org/maven2/javax/inject/javax.inject/1/javax.inject-1.pom
(612 B at 49.8 KB/sec)
[INFO] Downloading: http://repo1.maven.org/maven2/aopalliance/aopalliance/1.0/aopalliance-1.0.pom
[INFO] Downloaded: http://repo1.maven.org/maven2/aopalliance/aopalliance/1.0/aopalliance-1.0.pom
(363 B at 29.5 KB/sec)
[INFO] Downloading: http://repo1.maven.org/maven2/com/sun/jersey/contribs/jersey-guice/1.9/jersey-guice-1.9.pom
[INFO] Downloaded: http://repo1.maven.org/maven2/com/sun/jersey/contribs/jersey-guice/1.9/jersey-guice-1.9.pom
(8 KB at 561.7 KB/sec)
[INFO] Downloading: http://repo1.maven.org/maven2/com/sun/jersey/contribs/jersey-contribs/1.9/jersey-contribs-1.9.pom
[INFO] Downloaded: http://repo1.maven.org/maven2/com/sun/jersey/contribs/jersey-contribs/1.9/jersey-contribs-1.9.pom
(5 KB at 338.1 KB/sec)
[INFO] Downloading: http://repo1.maven.org/maven2/org/apache/hadoop/hadoop-yarn-client/2.7.2/hadoop-yarn-client-2.7.2.pom
[INFO] Downloaded: http://repo1.maven.org/maven2/org/apache/hadoop/hadoop-yarn-client/2.7.2/hadoop-yarn-client-2.7.2.pom
(6 KB at 433.1 KB/sec)
[INFO] Downloading: http://repo1.maven.org/maven2/org/apache/hadoop/hadoop-mapreduce-client-core/2.7.2/hadoop-mapreduce-client-core-2.7.2.pom
[INFO] Downloaded: http://repo1.maven.org/maven2/org/apache/hadoop/hadoop-mapreduce-client-core/2.7.2/hadoop-mapreduce-client-core-2.7.2.pom
(4 KB at 262.3 KB/sec)
[INFO] Downloading: http://repo1.maven.org/maven2/org/apache/hadoop/hadoop-yarn-server-common/2.7.2/hadoop-yarn-server-common-2.7.2.pom
[INFO] Downloaded: http://repo1.maven.org/maven2/org/apache/hadoop/hadoop-yarn-server-common/2.7.2/hadoop-yarn-server-common-2.7.2.pom
(6 KB at 334.5 KB/sec)
[INFO] Downloading: http://repo1.maven.org/maven2/org/apache/hadoop/hadoop-yarn-server/2.7.2/hadoop-yarn-server-2.7.2.pom
[INFO] Downloaded: http://repo1.maven.org/maven2/org/apache/hadoop/hadoop-yarn-server/2.7.2/hadoop-yarn-server-2.7.2.pom
(2 KB at 118.9 KB/sec)
[INFO] Downloading: http://repo1.maven.org/maven2/org/apache/hadoop/hadoop-mapreduce-client-shuffle/2.7.2/hadoop-mapreduce-client-shuffle-2.7.2.pom
[INFO] Downloaded: http://repo1.maven.org/maven2/org/apache/hadoop/hadoop-mapreduce-client-shuffle/2.7.2/hadoop-mapreduce-client-shuffle-2.7.2.pom
(3 KB at 230.7 KB/sec)
[INFO] Downloading: http://repo1.maven.org/maven2/org/apache/hadoop/hadoop-mapreduce-client-jobclient/2.7.2/hadoop-mapreduce-client-jobclient-2.7.2.pom
[INFO] Downloaded: http://repo1.maven.org/maven2/org/apache/hadoop/hadoop-mapreduce-client-jobclient/2.7.2/hadoop-mapreduce-client-jobclient-2.7.2.pom
(6 KB at 441.7 KB/sec)
[INFO] Downloading: http://repo1.maven.org/maven2/org/apache/hadoop/hadoop-yarn-server-nodemanager/2.7.2/hadoop-yarn-server-nodemanager-2.7.2.pom
[INFO] Downloaded: http://repo1.maven.org/maven2/org/apache/hadoop/hadoop-yarn-server-nodemanager/2.7.2/hadoop-yarn-server-nodemanager-2.7.2.pom
(12 KB at 802.0 KB/sec)
[INFO] Downloading: http://repo1.maven.org/maven2/org/xerial/snappy/snappy-java/1.1.2.6/snappy-java-1.1.2.6.pom
[INFO] Downloaded: http://repo1.maven.org/maven2/org/xerial/snappy/snappy-java/1.1.2.6/snappy-java-1.1.2.6.pom
(4 KB at 229.4 KB/sec)
[INFO] Downloading: http://repo1.maven.org/maven2/com/github/luben/zstd-jni/1.3.2-2/zstd-jni-1.3.2-2.pom
[INFO] Downloaded: http://repo1.maven.org/maven2/com/github/luben/zstd-jni/1.3.2-2/zstd-jni-1.3.2-2.pom
(2 KB at 124.3 KB/sec)
[INFO] Downloading: http://repo1.maven.org/maven2/org/apache/zookeeper/zookeeper/3.4.7/zookeeper-3.4.7.pom
[INFO] Downloaded: http://repo1.maven.org/maven2/org/apache/zookeeper/zookeeper/3.4.7/zookeeper-3.4.7.pom
(4 KB at 249.7 KB/sec)
[INFO] Downloading: http://repo1.maven.org/maven2/org/apache/commons/commons-lang3/3.5/commons-lang3-3.5.pom
[INFO] Downloaded: http://repo1.maven.org/maven2/org/apache/commons/commons-lang3/3.5/commons-lang3-3.5.pom
(23 KB at 1900.0 KB/sec)
[INFO] Downloading: http://repo1.maven.org/maven2/org/apache/commons/commons-parent/41/commons-parent-41.pom
[INFO] Downloaded: http://repo1.maven.org/maven2/org/apache/commons/commons-parent/41/commons-parent-41.pom
(64 KB at 4870.6 KB/sec)
[INFO] Downloading: http://repo1.maven.org/maven2/org/apache/apache/18/apache-18.pom
[INFO] Downloaded: http://repo1.maven.org/maven2/org/apache/apache/18/apache-18.pom (16 KB
at 1176.9 KB/sec)
[INFO] Downloading: http://repo1.maven.org/maven2/org/roaringbitmap/RoaringBitmap/0.5.11/RoaringBitmap-0.5.11.pom
[INFO] Downloaded: http://repo1.maven.org/maven2/org/roaringbitmap/RoaringBitmap/0.5.11/RoaringBitmap-0.5.11.pom
(7 KB at 444.3 KB/sec)
[INFO] Downloading: http://repo1.maven.org/maven2/org/sonatype/oss/oss-parent/5/oss-parent-5.pom
[INFO] Downloaded: http://repo1.maven.org/maven2/org/sonatype/oss/oss-parent/5/oss-parent-5.pom
(4 KB at 332.2 KB/sec)
[INFO] Downloading: http://repo1.maven.org/maven2/io/netty/netty-all/4.0.42.Final/netty-all-4.0.42.Final.pom
[INFO] Downloaded: http://repo1.maven.org/maven2/io/netty/netty-all/4.0.42.Final/netty-all-4.0.42.Final.pom
(18 KB at 1227.8 KB/sec)
[INFO] Downloading: http://repo1.maven.org/maven2/io/netty/netty-parent/4.0.42.Final/netty-parent-4.0.42.Final.pom
[INFO] Downloaded: http://repo1.maven.org/maven2/io/netty/netty-parent/4.0.42.Final/netty-parent-4.0.42.Final.pom
(44 KB at 2916.7 KB/sec)
[INFO] Downloading: http://repo1.maven.org/maven2/org/lz4/lz4-java/1.4.0/lz4-java-1.4.0.pom
[INFO] Downloaded: http://repo1.maven.org/maven2/org/lz4/lz4-java/1.4.0/lz4-java-1.4.0.pom
(2 KB at 142.2 KB/sec)
[INFO] Downloading: http://repo1.maven.org/maven2/org/apache/carbondata/carbondata-format/1.6.0-SNAPSHOT/carbondata-format-1.6.0-SNAPSHOT.jar
[INFO] Downloading: http://repo1.maven.org/maven2/com/google/code/gson/gson/2.4/gson-2.4.jar
[INFO] Downloading: http://repo1.maven.org/maven2/commons-daemon/commons-daemon/1.0.13/commons-daemon-1.0.13.jar
[INFO] Downloading: http://repo1.maven.org/maven2/org/apache/hadoop/hadoop-hdfs/2.7.2/hadoop-hdfs-2.7.2.jar
[INFO] Downloading: http://repo1.maven.org/maven2/io/netty/netty/3.6.2.Final/netty-3.6.2.Final.jar
[INFO] Downloading: http://repo1.maven.org/maven2/org/fusesource/leveldbjni/leveldbjni-all/1.8/leveldbjni-all-1.8.jar
[INFO] Downloaded: http://repo1.maven.org/maven2/commons-daemon/commons-daemon/1.0.13/commons-daemon-1.0.13.jar
(24 KB at 1479.4 KB/sec)
[INFO] Downloading: http://repo1.maven.org/maven2/org/apache/hadoop/hadoop-client/2.7.2/hadoop-client-2.7.2.jar
[INFO] Downloaded: http://repo1.maven.org/maven2/com/google/code/gson/gson/2.4/gson-2.4.jar
(208 KB at 10359.6 KB/sec)
[INFO] Downloading: http://repo1.maven.org/maven2/org/apache/hadoop/hadoop-mapreduce-client-app/2.7.2/hadoop-mapreduce-client-app-2.7.2.jar
[INFO] Downloaded: http://repo1.maven.org/maven2/org/apache/hadoop/hadoop-client/2.7.2/hadoop-client-2.7.2.jar
(3 KB at 88.8 KB/sec)
[INFO] Downloading: http://repo1.maven.org/maven2/org/apache/hadoop/hadoop-mapreduce-client-common/2.7.2/hadoop-mapreduce-client-common-2.7.2.jar
[INFO] Downloaded: http://repo1.maven.org/maven2/org/apache/hadoop/hadoop-mapreduce-client-app/2.7.2/hadoop-mapreduce-client-app-2.7.2.jar
(505 KB at 11732.7 KB/sec)
[INFO] Downloading: http://repo1.maven.org/maven2/org/apache/hadoop/hadoop-yarn-client/2.7.2/hadoop-yarn-client-2.7.2.jar
[INFO] Downloaded: http://repo1.maven.org/maven2/org/apache/hadoop/hadoop-mapreduce-client-common/2.7.2/hadoop-mapreduce-client-common-2.7.2.jar
(736 KB at 13133.4 KB/sec)
[INFO] Downloading: http://repo1.maven.org/maven2/org/apache/hadoop/hadoop-yarn-server-common/2.7.2/hadoop-yarn-server-common-2.7.2.jar
[INFO] Downloaded: http://repo1.maven.org/maven2/org/apache/hadoop/hadoop-yarn-client/2.7.2/hadoop-yarn-client-2.7.2.jar
(140 KB at 2079.0 KB/sec)
[INFO] Downloading: http://repo1.maven.org/maven2/org/apache/hadoop/hadoop-mapreduce-client-shuffle/2.7.2/hadoop-mapreduce-client-shuffle-2.7.2.jar
[INFO] Downloaded: http://repo1.maven.org/maven2/org/apache/hadoop/hadoop-yarn-server-common/2.7.2/hadoop-yarn-server-common-2.7.2.jar
(356 KB at 4682.1 KB/sec)
[INFO] Downloading: http://repo1.maven.org/maven2/org/apache/hadoop/hadoop-yarn-api/2.7.2/hadoop-yarn-api-2.7.2.jar
[INFO] Downloaded: http://repo1.maven.org/maven2/org/apache/hadoop/hadoop-mapreduce-client-shuffle/2.7.2/hadoop-mapreduce-client-shuffle-2.7.2.jar
(48 KB at 567.9 KB/sec)
[INFO] Downloading: http://repo1.maven.org/maven2/org/apache/hadoop/hadoop-mapreduce-client-core/2.7.2/hadoop-mapreduce-client-core-2.7.2.jar
[INFO] Downloaded: http://repo1.maven.org/maven2/org/fusesource/leveldbjni/leveldbjni-all/1.8/leveldbjni-all-1.8.jar
(1022 KB at 8958.2 KB/sec)
[INFO] Downloading: http://repo1.maven.org/maven2/org/apache/hadoop/hadoop-yarn-common/2.7.2/hadoop-yarn-common-2.7.2.jar
[INFO] Downloaded: http://repo1.maven.org/maven2/org/apache/hadoop/hadoop-mapreduce-client-core/2.7.2/hadoop-mapreduce-client-core-2.7.2.jar
(1496 KB at 12159.3 KB/sec)
[INFO] Downloading: http://repo1.maven.org/maven2/com/sun/jersey/jersey-client/1.9/jersey-client-1.9.jar
[INFO] Downloaded: http://repo1.maven.org/maven2/com/sun/jersey/jersey-client/1.9/jersey-client-1.9.jar
(128 KB at 897.2 KB/sec)
[INFO] Downloading: http://repo1.maven.org/maven2/org/apache/hadoop/hadoop-mapreduce-client-jobclient/2.7.2/hadoop-mapreduce-client-jobclient-2.7.2.jar
[INFO] Downloaded: http://repo1.maven.org/maven2/org/apache/hadoop/hadoop-yarn-api/2.7.2/hadoop-yarn-api-2.7.2.jar
(1969 KB at 12379.5 KB/sec)
[INFO] Downloaded: http://repo1.maven.org/maven2/org/apache/hadoop/hadoop-mapreduce-client-jobclient/2.7.2/hadoop-mapreduce-client-jobclient-2.7.2.jar
(38 KB at 234.7 KB/sec)
[INFO] Downloading: http://repo1.maven.org/maven2/org/xerial/snappy/snappy-java/1.1.2.6/snappy-java-1.1.2.6.jar
[INFO] Downloading: http://repo1.maven.org/maven2/com/github/luben/zstd-jni/1.3.2-2/zstd-jni-1.3.2-2.jar
[INFO] Downloaded: http://repo1.maven.org/maven2/io/netty/netty/3.6.2.Final/netty-3.6.2.Final.jar
(1172 KB at 7143.0 KB/sec)
[INFO] Downloading: http://repo1.maven.org/maven2/org/apache/zookeeper/zookeeper/3.4.7/zookeeper-3.4.7.jar
[INFO] Downloaded: http://repo1.maven.org/maven2/org/apache/hadoop/hadoop-yarn-common/2.7.2/hadoop-yarn-common-2.7.2.jar
(1615 KB at 8453.1 KB/sec)
[INFO] Downloading: http://repo1.maven.org/maven2/org/apache/commons/commons-lang3/3.5/commons-lang3-3.5.jar
[INFO] Downloaded: http://repo1.maven.org/maven2/org/xerial/snappy/snappy-java/1.1.2.6/snappy-java-1.1.2.6.jar
(1032 KB at 5056.0 KB/sec)
[INFO] Downloading: http://repo1.maven.org/maven2/org/roaringbitmap/RoaringBitmap/0.5.11/RoaringBitmap-0.5.11.jar
[INFO] Downloaded: http://repo1.maven.org/maven2/org/apache/commons/commons-lang3/3.5/commons-lang3-3.5.jar
(469 KB at 2082.8 KB/sec)
[INFO] Downloading: http://repo1.maven.org/maven2/io/netty/netty-all/4.0.42.Final/netty-all-4.0.42.Final.jar
[INFO] Downloaded: http://repo1.maven.org/maven2/com/github/luben/zstd-jni/1.3.2-2/zstd-jni-1.3.2-2.jar
(2279 KB at 10037.5 KB/sec)
[INFO] Downloading: http://repo1.maven.org/maven2/org/lz4/lz4-java/1.4.0/lz4-java-1.4.0.jar
[INFO] Downloaded: http://repo1.maven.org/maven2/org/roaringbitmap/RoaringBitmap/0.5.11/RoaringBitmap-0.5.11.jar
(198 KB at 864.9 KB/sec)
[INFO] Downloaded: http://repo1.maven.org/maven2/org/apache/zookeeper/zookeeper/3.4.7/zookeeper-3.4.7.jar
(786 KB at 3166.2 KB/sec)
[INFO] Downloaded: http://repo1.maven.org/maven2/org/lz4/lz4-java/1.4.0/lz4-java-1.4.0.jar
(362 KB at 1445.8 KB/sec)
[INFO] Downloaded: http://repo1.maven.org/maven2/org/apache/hadoop/hadoop-hdfs/2.7.2/hadoop-hdfs-2.7.2.jar
(8075 KB at 27747.7 KB/sec)
[INFO] Downloaded: http://repo1.maven.org/maven2/io/netty/netty-all/4.0.42.Final/netty-all-4.0.42.Final.jar
(2261 KB at 7741.7 KB/sec)
[INFO] Downloading: http://repository.apache.org/snapshots/org/apache/carbondata/carbondata-format/1.6.0-SNAPSHOT/carbondata-format-1.6.0-SNAPSHOT.jar
[INFO] ------------------------------------------------------------------------
[INFO] Reactor Summary:
[INFO] 
[INFO] Apache CarbonData :: Parent ........................ SUCCESS [ 18.597 s]
[INFO] Apache CarbonData :: Common ........................ SUCCESS [ 17.863 s]
[INFO] Apache CarbonData :: Core .......................... FAILURE [  2.128 s]
[INFO] Apache CarbonData :: Processing .................... SKIPPED
[INFO] Apache CarbonData :: Hadoop ........................ SKIPPED
[INFO] Apache CarbonData :: Streaming ..................... SKIPPED
[INFO] Apache CarbonData :: Store SDK ..................... SKIPPED
[INFO] Apache CarbonData :: Spark Datasource .............. SKIPPED
[INFO] Apache CarbonData :: Spark Common .................. SKIPPED
[INFO] Apache CarbonData :: Search ........................ SKIPPED
[INFO] Apache CarbonData :: Lucene Index DataMap .......... SKIPPED
[INFO] Apache CarbonData :: Bloom Index DataMap ........... SKIPPED
[INFO] Apache CarbonData :: Spark2 ........................ SKIPPED
[INFO] Apache CarbonData :: Spark Common Test ............. SKIPPED
[INFO] Apache CarbonData :: DataMap Examples .............. SKIPPED
[INFO] Apache CarbonData :: Assembly ...................... SKIPPED
[INFO] Apache CarbonData :: CLI ........................... SKIPPED
[INFO] Apache CarbonData :: Hive .......................... SKIPPED
[INFO] Apache CarbonData :: presto ........................ SKIPPED
[INFO] Apache CarbonData :: Spark2 Examples ............... SKIPPED
[INFO] ------------------------------------------------------------------------
[INFO] BUILD FAILURE
[INFO] ------------------------------------------------------------------------
[INFO] Total time: 01:05 min
[INFO] Finished at: 2018-10-20T13:32:34+00:00
[INFO] Final Memory: 64M/1156M
[INFO] ------------------------------------------------------------------------
[ERROR] Failed to execute goal on project carbondata-core: Could not resolve dependencies
for project org.apache.carbondata:carbondata-core:jar:1.6.0-SNAPSHOT: Could not find artifact
org.apache.carbondata:carbondata-format:jar:1.6.0-SNAPSHOT in central (http://repo1.maven.org/maven2)
-> [Help 1]
org.apache.maven.lifecycle.LifecycleExecutionException: Failed to execute goal on project
carbondata-core: Could not resolve dependencies for project org.apache.carbondata:carbondata-core:jar:1.6.0-SNAPSHOT:
Could not find artifact org.apache.carbondata:carbondata-format:jar:1.6.0-SNAPSHOT in central
(http://repo1.maven.org/maven2)
	at org.apache.maven.lifecycle.internal.LifecycleDependencyResolver.getDependencies(LifecycleDependencyResolver.java:221)
	at org.apache.maven.lifecycle.internal.LifecycleDependencyResolver.resolveProjectDependencies(LifecycleDependencyResolver.java:127)
	at org.apache.maven.lifecycle.internal.MojoExecutor.ensureDependenciesAreResolved(MojoExecutor.java:245)
	at org.apache.maven.lifecycle.internal.MojoExecutor.execute(MojoExecutor.java:199)
	at org.apache.maven.lifecycle.internal.MojoExecutor.execute(MojoExecutor.java:153)
	at org.apache.maven.lifecycle.internal.MojoExecutor.execute(MojoExecutor.java:145)
	at org.apache.maven.lifecycle.internal.LifecycleModuleBuilder.buildProject(LifecycleModuleBuilder.java:116)
	at org.apache.maven.lifecycle.internal.LifecycleModuleBuilder.buildProject(LifecycleModuleBuilder.java:80)
	at org.apache.maven.lifecycle.internal.builder.singlethreaded.SingleThreadedBuilder.build(SingleThreadedBuilder.java:51)
	at org.apache.maven.lifecycle.internal.LifecycleStarter.execute(LifecycleStarter.java:128)
	at org.apache.maven.DefaultMaven.doExecute(DefaultMaven.java:307)
	at org.apache.maven.DefaultMaven.doExecute(DefaultMaven.java:193)
	at org.apache.maven.DefaultMaven.execute(DefaultMaven.java:106)
	at org.jvnet.hudson.maven3.launcher.Maven33Launcher.main(Maven33Launcher.java:129)
	at sun.reflect.NativeMethodAccessorImpl.invoke0(Native Method)
	at sun.reflect.NativeMethodAccessorImpl.invoke(NativeMethodAccessorImpl.java:62)
	at sun.reflect.DelegatingMethodAccessorImpl.invoke(DelegatingMethodAccessorImpl.java:43)
	at java.lang.reflect.Method.invoke(Method.java:498)
	at org.codehaus.plexus.classworlds.launcher.Launcher.launchStandard(Launcher.java:330)
	at org.codehaus.plexus.classworlds.launcher.Launcher.launch(Launcher.java:238)
	at jenkins.maven3.agent.Maven33Main.launch(Maven33Main.java:176)
	at sun.reflect.NativeMethodAccessorImpl.invoke0(Native Method)
	at sun.reflect.NativeMethodAccessorImpl.invoke(NativeMethodAccessorImpl.java:62)
	at sun.reflect.DelegatingMethodAccessorImpl.invoke(DelegatingMethodAccessorImpl.java:43)
	at java.lang.reflect.Method.invoke(Method.java:498)
	at hudson.maven.Maven3Builder.call(Maven3Builder.java:139)
	at hudson.maven.Maven3Builder.call(Maven3Builder.java:70)
	at hudson.remoting.UserRequest.perform(UserRequest.java:212)
	at hudson.remoting.UserRequest.perform(UserRequest.java:54)
	at hudson.remoting.Request$2.run(Request.java:369)
	at hudson.remoting.InterceptingExecutorService$1.call(InterceptingExecutorService.java:72)
	at java.util.concurrent.FutureTask.run(FutureTask.java:266)
	at java.util.concurrent.ThreadPoolExecutor.runWorker(ThreadPoolExecutor.java:1149)
	at java.util.concurrent.ThreadPoolExecutor$Worker.run(ThreadPoolExecutor.java:624)
	at java.lang.Thread.run(Thread.java:748)
Caused by: org.apache.maven.project.DependencyResolutionException: Could not resolve dependencies
for project org.apache.carbondata:carbondata-core:jar:1.6.0-SNAPSHOT: Could not find artifact
org.apache.carbondata:carbondata-format:jar:1.6.0-SNAPSHOT in central (http://repo1.maven.org/maven2)
	at org.apache.maven.project.DefaultProjectDependenciesResolver.resolve(DefaultProjectDependenciesResolver.java:211)
	at org.apache.maven.lifecycle.internal.LifecycleDependencyResolver.getDependencies(LifecycleDependencyResolver.java:195)
	... 34 more
Caused by: org.eclipse.aether.resolution.DependencyResolutionException: Could not find artifact
org.apache.carbondata:carbondata-format:jar:1.6.0-SNAPSHOT in central (http://repo1.maven.org/maven2)
	at org.eclipse.aether.internal.impl.DefaultRepositorySystem.resolveDependencies(DefaultRepositorySystem.java:384)
	at org.apache.maven.project.DefaultProjectDependenciesResolver.resolve(DefaultProjectDependenciesResolver.java:205)
	... 35 more
Caused by: org.eclipse.aether.resolution.ArtifactResolutionException: Could not find artifact
org.apache.carbondata:carbondata-format:jar:1.6.0-SNAPSHOT in central (http://repo1.maven.org/maven2)
	at org.eclipse.aether.internal.impl.DefaultArtifactResolver.resolve(DefaultArtifactResolver.java:444)
	at org.eclipse.aether.internal.impl.DefaultArtifactResolver.resolveArtifacts(DefaultArtifactResolver.java:246)
	at org.eclipse.aether.internal.impl.DefaultRepositorySystem.resolveDependencies(DefaultRepositorySystem.java:367)
	... 36 more
Caused by: org.eclipse.aether.transfer.ArtifactNotFoundException: Could not find artifact
org.apache.carbondata:carbondata-format:jar:1.6.0-SNAPSHOT in central (http://repo1.maven.org/maven2)
	at org.eclipse.aether.connector.basic.ArtifactTransportListener.transferFailed(ArtifactTransportListener.java:39)
	at org.eclipse.aether.connector.basic.BasicRepositoryConnector$TaskRunner.run(BasicRepositoryConnector.java:355)
	at org.eclipse.aether.util.concurrency.RunnableErrorForwarder$1.run(RunnableErrorForwarder.java:67)
	... 3 more
[ERROR] 
[ERROR] Re-run Maven using the -X switch to enable full debug logging.
[ERROR] 
[ERROR] For more information about the errors and possible solutions, please read the following
articles:
[ERROR] [Help 1] http://cwiki.apache.org/confluence/display/MAVEN/DependencyResolutionException
[ERROR] 
[ERROR] After correcting the problems, you can resume the build with the command
[ERROR]   mvn <goals> -rf :carbondata-core
[JENKINS] Archiving <https://builds.apache.org/job/carbondata-master-spark-2.1/ws/processing/pom.xml>
to org.apache.carbondata/carbondata-processing/1.6.0-SNAPSHOT/carbondata-processing-1.6.0-SNAPSHOT.pom
[JENKINS] Archiving <https://builds.apache.org/job/carbondata-master-spark-2.1/ws/datamap/examples/pom.xml>
to org.apache.carbondata/carbondata-datamap-examples/1.6.0-SNAPSHOT/carbondata-datamap-examples-1.6.0-SNAPSHOT.pom
[JENKINS] Archiving <https://builds.apache.org/job/carbondata-master-spark-2.1/ws/store/search/pom.xml>
to org.apache.carbondata/carbondata-search/1.6.0-SNAPSHOT/carbondata-search-1.6.0-SNAPSHOT.pom
[JENKINS] Archiving <https://builds.apache.org/job/carbondata-master-spark-2.1/ws/streaming/pom.xml>
to org.apache.carbondata/carbondata-streaming/1.6.0-SNAPSHOT/carbondata-streaming-1.6.0-SNAPSHOT.pom
[JENKINS] Archiving <https://builds.apache.org/job/carbondata-master-spark-2.1/ws/integration/spark-common/pom.xml>
to org.apache.carbondata/carbondata-spark-common/1.6.0-SNAPSHOT/carbondata-spark-common-1.6.0-SNAPSHOT.pom
[JENKINS] Archiving <https://builds.apache.org/job/carbondata-master-spark-2.1/ws/datamap/lucene/pom.xml>
to org.apache.carbondata/carbondata-lucene/1.6.0-SNAPSHOT/carbondata-lucene-1.6.0-SNAPSHOT.pom
[JENKINS] Archiving <https://builds.apache.org/job/carbondata-master-spark-2.1/ws/integration/hive/pom.xml>
to org.apache.carbondata/carbondata-hive/1.6.0-SNAPSHOT/carbondata-hive-1.6.0-SNAPSHOT.pom
[JENKINS] Archiving <https://builds.apache.org/job/carbondata-master-spark-2.1/ws/common/pom.xml>
to org.apache.carbondata/carbondata-common/1.6.0-SNAPSHOT/carbondata-common-1.6.0-SNAPSHOT.pom
[JENKINS] Archiving <https://builds.apache.org/job/carbondata-master-spark-2.1/ws/common/target/carbondata-common-1.6.0-SNAPSHOT.jar>
to org.apache.carbondata/carbondata-common/1.6.0-SNAPSHOT/carbondata-common-1.6.0-SNAPSHOT.jar
[JENKINS] Archiving <https://builds.apache.org/job/carbondata-master-spark-2.1/ws/examples/spark2/pom.xml>
to org.apache.carbondata/carbondata-examples-spark2/1.6.0-SNAPSHOT/carbondata-examples-spark2-1.6.0-SNAPSHOT.pom
[JENKINS] Archiving <https://builds.apache.org/job/carbondata-master-spark-2.1/ws/integration/spark2/pom.xml>
to org.apache.carbondata/carbondata-spark2/1.6.0-SNAPSHOT/carbondata-spark2-1.6.0-SNAPSHOT.pom
[JENKINS] Archiving <https://builds.apache.org/job/carbondata-master-spark-2.1/ws/tools/cli/pom.xml>
to org.apache.carbondata/carbondata-cli/1.6.0-SNAPSHOT/carbondata-cli-1.6.0-SNAPSHOT.pom
[JENKINS] Archiving <https://builds.apache.org/job/carbondata-master-spark-2.1/ws/datamap/bloom/pom.xml>
to org.apache.carbondata/carbondata-bloom/1.6.0-SNAPSHOT/carbondata-bloom-1.6.0-SNAPSHOT.pom
[JENKINS] Archiving <https://builds.apache.org/job/carbondata-master-spark-2.1/ws/assembly/pom.xml>
to org.apache.carbondata/carbondata-assembly/1.6.0-SNAPSHOT/carbondata-assembly-1.6.0-SNAPSHOT.pom
[JENKINS] Archiving <https://builds.apache.org/job/carbondata-master-spark-2.1/ws/pom.xml>
to org.apache.carbondata/carbondata-parent/1.6.0-SNAPSHOT/carbondata-parent-1.6.0-SNAPSHOT.pom
[JENKINS] Archiving <https://builds.apache.org/job/carbondata-master-spark-2.1/ws/core/pom.xml>
to org.apache.carbondata/carbondata-core/1.6.0-SNAPSHOT/carbondata-core-1.6.0-SNAPSHOT.pom
[JENKINS] Archiving <https://builds.apache.org/job/carbondata-master-spark-2.1/ws/hadoop/pom.xml>
to org.apache.carbondata/carbondata-hadoop/1.6.0-SNAPSHOT/carbondata-hadoop-1.6.0-SNAPSHOT.pom
[JENKINS] Archiving <https://builds.apache.org/job/carbondata-master-spark-2.1/ws/integration/spark-datasource/pom.xml>
to org.apache.carbondata/carbondata-spark-datasource/1.6.0-SNAPSHOT/carbondata-spark-datasource-1.6.0-SNAPSHOT.pom
[JENKINS] Archiving <https://builds.apache.org/job/carbondata-master-spark-2.1/ws/integration/presto/pom.xml>
to org.apache.carbondata/carbondata-presto/1.6.0-SNAPSHOT/carbondata-presto-1.6.0-SNAPSHOT.pom
[JENKINS] Archiving <https://builds.apache.org/job/carbondata-master-spark-2.1/ws/integration/spark-common-test/pom.xml>
to org.apache.carbondata/carbondata-spark-common-test/1.6.0-SNAPSHOT/carbondata-spark-common-test-1.6.0-SNAPSHOT.pom
[JENKINS] Archiving <https://builds.apache.org/job/carbondata-master-spark-2.1/ws/store/sdk/pom.xml>
to org.apache.carbondata/carbondata-store-sdk/1.6.0-SNAPSHOT/carbondata-store-sdk-1.6.0-SNAPSHOT.pom
Not sending mail to unregistered user 441586683@qq.com
Sending e-mails to: commits@carbondata.apache.org
channel stopped
Not sending mail to unregistered user 441586683@qq.com

Mime
View raw message