carbondata-commits mailing list archives

Site index · List index
Message view « Date » · « Thread »
Top « Date » · « Thread »
From Apache Jenkins Server <jenk...@builds.apache.org>
Subject Build failed in Jenkins: carbondata-master-spark-2.1 #2948
Date Wed, 26 Sep 2018 09:36:30 GMT
See <https://builds.apache.org/job/carbondata-master-spark-2.1/2948/display/redirect>

------------------------------------------
[...truncated 5.77 MB...]
[WARNING]   - 45 more...
[WARNING] maven-shade-plugin has detected that some class files are
[WARNING] present in two or more JARs. When this happens, only one
[WARNING] single version of the class is copied to the uber jar.
[WARNING] Usually this is not harmful and you can skip these warnings,
[WARNING] otherwise try to manually exclude artifacts based on
[WARNING] mvn dependency:tree -Ddetail=true and the above output.
[WARNING] See http://maven.apache.org/plugins/maven-shade-plugin/
[INFO] 
[INFO] --- jacoco-maven-plugin:0.7.9:prepare-agent-integration (default-prepare-agent-integration)
@ carbondata-assembly ---
[INFO] argLine set to -javaagent:/home/jenkins/jenkins-slave/maven-repositories/0/org/jacoco/org.jacoco.agent/0.7.9/org.jacoco.agent-0.7.9-runtime.jar=destfile=<https://builds.apache.org/job/carbondata-master-spark-2.1/ws/assembly/target/jacoco-it.exec>
[INFO] 
[INFO] --- maven-checkstyle-plugin:2.17:check (default) @ carbondata-assembly ---
[INFO] Starting audit...
Audit done.
[INFO] 
[INFO] --- scalastyle-maven-plugin:0.8.0:check (default) @ carbondata-assembly ---
[WARNING] sourceDirectory is not specified or does not exist value=<https://builds.apache.org/job/carbondata-master-spark-2.1/ws/assembly/src/main/scala>
Saving to outputFile=<https://builds.apache.org/job/carbondata-master-spark-2.1/ws/assembly/target/scalastyle-output.xml>
Processed 0 file(s)
Found 0 errors
Found 0 warnings
Found 0 infos
Finished in 1 ms
[INFO] 
[INFO] --- jacoco-maven-plugin:0.7.9:report (default-report) @ carbondata-assembly ---
[INFO] Skipping JaCoCo execution due to missing execution data file.
[INFO] 
[INFO] --- jacoco-maven-plugin:0.7.9:report-integration (default-report-integration) @ carbondata-assembly
---
[INFO] Skipping JaCoCo execution due to missing execution data file.
[INFO] 
[INFO] --- jacoco-maven-plugin:0.7.9:check (default-check) @ carbondata-assembly ---
[INFO] Skipping JaCoCo execution due to missing execution data <https://builds.apache.org/job/carbondata-master-spark-2.1/ws/assembly/target/jacoco.exec>
[INFO] 
[INFO] --- maven-install-plugin:2.5.2:install (default-install) @ carbondata-assembly ---
[INFO] Skipping artifact installation
[INFO]                                                                         
[INFO] ------------------------------------------------------------------------
[INFO] Building Apache CarbonData :: CLI 1.5.0-SNAPSHOT
[INFO] ------------------------------------------------------------------------
[INFO] 
[INFO] --- maven-clean-plugin:2.5:clean (default-clean) @ carbondata-cli ---
[INFO] 
[INFO] --- jacoco-maven-plugin:0.7.9:prepare-agent (default-prepare-agent) @ carbondata-cli
---
[INFO] argLine set to -javaagent:/home/jenkins/jenkins-slave/maven-repositories/0/org/jacoco/org.jacoco.agent/0.7.9/org.jacoco.agent-0.7.9-runtime.jar=destfile=<https://builds.apache.org/job/carbondata-master-spark-2.1/ws/tools/cli/target/jacoco.exec>
[INFO] 
[INFO] --- maven-remote-resources-plugin:1.5:process (default) @ carbondata-cli ---
[INFO] artifact joda-time:joda-time: checking for updates from central
[INFO] artifact joda-time:joda-time: checking for updates from apache.snapshots.https
[INFO] artifact joda-time:joda-time: checking for updates from repository.jboss.org
[INFO] 
[INFO] --- maven-resources-plugin:2.7:resources (default-resources) @ carbondata-cli ---
[INFO] Using 'UTF-8' encoding to copy filtered resources.
[INFO] skip non existing resourceDirectory <https://builds.apache.org/job/carbondata-master-spark-2.1/ws/tools/cli/src/main/resources>
[INFO] Copying 3 resources
[INFO] 
[INFO] --- maven-compiler-plugin:3.2:compile (default-compile) @ carbondata-cli ---
[INFO] Changes detected - recompiling the module!
[INFO] Compiling 8 source files to <https://builds.apache.org/job/carbondata-master-spark-2.1/ws/tools/cli/target/classes>
[INFO] 
[INFO] >>> findbugs-maven-plugin:3.0.4:check (analyze-compile) > :findbugs @ carbondata-cli
>>>
[INFO] 
[INFO] --- findbugs-maven-plugin:3.0.4:findbugs (findbugs) @ carbondata-cli ---
[INFO] Fork Value is true
[INFO] Done FindBugs Analysis....
[INFO] 
[INFO] <<< findbugs-maven-plugin:3.0.4:check (analyze-compile) < :findbugs @ carbondata-cli
<<<
[INFO] 
[INFO] --- findbugs-maven-plugin:3.0.4:check (analyze-compile) @ carbondata-cli ---
[INFO] BugInstance size is 0
[INFO] Error size is 0
[INFO] No errors/warnings found
[INFO] 
[INFO] --- maven-resources-plugin:2.7:testResources (default-testResources) @ carbondata-cli
---
[INFO] Using 'UTF-8' encoding to copy filtered resources.
[INFO] skip non existing resourceDirectory <https://builds.apache.org/job/carbondata-master-spark-2.1/ws/tools/cli/src/test/resources>
[INFO] Copying 3 resources
[INFO] 
[INFO] --- maven-compiler-plugin:3.2:testCompile (default-testCompile) @ carbondata-cli ---
[INFO] Changes detected - recompiling the module!
[INFO] Compiling 1 source file to <https://builds.apache.org/job/carbondata-master-spark-2.1/ws/tools/cli/target/test-classes>
[INFO] -------------------------------------------------------------
[ERROR] COMPILATION ERROR : 
[INFO] -------------------------------------------------------------
[ERROR] <https://builds.apache.org/job/carbondata-master-spark-2.1/ws/tools/cli/src/test/java/org/apache/carbondata/tool/CarbonCliTest.java>:[48,13]
no suitable method found for writeFilesAndVerify(int,org.apache.carbondata.sdk.file.Schema,java.lang.String,java.lang.String[],boolean,int,int,boolean)
    method org.apache.carbondata.sdk.file.TestUtil.writeFilesAndVerify(org.apache.carbondata.sdk.file.Schema,java.lang.String,java.lang.String[])
is not applicable
      (actual and formal argument lists differ in length)
    method org.apache.carbondata.sdk.file.TestUtil.writeFilesAndVerify(int,org.apache.carbondata.sdk.file.Schema,java.lang.String)
is not applicable
      (actual and formal argument lists differ in length)
    method org.apache.carbondata.sdk.file.TestUtil.writeFilesAndVerify(org.apache.carbondata.sdk.file.Schema,java.lang.String)
is not applicable
      (actual and formal argument lists differ in length)
    method org.apache.carbondata.sdk.file.TestUtil.writeFilesAndVerify(int,org.apache.carbondata.sdk.file.Schema,java.lang.String,boolean,boolean)
is not applicable
      (actual and formal argument lists differ in length)
    method org.apache.carbondata.sdk.file.TestUtil.writeFilesAndVerify(int,org.apache.carbondata.sdk.file.Schema,java.lang.String,java.lang.String[],int,int)
is not applicable
      (actual and formal argument lists differ in length)
[ERROR] <https://builds.apache.org/job/carbondata-master-spark-2.1/ws/tools/cli/src/test/java/org/apache/carbondata/tool/CarbonCliTest.java>:[50,13]
no suitable method found for writeFilesAndVerify(int,org.apache.carbondata.sdk.file.Schema,java.lang.String,java.lang.String[],boolean,int,int,boolean)
    method org.apache.carbondata.sdk.file.TestUtil.writeFilesAndVerify(org.apache.carbondata.sdk.file.Schema,java.lang.String,java.lang.String[])
is not applicable
      (actual and formal argument lists differ in length)
    method org.apache.carbondata.sdk.file.TestUtil.writeFilesAndVerify(int,org.apache.carbondata.sdk.file.Schema,java.lang.String)
is not applicable
      (actual and formal argument lists differ in length)
    method org.apache.carbondata.sdk.file.TestUtil.writeFilesAndVerify(org.apache.carbondata.sdk.file.Schema,java.lang.String)
is not applicable
      (actual and formal argument lists differ in length)
    method org.apache.carbondata.sdk.file.TestUtil.writeFilesAndVerify(int,org.apache.carbondata.sdk.file.Schema,java.lang.String,boolean,boolean)
is not applicable
      (actual and formal argument lists differ in length)
    method org.apache.carbondata.sdk.file.TestUtil.writeFilesAndVerify(int,org.apache.carbondata.sdk.file.Schema,java.lang.String,java.lang.String[],int,int)
is not applicable
      (actual and formal argument lists differ in length)
[INFO] 2 errors 
[INFO] -------------------------------------------------------------
[INFO] ------------------------------------------------------------------------
[INFO] Reactor Summary:
[INFO] 
[INFO] Apache CarbonData :: Parent ........................ SUCCESS [ 11.371 s]
[INFO] Apache CarbonData :: Common ........................ SUCCESS [ 15.563 s]
[INFO] Apache CarbonData :: Core .......................... SUCCESS [02:43 min]
[INFO] Apache CarbonData :: Processing .................... SUCCESS [ 31.166 s]
[INFO] Apache CarbonData :: Hadoop ........................ SUCCESS [ 24.414 s]
[INFO] Apache CarbonData :: Streaming ..................... SUCCESS [ 31.865 s]
[INFO] Apache CarbonData :: Store SDK ..................... SUCCESS [ 49.148 s]
[INFO] Apache CarbonData :: Spark Datasource .............. SUCCESS [01:10 min]
[INFO] Apache CarbonData :: Spark Common .................. SUCCESS [01:18 min]
[INFO] Apache CarbonData :: Search ........................ SUCCESS [ 32.625 s]
[INFO] Apache CarbonData :: Lucene Index DataMap .......... SUCCESS [ 16.759 s]
[INFO] Apache CarbonData :: Bloom Index DataMap ........... SUCCESS [ 14.848 s]
[INFO] Apache CarbonData :: Spark2 ........................ SUCCESS [18:55 min]
[INFO] Apache CarbonData :: Spark Common Test ............. SUCCESS [  01:16 h]
[INFO] Apache CarbonData :: DataMap Examples .............. SUCCESS [ 13.953 s]
[INFO] Apache CarbonData :: Assembly ...................... SUCCESS [ 18.260 s]
[INFO] Apache CarbonData :: CLI ........................... FAILURE [ 10.373 s]
[INFO] Apache CarbonData :: Hive .......................... SKIPPED
[INFO] Apache CarbonData :: presto ........................ SKIPPED
[INFO] Apache CarbonData :: Spark2 Examples ............... SKIPPED
[INFO] ------------------------------------------------------------------------
[INFO] BUILD FAILURE
[INFO] ------------------------------------------------------------------------
[INFO] Total time: 01:46 h
[INFO] Finished at: 2018-09-26T09:36:02+00:00
[INFO] Final Memory: 128M/1453M
[INFO] ------------------------------------------------------------------------
Waiting for Jenkins to finish collecting data
[ERROR] Failed to execute goal org.apache.maven.plugins:maven-compiler-plugin:3.2:testCompile
(default-testCompile) on project carbondata-cli: Compilation failure: Compilation failure:
[ERROR] <https://builds.apache.org/job/carbondata-master-spark-2.1/ws/tools/cli/src/test/java/org/apache/carbondata/tool/CarbonCliTest.java>:[48,13]
no suitable method found for writeFilesAndVerify(int,org.apache.carbondata.sdk.file.Schema,java.lang.String,java.lang.String[],boolean,int,int,boolean)
[ERROR] method org.apache.carbondata.sdk.file.TestUtil.writeFilesAndVerify(org.apache.carbondata.sdk.file.Schema,java.lang.String,java.lang.String[])
is not applicable
[ERROR] (actual and formal argument lists differ in length)
[ERROR] method org.apache.carbondata.sdk.file.TestUtil.writeFilesAndVerify(int,org.apache.carbondata.sdk.file.Schema,java.lang.String)
is not applicable
[ERROR] (actual and formal argument lists differ in length)
[ERROR] method org.apache.carbondata.sdk.file.TestUtil.writeFilesAndVerify(org.apache.carbondata.sdk.file.Schema,java.lang.String)
is not applicable
[ERROR] (actual and formal argument lists differ in length)
[ERROR] method org.apache.carbondata.sdk.file.TestUtil.writeFilesAndVerify(int,org.apache.carbondata.sdk.file.Schema,java.lang.String,boolean,boolean)
is not applicable
[ERROR] (actual and formal argument lists differ in length)
[ERROR] method org.apache.carbondata.sdk.file.TestUtil.writeFilesAndVerify(int,org.apache.carbondata.sdk.file.Schema,java.lang.String,java.lang.String[],int,int)
is not applicable
[ERROR] (actual and formal argument lists differ in length)
[ERROR] <https://builds.apache.org/job/carbondata-master-spark-2.1/ws/tools/cli/src/test/java/org/apache/carbondata/tool/CarbonCliTest.java>:[50,13]
no suitable method found for writeFilesAndVerify(int,org.apache.carbondata.sdk.file.Schema,java.lang.String,java.lang.String[],boolean,int,int,boolean)
[ERROR] method org.apache.carbondata.sdk.file.TestUtil.writeFilesAndVerify(org.apache.carbondata.sdk.file.Schema,java.lang.String,java.lang.String[])
is not applicable
[ERROR] (actual and formal argument lists differ in length)
[ERROR] method org.apache.carbondata.sdk.file.TestUtil.writeFilesAndVerify(int,org.apache.carbondata.sdk.file.Schema,java.lang.String)
is not applicable
[ERROR] (actual and formal argument lists differ in length)
[ERROR] method org.apache.carbondata.sdk.file.TestUtil.writeFilesAndVerify(org.apache.carbondata.sdk.file.Schema,java.lang.String)
is not applicable
[ERROR] (actual and formal argument lists differ in length)
[ERROR] method org.apache.carbondata.sdk.file.TestUtil.writeFilesAndVerify(int,org.apache.carbondata.sdk.file.Schema,java.lang.String,boolean,boolean)
is not applicable
[ERROR] (actual and formal argument lists differ in length)
[ERROR] method org.apache.carbondata.sdk.file.TestUtil.writeFilesAndVerify(int,org.apache.carbondata.sdk.file.Schema,java.lang.String,java.lang.String[],int,int)
is not applicable
[ERROR] (actual and formal argument lists differ in length)
[ERROR] -> [Help 1]
org.apache.maven.lifecycle.LifecycleExecutionException: Failed to execute goal org.apache.maven.plugins:maven-compiler-plugin:3.2:testCompile
(default-testCompile) on project carbondata-cli: Compilation failure
	at org.apache.maven.lifecycle.internal.MojoExecutor.execute(MojoExecutor.java:212)
	at org.apache.maven.lifecycle.internal.MojoExecutor.execute(MojoExecutor.java:153)
	at org.apache.maven.lifecycle.internal.MojoExecutor.execute(MojoExecutor.java:145)
	at org.apache.maven.lifecycle.internal.LifecycleModuleBuilder.buildProject(LifecycleModuleBuilder.java:116)
	at org.apache.maven.lifecycle.internal.LifecycleModuleBuilder.buildProject(LifecycleModuleBuilder.java:80)
	at org.apache.maven.lifecycle.internal.builder.singlethreaded.SingleThreadedBuilder.build(SingleThreadedBuilder.java:51)
	at org.apache.maven.lifecycle.internal.LifecycleStarter.execute(LifecycleStarter.java:128)
	at org.apache.maven.DefaultMaven.doExecute(DefaultMaven.java:307)
	at org.apache.maven.DefaultMaven.doExecute(DefaultMaven.java:193)
	at org.apache.maven.DefaultMaven.execute(DefaultMaven.java:106)
	at org.jvnet.hudson.maven3.launcher.Maven33Launcher.main(Maven33Launcher.java:129)
	at sun.reflect.NativeMethodAccessorImpl.invoke0(Native Method)
	at sun.reflect.NativeMethodAccessorImpl.invoke(NativeMethodAccessorImpl.java:62)
	at sun.reflect.DelegatingMethodAccessorImpl.invoke(DelegatingMethodAccessorImpl.java:43)
	at java.lang.reflect.Method.invoke(Method.java:498)
	at org.codehaus.plexus.classworlds.launcher.Launcher.launchStandard(Launcher.java:330)
	at org.codehaus.plexus.classworlds.launcher.Launcher.launch(Launcher.java:238)
	at jenkins.maven3.agent.Maven33Main.launch(Maven33Main.java:176)
	at sun.reflect.NativeMethodAccessorImpl.invoke0(Native Method)
	at sun.reflect.NativeMethodAccessorImpl.invoke(NativeMethodAccessorImpl.java:62)
	at sun.reflect.DelegatingMethodAccessorImpl.invoke(DelegatingMethodAccessorImpl.java:43)
	at java.lang.reflect.Method.invoke(Method.java:498)
	at hudson.maven.Maven3Builder.call(Maven3Builder.java:139)
	at hudson.maven.Maven3Builder.call(Maven3Builder.java:70)
	at hudson.remoting.UserRequest.perform(UserRequest.java:212)
	at hudson.remoting.UserRequest.perform(UserRequest.java:54)
	at hudson.remoting.Request$2.run(Request.java:369)
	at hudson.remoting.InterceptingExecutorService$1.call(InterceptingExecutorService.java:72)
	at java.util.concurrent.FutureTask.run(FutureTask.java:266)
	at java.util.concurrent.ThreadPoolExecutor.runWorker(ThreadPoolExecutor.java:1149)
	at java.util.concurrent.ThreadPoolExecutor$Worker.run(ThreadPoolExecutor.java:624)
	at java.lang.Thread.run(Thread.java:748)
Caused by: org.apache.maven.plugin.compiler.CompilationFailureException: Compilation failure
	at org.apache.maven.plugin.compiler.AbstractCompilerMojo.execute(AbstractCompilerMojo.java:909)
	at org.apache.maven.plugin.compiler.TestCompilerMojo.execute(TestCompilerMojo.java:153)
	at org.apache.maven.plugin.DefaultBuildPluginManager.executeMojo(DefaultBuildPluginManager.java:134)
	at org.apache.maven.lifecycle.internal.MojoExecutor.execute(MojoExecutor.java:207)
	... 31 more
[ERROR] 
[ERROR] Re-run Maven using the -X switch to enable full debug logging.
[ERROR] 
[ERROR] For more information about the errors and possible solutions, please read the following
articles:
[ERROR] [Help 1] http://cwiki.apache.org/confluence/display/MAVEN/MojoFailureException
[ERROR] 
[ERROR] After correcting the problems, you can resume the build with the command
[ERROR]   mvn <goals> -rf :carbondata-cli
[JENKINS] Archiving <https://builds.apache.org/job/carbondata-master-spark-2.1/ws/processing/pom.xml>
to org.apache.carbondata/carbondata-processing/1.5.0-SNAPSHOT/carbondata-processing-1.5.0-SNAPSHOT.pom
[JENKINS] Archiving <https://builds.apache.org/job/carbondata-master-spark-2.1/ws/processing/target/carbondata-processing-1.5.0-SNAPSHOT.jar>
to org.apache.carbondata/carbondata-processing/1.5.0-SNAPSHOT/carbondata-processing-1.5.0-SNAPSHOT.jar
[JENKINS] Archiving <https://builds.apache.org/job/carbondata-master-spark-2.1/ws/datamap/examples/pom.xml>
to org.apache.carbondata/carbondata-datamap-examples/1.5.0-SNAPSHOT/carbondata-datamap-examples-1.5.0-SNAPSHOT.pom
[JENKINS] Archiving <https://builds.apache.org/job/carbondata-master-spark-2.1/ws/datamap/examples/target/carbondata-datamap-examples-1.5.0-SNAPSHOT.jar>
to org.apache.carbondata/carbondata-datamap-examples/1.5.0-SNAPSHOT/carbondata-datamap-examples-1.5.0-SNAPSHOT.jar
[JENKINS] Archiving <https://builds.apache.org/job/carbondata-master-spark-2.1/ws/store/search/pom.xml>
to org.apache.carbondata/carbondata-search/1.5.0-SNAPSHOT/carbondata-search-1.5.0-SNAPSHOT.pom
[JENKINS] Archiving <https://builds.apache.org/job/carbondata-master-spark-2.1/ws/store/search/target/carbondata-search-1.5.0-SNAPSHOT.jar>
to org.apache.carbondata/carbondata-search/1.5.0-SNAPSHOT/carbondata-search-1.5.0-SNAPSHOT.jar
[JENKINS] Archiving <https://builds.apache.org/job/carbondata-master-spark-2.1/ws/streaming/pom.xml>
to org.apache.carbondata/carbondata-streaming/1.5.0-SNAPSHOT/carbondata-streaming-1.5.0-SNAPSHOT.pom
[JENKINS] Archiving <https://builds.apache.org/job/carbondata-master-spark-2.1/ws/streaming/target/carbondata-streaming-1.5.0-SNAPSHOT.jar>
to org.apache.carbondata/carbondata-streaming/1.5.0-SNAPSHOT/carbondata-streaming-1.5.0-SNAPSHOT.jar
[JENKINS] Archiving <https://builds.apache.org/job/carbondata-master-spark-2.1/ws/integration/spark-common/pom.xml>
to org.apache.carbondata/carbondata-spark-common/1.5.0-SNAPSHOT/carbondata-spark-common-1.5.0-SNAPSHOT.pom
[JENKINS] Archiving <https://builds.apache.org/job/carbondata-master-spark-2.1/ws/integration/spark-common/target/carbondata-spark-common-1.5.0-SNAPSHOT.jar>
to org.apache.carbondata/carbondata-spark-common/1.5.0-SNAPSHOT/carbondata-spark-common-1.5.0-SNAPSHOT.jar
[JENKINS] Archiving <https://builds.apache.org/job/carbondata-master-spark-2.1/ws/datamap/lucene/pom.xml>
to org.apache.carbondata/carbondata-lucene/1.5.0-SNAPSHOT/carbondata-lucene-1.5.0-SNAPSHOT.pom
[JENKINS] Archiving <https://builds.apache.org/job/carbondata-master-spark-2.1/ws/datamap/lucene/target/carbondata-lucene-1.5.0-SNAPSHOT.jar>
to org.apache.carbondata/carbondata-lucene/1.5.0-SNAPSHOT/carbondata-lucene-1.5.0-SNAPSHOT.jar
[JENKINS] Archiving <https://builds.apache.org/job/carbondata-master-spark-2.1/ws/integration/hive/pom.xml>
to org.apache.carbondata/carbondata-hive/1.5.0-SNAPSHOT/carbondata-hive-1.5.0-SNAPSHOT.pom
[JENKINS] Archiving <https://builds.apache.org/job/carbondata-master-spark-2.1/ws/common/pom.xml>
to org.apache.carbondata/carbondata-common/1.5.0-SNAPSHOT/carbondata-common-1.5.0-SNAPSHOT.pom
[JENKINS] Archiving <https://builds.apache.org/job/carbondata-master-spark-2.1/ws/common/target/carbondata-common-1.5.0-SNAPSHOT.jar>
to org.apache.carbondata/carbondata-common/1.5.0-SNAPSHOT/carbondata-common-1.5.0-SNAPSHOT.jar
[JENKINS] Archiving <https://builds.apache.org/job/carbondata-master-spark-2.1/ws/examples/spark2/pom.xml>
to org.apache.carbondata/carbondata-examples-spark2/1.5.0-SNAPSHOT/carbondata-examples-spark2-1.5.0-SNAPSHOT.pom
[JENKINS] Archiving <https://builds.apache.org/job/carbondata-master-spark-2.1/ws/integration/spark2/pom.xml>
to org.apache.carbondata/carbondata-spark2/1.5.0-SNAPSHOT/carbondata-spark2-1.5.0-SNAPSHOT.pom
[JENKINS] Archiving <https://builds.apache.org/job/carbondata-master-spark-2.1/ws/integration/spark2/target/carbondata-spark2-1.5.0-SNAPSHOT.jar>
to org.apache.carbondata/carbondata-spark2/1.5.0-SNAPSHOT/carbondata-spark2-1.5.0-SNAPSHOT.jar
[JENKINS] Archiving <https://builds.apache.org/job/carbondata-master-spark-2.1/ws/tools/cli/pom.xml>
to org.apache.carbondata/carbondata-cli/1.5.0-SNAPSHOT/carbondata-cli-1.5.0-SNAPSHOT.pom
[Fast Archiver] No prior successful build to compare, so performing full copy of artifacts
[JENKINS] Archiving <https://builds.apache.org/job/carbondata-master-spark-2.1/ws/datamap/bloom/pom.xml>
to org.apache.carbondata/carbondata-bloom/1.5.0-SNAPSHOT/carbondata-bloom-1.5.0-SNAPSHOT.pom
[JENKINS] Archiving <https://builds.apache.org/job/carbondata-master-spark-2.1/ws/datamap/bloom/target/carbondata-bloom-1.5.0-SNAPSHOT.jar>
to org.apache.carbondata/carbondata-bloom/1.5.0-SNAPSHOT/carbondata-bloom-1.5.0-SNAPSHOT.jar
[JENKINS] Archiving <https://builds.apache.org/job/carbondata-master-spark-2.1/ws/assembly/pom.xml>
to org.apache.carbondata/carbondata-assembly/1.5.0-SNAPSHOT/carbondata-assembly-1.5.0-SNAPSHOT.pom
[JENKINS] Archiving <https://builds.apache.org/job/carbondata-master-spark-2.1/ws/pom.xml>
to org.apache.carbondata/carbondata-parent/1.5.0-SNAPSHOT/carbondata-parent-1.5.0-SNAPSHOT.pom
[JENKINS] Archiving <https://builds.apache.org/job/carbondata-master-spark-2.1/ws/core/pom.xml>
to org.apache.carbondata/carbondata-core/1.5.0-SNAPSHOT/carbondata-core-1.5.0-SNAPSHOT.pom
[JENKINS] Archiving <https://builds.apache.org/job/carbondata-master-spark-2.1/ws/core/target/carbondata-core-1.5.0-SNAPSHOT.jar>
to org.apache.carbondata/carbondata-core/1.5.0-SNAPSHOT/carbondata-core-1.5.0-SNAPSHOT.jar
[JENKINS] Archiving <https://builds.apache.org/job/carbondata-master-spark-2.1/ws/hadoop/pom.xml>
to org.apache.carbondata/carbondata-hadoop/1.5.0-SNAPSHOT/carbondata-hadoop-1.5.0-SNAPSHOT.pom
[JENKINS] Archiving <https://builds.apache.org/job/carbondata-master-spark-2.1/ws/hadoop/target/carbondata-hadoop-1.5.0-SNAPSHOT.jar>
to org.apache.carbondata/carbondata-hadoop/1.5.0-SNAPSHOT/carbondata-hadoop-1.5.0-SNAPSHOT.jar
[JENKINS] Archiving <https://builds.apache.org/job/carbondata-master-spark-2.1/ws/integration/spark-datasource/pom.xml>
to org.apache.carbondata/carbondata-spark-datasource/1.5.0-SNAPSHOT/carbondata-spark-datasource-1.5.0-SNAPSHOT.pom
[JENKINS] Archiving <https://builds.apache.org/job/carbondata-master-spark-2.1/ws/integration/spark-datasource/target/carbondata-spark-datasource-1.5.0-SNAPSHOT.jar>
to org.apache.carbondata/carbondata-spark-datasource/1.5.0-SNAPSHOT/carbondata-spark-datasource-1.5.0-SNAPSHOT.jar
[JENKINS] Archiving <https://builds.apache.org/job/carbondata-master-spark-2.1/ws/integration/presto/pom.xml>
to org.apache.carbondata/carbondata-presto/1.5.0-SNAPSHOT/carbondata-presto-1.5.0-SNAPSHOT.pom
[JENKINS] Archiving <https://builds.apache.org/job/carbondata-master-spark-2.1/ws/integration/spark-common-test/pom.xml>
to org.apache.carbondata/carbondata-spark-common-test/1.5.0-SNAPSHOT/carbondata-spark-common-test-1.5.0-SNAPSHOT.pom
[JENKINS] Archiving <https://builds.apache.org/job/carbondata-master-spark-2.1/ws/integration/spark-common-test/target/carbondata-spark-common-test-1.5.0-SNAPSHOT.jar>
to org.apache.carbondata/carbondata-spark-common-test/1.5.0-SNAPSHOT/carbondata-spark-common-test-1.5.0-SNAPSHOT.jar
[JENKINS] Archiving <https://builds.apache.org/job/carbondata-master-spark-2.1/ws/store/sdk/pom.xml>
to org.apache.carbondata/carbondata-store-sdk/1.5.0-SNAPSHOT/carbondata-store-sdk-1.5.0-SNAPSHOT.pom
[JENKINS] Archiving <https://builds.apache.org/job/carbondata-master-spark-2.1/ws/store/sdk/target/carbondata-store-sdk-1.5.0-SNAPSHOT.jar>
to org.apache.carbondata/carbondata-store-sdk/1.5.0-SNAPSHOT/carbondata-store-sdk-1.5.0-SNAPSHOT.jar
Sending e-mails to: commits@carbondata.apache.org
Sending e-mails to: commits@carbondata.apache.org
channel stopped
Not sending mail to unregistered user jacky.likun@qq.com

Mime
View raw message