carbondata-commits mailing list archives

Site index · List index
Message view « Date » · « Thread »
Top « Date » · « Thread »
From Apache Jenkins Server <jenk...@builds.apache.org>
Subject Build failed in Jenkins: carbondata-master-spark-2.2 #1022
Date Wed, 19 Sep 2018 08:49:24 GMT
See <https://builds.apache.org/job/carbondata-master-spark-2.2/1022/display/redirect>

------------------------------------------
[...truncated 6.70 MB...]
+--------+
|      12|
+--------+

+--------+
|count(1)|
+--------+
|      12|
+--------+

time for query on table with lucene datamap table:0.218
time for query on table without lucene datamap table:0.304
+-----------------+-------------+
|               id|         name|
+-----------------+-------------+
|which test1 good2|who and name2|
|which test1 good2|who and name2|
|which test1 good3|who and name0|
|which test1 good3|who and name0|
|which test1 good7|who and name3|
|which test1 good7|who and name3|
|which test1 good7|who and name3|
|which test1 good7|who and name3|
|which test1 good8|who and name0|
|which test1 good8|who and name0|
|which test1 good9|who and name2|
|which test1 good9|who and name2|
+-----------------+-------------+

+-----------------+-------------+
|               id|         name|
+-----------------+-------------+
|which test1 good2|who and name2|
|which test1 good2|who and name2|
|which test1 good3|who and name0|
|which test1 good3|who and name0|
|which test1 good7|who and name3|
|which test1 good7|who and name3|
|which test1 good7|who and name3|
|which test1 good7|who and name3|
|which test1 good8|who and name0|
|which test1 good8|who and name0|
+-----------------+-------------+

18/09/19 01:48:54 AUDIT CarbonDropTableCommand: [jenkins-ubuntu2][jenkins][Thread-1]Deleting
table [persontable] under database [default]
18/09/19 01:48:54 AUDIT CarbonDropTableCommand: [jenkins-ubuntu2][jenkins][Thread-1]Deleted
table [persontable] under database [default]
- LuceneDataMapExample
18/09/19 01:48:54 AUDIT CarbonCreateTableCommand: [jenkins-ubuntu2][jenkins][Thread-1]Creating
Table with Database name [default] and Table name [origin_table]
18/09/19 01:48:54 AUDIT CarbonCreateTableCommand: [jenkins-ubuntu2][jenkins][Thread-1]Table
created with Database name [default] and Table name [origin_table]
18/09/19 01:48:54 AUDIT CarbonDataRDDFactory$: [jenkins-ubuntu2][jenkins][Thread-1]Data load
request has been received for table default.origin_table
18/09/19 01:48:54 ERROR DataLoadExecutor: [Executor task launch worker for task 2386][partitionID:table;queryID:3305225932753344]
Data Load is partially success for table origin_table
18/09/19 01:48:54 AUDIT CarbonDataRDDFactory$: [jenkins-ubuntu2][jenkins][Thread-1]Data load
is successful for default.origin_table
18/09/19 01:48:54 AUDIT MergeIndexEventListener: [jenkins-ubuntu2][jenkins][Thread-1]Load
post status event-listener called for merge index
18/09/19 01:48:54 AUDIT CarbonDataRDDFactory$: [jenkins-ubuntu2][jenkins][Thread-1]Data load
request has been received for table default.origin_table
18/09/19 01:48:55 ERROR DataLoadExecutor: [Executor task launch worker for task 2388][partitionID:table;queryID:3305226184304386]
Data Load is partially success for table origin_table
18/09/19 01:48:55 AUDIT CarbonDataRDDFactory$: [jenkins-ubuntu2][jenkins][Thread-1]Data load
is successful for default.origin_table
18/09/19 01:48:55 AUDIT MergeIndexEventListener: [jenkins-ubuntu2][jenkins][Thread-1]Load
post status event-listener called for merge index
18/09/19 01:48:55 AUDIT CarbonDataRDDFactory$: [jenkins-ubuntu2][jenkins][Thread-1]Data load
request has been received for table default.origin_table
18/09/19 01:48:55 ERROR DataLoadExecutor: [Executor task launch worker for task 2390][partitionID:table;queryID:3305226444472229]
Data Load is partially success for table origin_table
18/09/19 01:48:55 AUDIT CarbonDataRDDFactory$: [jenkins-ubuntu2][jenkins][Thread-1]Data load
is successful for default.origin_table
18/09/19 01:48:55 AUDIT MergeIndexEventListener: [jenkins-ubuntu2][jenkins][Thread-1]Load
post status event-listener called for merge index
18/09/19 01:48:55 AUDIT CarbonDataRDDFactory$: [jenkins-ubuntu2][jenkins][Thread-1]Data load
request has been received for table default.origin_table
18/09/19 01:48:55 ERROR DataLoadExecutor: [Executor task launch worker for task 2392][partitionID:table;queryID:3305226698885445]
Data Load is partially success for table origin_table
18/09/19 01:48:55 AUDIT CarbonDataRDDFactory$: [jenkins-ubuntu2][jenkins][Thread-1]Data load
is successful for default.origin_table
18/09/19 01:48:55 AUDIT MergeIndexEventListener: [jenkins-ubuntu2][jenkins][Thread-1]Load
post status event-listener called for merge index
+--------+
|count(1)|
+--------+
|      40|
+--------+

18/09/19 01:48:55 AUDIT CarbonCreateTableCommand: [jenkins-ubuntu2][jenkins][Thread-1]Creating
Table with Database name [default] and Table name [external_table]
18/09/19 01:48:55 AUDIT CarbonCreateTableCommand: [jenkins-ubuntu2][jenkins][Thread-1]Table
created with Database name [default] and Table name [external_table]
+--------+
|count(1)|
+--------+
|      40|
+--------+

18/09/19 01:48:55 AUDIT CarbonDataRDDFactory$: [jenkins-ubuntu2][jenkins][Thread-1]Data load
request has been received for table default.origin_table
18/09/19 01:48:56 ERROR DataLoadExecutor: [Executor task launch worker for task 2398][partitionID:table;queryID:3305227118001421]
Data Load is partially success for table origin_table
18/09/19 01:48:56 AUDIT CarbonDataRDDFactory$: [jenkins-ubuntu2][jenkins][Thread-1]Data load
is successful for default.origin_table
18/09/19 01:48:56 AUDIT MergeIndexEventListener: [jenkins-ubuntu2][jenkins][Thread-1]Load
post status event-listener called for merge index
18/09/19 01:48:56 AUDIT CarbonDataRDDFactory$: [jenkins-ubuntu2][jenkins][Thread-1]Data load
request has been received for table default.origin_table
18/09/19 01:48:56 ERROR DataLoadExecutor: [Executor task launch worker for task 2400][partitionID:table;queryID:3305227352552536]
Data Load is partially success for table origin_table
18/09/19 01:48:56 AUDIT CarbonDataRDDFactory$: [jenkins-ubuntu2][jenkins][Thread-1]Data load
is successful for default.origin_table
18/09/19 01:48:56 AUDIT MergeIndexEventListener: [jenkins-ubuntu2][jenkins][Thread-1]Load
post status event-listener called for merge index
+--------+
|count(1)|
+--------+
|      60|
+--------+

18/09/19 01:48:56 AUDIT CarbonDropTableCommand: [jenkins-ubuntu2][jenkins][Thread-1]Deleting
table [origin_table] under database [default]
18/09/19 01:48:56 AUDIT CarbonDropTableCommand: [jenkins-ubuntu2][jenkins][Thread-1]Deleted
table [origin_table] under database [default]
- ExternalTableExample
18/09/19 01:48:56 AUDIT CarbonCreateTableCommand: [jenkins-ubuntu2][jenkins][Thread-1]Creating
Table with Database name [default] and Table name [maintable]
18/09/19 01:48:56 AUDIT CarbonCreateTableCommand: [jenkins-ubuntu2][jenkins][Thread-1]Table
created with Database name [default] and Table name [maintable]
18/09/19 01:48:56 AUDIT CarbonCreateTableCommand: [jenkins-ubuntu2][jenkins][Thread-1]Creating
Table with Database name [default] and Table name [dimtable]
18/09/19 01:48:56 AUDIT CarbonCreateTableCommand: [jenkins-ubuntu2][jenkins][Thread-1]Table
created with Database name [default] and Table name [dimtable]
18/09/19 01:48:56 AUDIT CarbonDataRDDFactory$: [jenkins-ubuntu2][jenkins][Thread-1]Data load
request has been received for table default.maintable
18/09/19 01:48:56 AUDIT CarbonDataRDDFactory$: [jenkins-ubuntu2][jenkins][Thread-1]Data load
is successful for default.maintable
18/09/19 01:48:56 AUDIT MergeIndexEventListener: [jenkins-ubuntu2][jenkins][Thread-1]Load
post status event-listener called for merge index
18/09/19 01:48:56 AUDIT CarbonDataRDDFactory$: [jenkins-ubuntu2][jenkins][Thread-1]Data load
request has been received for table default.dimtable
18/09/19 01:48:57 AUDIT CarbonDataRDDFactory$: [jenkins-ubuntu2][jenkins][Thread-1]Data load
is successful for default.dimtable
18/09/19 01:48:57 AUDIT MergeIndexEventListener: [jenkins-ubuntu2][jenkins][Thread-1]Load
post status event-listener called for merge index
- MVDataMapExample *** FAILED ***
  java.lang.ClassNotFoundException: org.apache.carbondata.mv.datamap.MVDataMapProvider
  at java.net.URLClassLoader.findClass(URLClassLoader.java:381)
  at java.lang.ClassLoader.loadClass(ClassLoader.java:424)
  at java.lang.ClassLoader.loadClass(ClassLoader.java:357)
  at java.lang.Class.forName0(Native Method)
  at java.lang.Class.forName(Class.java:348)
  at org.apache.spark.util.Utils$.classForName(Utils.scala:230)
  at org.apache.spark.util.CarbonReflectionUtils$.createObject(CarbonReflectionUtils.scala:305)
  at org.apache.carbondata.spark.util.CarbonScalaUtil$.createDataMapProvider(CarbonScalaUtil.scala:480)
  at org.apache.carbondata.spark.util.CarbonScalaUtil.createDataMapProvider(CarbonScalaUtil.scala)
  at org.apache.carbondata.datamap.DataMapManager.getDataMapProvider(DataMapManager.java:57)
  ...
Run completed in 1 minute, 42 seconds.
Total number of tests run: 18
Suites: completed 2, aborted 0
Tests: succeeded 17, failed 1, canceled 0, ignored 0, pending 0
*** 1 TEST FAILED ***
[JENKINS] Recording test results
[INFO]                                                                         
[INFO] ------------------------------------------------------------------------
[INFO] Skipping Apache CarbonData :: Parent
[INFO] This project has been banned from the build due to previous failures.
[INFO] ------------------------------------------------------------------------
[INFO] ------------------------------------------------------------------------
[INFO] Reactor Summary:
[INFO] 
[INFO] Apache CarbonData :: Parent ........................ SUCCESS [  8.235 s]
[INFO] Apache CarbonData :: Common ........................ SUCCESS [ 12.032 s]
[INFO] Apache CarbonData :: Core .......................... SUCCESS [01:52 min]
[INFO] Apache CarbonData :: Processing .................... SUCCESS [ 27.474 s]
[INFO] Apache CarbonData :: Hadoop ........................ SUCCESS [ 22.819 s]
[INFO] Apache CarbonData :: Streaming ..................... SUCCESS [ 30.511 s]
[INFO] Apache CarbonData :: Store SDK ..................... SUCCESS [ 53.240 s]
[INFO] Apache CarbonData :: Spark Datasource .............. SUCCESS [02:23 min]
[INFO] Apache CarbonData :: Spark Common .................. SUCCESS [01:14 min]
[INFO] Apache CarbonData :: Search ........................ SUCCESS [ 26.773 s]
[INFO] Apache CarbonData :: Lucene Index DataMap .......... SUCCESS [ 13.141 s]
[INFO] Apache CarbonData :: Bloom Index DataMap ........... SUCCESS [ 11.228 s]
[INFO] Apache CarbonData :: Spark2 ........................ SUCCESS [17:40 min]
[INFO] Apache CarbonData :: Spark Common Test ............. SUCCESS [  01:06 h]
[INFO] Apache CarbonData :: DataMap Examples .............. SUCCESS [ 17.697 s]
[INFO] Apache CarbonData :: Assembly ...................... SUCCESS [ 19.773 s]
[INFO] Apache CarbonData :: Hive .......................... SUCCESS [ 40.962 s]
[INFO] Apache CarbonData :: presto ........................ SUCCESS [01:22 min]
[INFO] Apache CarbonData :: Spark2 Examples ............... FAILURE [02:30 min]
[INFO] ------------------------------------------------------------------------
[INFO] BUILD FAILURE
[INFO] ------------------------------------------------------------------------
[INFO] Total time: 01:38 h
[INFO] Finished at: 2018-09-19T08:49:04+00:00
[INFO] Final Memory: 186M/1284M
[INFO] ------------------------------------------------------------------------
Waiting for Jenkins to finish collecting data
[ERROR] Failed to execute goal org.scalatest:scalatest-maven-plugin:1.0:test (test) on project
carbondata-examples-spark2: There are test failures -> [Help 1]
org.apache.maven.lifecycle.LifecycleExecutionException: Failed to execute goal org.scalatest:scalatest-maven-plugin:1.0:test
(test) on project carbondata-examples-spark2: There are test failures
	at org.apache.maven.lifecycle.internal.MojoExecutor.execute(MojoExecutor.java:212)
	at org.apache.maven.lifecycle.internal.MojoExecutor.execute(MojoExecutor.java:153)
	at org.apache.maven.lifecycle.internal.MojoExecutor.execute(MojoExecutor.java:145)
	at org.apache.maven.lifecycle.internal.LifecycleModuleBuilder.buildProject(LifecycleModuleBuilder.java:116)
	at org.apache.maven.lifecycle.internal.LifecycleModuleBuilder.buildProject(LifecycleModuleBuilder.java:80)
	at org.apache.maven.lifecycle.internal.builder.singlethreaded.SingleThreadedBuilder.build(SingleThreadedBuilder.java:51)
	at org.apache.maven.lifecycle.internal.LifecycleStarter.execute(LifecycleStarter.java:128)
	at org.apache.maven.DefaultMaven.doExecute(DefaultMaven.java:307)
	at org.apache.maven.DefaultMaven.doExecute(DefaultMaven.java:193)
	at org.apache.maven.DefaultMaven.execute(DefaultMaven.java:106)
	at org.jvnet.hudson.maven3.launcher.Maven33Launcher.main(Maven33Launcher.java:129)
	at sun.reflect.NativeMethodAccessorImpl.invoke0(Native Method)
	at sun.reflect.NativeMethodAccessorImpl.invoke(NativeMethodAccessorImpl.java:62)
	at sun.reflect.DelegatingMethodAccessorImpl.invoke(DelegatingMethodAccessorImpl.java:43)
	at java.lang.reflect.Method.invoke(Method.java:498)
	at org.codehaus.plexus.classworlds.launcher.Launcher.launchStandard(Launcher.java:330)
	at org.codehaus.plexus.classworlds.launcher.Launcher.launch(Launcher.java:238)
	at jenkins.maven3.agent.Maven33Main.launch(Maven33Main.java:176)
	at sun.reflect.NativeMethodAccessorImpl.invoke0(Native Method)
	at sun.reflect.NativeMethodAccessorImpl.invoke(NativeMethodAccessorImpl.java:62)
	at sun.reflect.DelegatingMethodAccessorImpl.invoke(DelegatingMethodAccessorImpl.java:43)
	at java.lang.reflect.Method.invoke(Method.java:498)
	at hudson.maven.Maven3Builder.call(Maven3Builder.java:139)
	at hudson.maven.Maven3Builder.call(Maven3Builder.java:70)
	at hudson.remoting.UserRequest.perform(UserRequest.java:212)
	at hudson.remoting.UserRequest.perform(UserRequest.java:54)
	at hudson.remoting.Request$2.run(Request.java:369)
	at hudson.remoting.InterceptingExecutorService$1.call(InterceptingExecutorService.java:72)
	at java.util.concurrent.FutureTask.run(FutureTask.java:266)
	at java.util.concurrent.ThreadPoolExecutor.runWorker(ThreadPoolExecutor.java:1149)
	at java.util.concurrent.ThreadPoolExecutor$Worker.run(ThreadPoolExecutor.java:624)
	at java.lang.Thread.run(Thread.java:748)
Caused by: org.apache.maven.plugin.MojoFailureException: There are test failures
	at org.scalatest.tools.maven.TestMojo.execute(TestMojo.java:107)
	at org.apache.maven.plugin.DefaultBuildPluginManager.executeMojo(DefaultBuildPluginManager.java:134)
	at org.apache.maven.lifecycle.internal.MojoExecutor.execute(MojoExecutor.java:207)
	... 31 more
[ERROR] 
[ERROR] Re-run Maven using the -X switch to enable full debug logging.
[ERROR] 
[ERROR] For more information about the errors and possible solutions, please read the following
articles:
[ERROR] [Help 1] http://cwiki.apache.org/confluence/display/MAVEN/MojoFailureException
[ERROR] 
[ERROR] After correcting the problems, you can resume the build with the command
[ERROR]   mvn <goals> -rf :carbondata-examples-spark2
[JENKINS] Archiving <https://builds.apache.org/job/carbondata-master-spark-2.2/ws/processing/pom.xml>
to org.apache.carbondata/carbondata-processing/1.5.0-SNAPSHOT/carbondata-processing-1.5.0-SNAPSHOT.pom
[JENKINS] Archiving <https://builds.apache.org/job/carbondata-master-spark-2.2/ws/processing/target/carbondata-processing-1.5.0-SNAPSHOT.jar>
to org.apache.carbondata/carbondata-processing/1.5.0-SNAPSHOT/carbondata-processing-1.5.0-SNAPSHOT.jar
[JENKINS] Archiving <https://builds.apache.org/job/carbondata-master-spark-2.2/ws/datamap/examples/pom.xml>
to org.apache.carbondata/carbondata-datamap-examples/1.5.0-SNAPSHOT/carbondata-datamap-examples-1.5.0-SNAPSHOT.pom
[JENKINS] Archiving <https://builds.apache.org/job/carbondata-master-spark-2.2/ws/datamap/examples/target/carbondata-datamap-examples-1.5.0-SNAPSHOT.jar>
to org.apache.carbondata/carbondata-datamap-examples/1.5.0-SNAPSHOT/carbondata-datamap-examples-1.5.0-SNAPSHOT.jar
[JENKINS] Archiving <https://builds.apache.org/job/carbondata-master-spark-2.2/ws/store/search/pom.xml>
to org.apache.carbondata/carbondata-search/1.5.0-SNAPSHOT/carbondata-search-1.5.0-SNAPSHOT.pom
[JENKINS] Archiving <https://builds.apache.org/job/carbondata-master-spark-2.2/ws/store/search/target/carbondata-search-1.5.0-SNAPSHOT.jar>
to org.apache.carbondata/carbondata-search/1.5.0-SNAPSHOT/carbondata-search-1.5.0-SNAPSHOT.jar
[JENKINS] Archiving <https://builds.apache.org/job/carbondata-master-spark-2.2/ws/streaming/pom.xml>
to org.apache.carbondata/carbondata-streaming/1.5.0-SNAPSHOT/carbondata-streaming-1.5.0-SNAPSHOT.pom
[JENKINS] Archiving <https://builds.apache.org/job/carbondata-master-spark-2.2/ws/streaming/target/carbondata-streaming-1.5.0-SNAPSHOT.jar>
to org.apache.carbondata/carbondata-streaming/1.5.0-SNAPSHOT/carbondata-streaming-1.5.0-SNAPSHOT.jar
[JENKINS] Archiving <https://builds.apache.org/job/carbondata-master-spark-2.2/ws/integration/spark-common/pom.xml>
to org.apache.carbondata/carbondata-spark-common/1.5.0-SNAPSHOT/carbondata-spark-common-1.5.0-SNAPSHOT.pom
[JENKINS] Archiving <https://builds.apache.org/job/carbondata-master-spark-2.2/ws/integration/spark-common/target/carbondata-spark-common-1.5.0-SNAPSHOT.jar>
to org.apache.carbondata/carbondata-spark-common/1.5.0-SNAPSHOT/carbondata-spark-common-1.5.0-SNAPSHOT.jar
[JENKINS] Archiving <https://builds.apache.org/job/carbondata-master-spark-2.2/ws/datamap/lucene/pom.xml>
to org.apache.carbondata/carbondata-lucene/1.5.0-SNAPSHOT/carbondata-lucene-1.5.0-SNAPSHOT.pom
[JENKINS] Archiving <https://builds.apache.org/job/carbondata-master-spark-2.2/ws/datamap/lucene/target/carbondata-lucene-1.5.0-SNAPSHOT.jar>
to org.apache.carbondata/carbondata-lucene/1.5.0-SNAPSHOT/carbondata-lucene-1.5.0-SNAPSHOT.jar
[JENKINS] Archiving <https://builds.apache.org/job/carbondata-master-spark-2.2/ws/integration/hive/pom.xml>
to org.apache.carbondata/carbondata-hive/1.5.0-SNAPSHOT/carbondata-hive-1.5.0-SNAPSHOT.pom
[JENKINS] Archiving <https://builds.apache.org/job/carbondata-master-spark-2.2/ws/integration/hive/target/carbondata-hive-1.5.0-SNAPSHOT.jar>
to org.apache.carbondata/carbondata-hive/1.5.0-SNAPSHOT/carbondata-hive-1.5.0-SNAPSHOT.jar
[JENKINS] Archiving <https://builds.apache.org/job/carbondata-master-spark-2.2/ws/common/pom.xml>
to org.apache.carbondata/carbondata-common/1.5.0-SNAPSHOT/carbondata-common-1.5.0-SNAPSHOT.pom
[JENKINS] Archiving <https://builds.apache.org/job/carbondata-master-spark-2.2/ws/common/target/carbondata-common-1.5.0-SNAPSHOT.jar>
to org.apache.carbondata/carbondata-common/1.5.0-SNAPSHOT/carbondata-common-1.5.0-SNAPSHOT.jar
[JENKINS] Archiving <https://builds.apache.org/job/carbondata-master-spark-2.2/ws/examples/spark2/pom.xml>
to org.apache.carbondata/carbondata-examples-spark2/1.5.0-SNAPSHOT/carbondata-examples-spark2-1.5.0-SNAPSHOT.pom
[JENKINS] Archiving <https://builds.apache.org/job/carbondata-master-spark-2.2/ws/integration/spark2/pom.xml>
to org.apache.carbondata/carbondata-spark2/1.5.0-SNAPSHOT/carbondata-spark2-1.5.0-SNAPSHOT.pom
[JENKINS] Archiving <https://builds.apache.org/job/carbondata-master-spark-2.2/ws/integration/spark2/target/carbondata-spark2-1.5.0-SNAPSHOT.jar>
to org.apache.carbondata/carbondata-spark2/1.5.0-SNAPSHOT/carbondata-spark2-1.5.0-SNAPSHOT.jar
[JENKINS] Archiving <https://builds.apache.org/job/carbondata-master-spark-2.2/ws/datamap/bloom/pom.xml>
to org.apache.carbondata/carbondata-bloom/1.5.0-SNAPSHOT/carbondata-bloom-1.5.0-SNAPSHOT.pom
[JENKINS] Archiving <https://builds.apache.org/job/carbondata-master-spark-2.2/ws/datamap/bloom/target/carbondata-bloom-1.5.0-SNAPSHOT.jar>
to org.apache.carbondata/carbondata-bloom/1.5.0-SNAPSHOT/carbondata-bloom-1.5.0-SNAPSHOT.jar
[JENKINS] Archiving <https://builds.apache.org/job/carbondata-master-spark-2.2/ws/assembly/pom.xml>
to org.apache.carbondata/carbondata-assembly/1.5.0-SNAPSHOT/carbondata-assembly-1.5.0-SNAPSHOT.pom
[JENKINS] Archiving <https://builds.apache.org/job/carbondata-master-spark-2.2/ws/pom.xml>
to org.apache.carbondata/carbondata-parent/1.5.0-SNAPSHOT/carbondata-parent-1.5.0-SNAPSHOT.pom
[JENKINS] Archiving <https://builds.apache.org/job/carbondata-master-spark-2.2/ws/core/pom.xml>
to org.apache.carbondata/carbondata-core/1.5.0-SNAPSHOT/carbondata-core-1.5.0-SNAPSHOT.pom
[JENKINS] Archiving <https://builds.apache.org/job/carbondata-master-spark-2.2/ws/core/target/carbondata-core-1.5.0-SNAPSHOT.jar>
to org.apache.carbondata/carbondata-core/1.5.0-SNAPSHOT/carbondata-core-1.5.0-SNAPSHOT.jar
[JENKINS] Archiving <https://builds.apache.org/job/carbondata-master-spark-2.2/ws/hadoop/pom.xml>
to org.apache.carbondata/carbondata-hadoop/1.5.0-SNAPSHOT/carbondata-hadoop-1.5.0-SNAPSHOT.pom
[JENKINS] Archiving <https://builds.apache.org/job/carbondata-master-spark-2.2/ws/hadoop/target/carbondata-hadoop-1.5.0-SNAPSHOT.jar>
to org.apache.carbondata/carbondata-hadoop/1.5.0-SNAPSHOT/carbondata-hadoop-1.5.0-SNAPSHOT.jar
[JENKINS] Archiving <https://builds.apache.org/job/carbondata-master-spark-2.2/ws/integration/spark-datasource/pom.xml>
to org.apache.carbondata/carbondata-spark-datasource/1.5.0-SNAPSHOT/carbondata-spark-datasource-1.5.0-SNAPSHOT.pom
[JENKINS] Archiving <https://builds.apache.org/job/carbondata-master-spark-2.2/ws/integration/spark-datasource/target/carbondata-spark-datasource-1.5.0-SNAPSHOT.jar>
to org.apache.carbondata/carbondata-spark-datasource/1.5.0-SNAPSHOT/carbondata-spark-datasource-1.5.0-SNAPSHOT.jar
[JENKINS] Archiving <https://builds.apache.org/job/carbondata-master-spark-2.2/ws/integration/presto/pom.xml>
to org.apache.carbondata/carbondata-presto/1.5.0-SNAPSHOT/carbondata-presto-1.5.0-SNAPSHOT.pom
[JENKINS] Archiving <https://builds.apache.org/job/carbondata-master-spark-2.2/ws/integration/presto/target/carbondata-presto-1.5.0-SNAPSHOT.zip>
to org.apache.carbondata/carbondata-presto/1.5.0-SNAPSHOT/carbondata-presto-1.5.0-SNAPSHOT.zip
[JENKINS] Archiving <https://builds.apache.org/job/carbondata-master-spark-2.2/ws/integration/presto/target/carbondata-presto-1.5.0-SNAPSHOT.jar>
to org.apache.carbondata/carbondata-presto/1.5.0-SNAPSHOT/carbondata-presto-1.5.0-SNAPSHOT.jar
[Fast Archiver] Compressed 96.48 MB of artifacts by 94.8% relative to #1021
[JENKINS] Archiving <https://builds.apache.org/job/carbondata-master-spark-2.2/ws/integration/spark-common-test/pom.xml>
to org.apache.carbondata/carbondata-spark-common-test/1.5.0-SNAPSHOT/carbondata-spark-common-test-1.5.0-SNAPSHOT.pom
[JENKINS] Archiving <https://builds.apache.org/job/carbondata-master-spark-2.2/ws/integration/spark-common-test/target/carbondata-spark-common-test-1.5.0-SNAPSHOT.jar>
to org.apache.carbondata/carbondata-spark-common-test/1.5.0-SNAPSHOT/carbondata-spark-common-test-1.5.0-SNAPSHOT.jar
[JENKINS] Archiving <https://builds.apache.org/job/carbondata-master-spark-2.2/ws/store/sdk/pom.xml>
to org.apache.carbondata/carbondata-store-sdk/1.5.0-SNAPSHOT/carbondata-store-sdk-1.5.0-SNAPSHOT.pom
[JENKINS] Archiving <https://builds.apache.org/job/carbondata-master-spark-2.2/ws/store/sdk/target/carbondata-store-sdk-1.5.0-SNAPSHOT.jar>
to org.apache.carbondata/carbondata-store-sdk/1.5.0-SNAPSHOT/carbondata-store-sdk-1.5.0-SNAPSHOT.jar
Sending e-mails to: commits@carbondata.apache.org qiangcai@qq.com ravi.pesala@gmail.com tomanishgupta18@gmail.com
chenliang613@apache.org
channel stopped
Not sending mail to unregistered user 441586683@qq.com
Not sending mail to unregistered user jacky.likun@qq.com
Not sending mail to unregistered user kunalkapoor642@gmail.com

Mime
View raw message