carbondata-commits mailing list archives

Site index · List index
Message view « Date » · « Thread »
Top « Date » · « Thread »
From Apache Jenkins Server <jenk...@builds.apache.org>
Subject Build failed in Jenkins: carbondata-master-spark-2.2 #602
Date Tue, 03 Jul 2018 08:56:03 GMT
See <https://builds.apache.org/job/carbondata-master-spark-2.2/602/display/redirect>

------------------------------------------
[...truncated 53.26 MB...]

time for query on table with lucene datamap table:0.311
time for query on table without lucene datamap table:0.319
+-----------------+-------------+
|               id|         name|
+-----------------+-------------+
|which test1 good0|who and name0|
|which test1 good0|who and name0|
|which test1 good0|who and name4|
|which test1 good0|who and name4|
|which test1 good5|who and name4|
|which test1 good5|who and name4|
+-----------------+-------------+

+-----------------+-------------+
|               id|         name|
+-----------------+-------------+
|which test1 good0|who and name0|
|which test1 good0|who and name0|
|which test1 good0|who and name4|
|which test1 good0|who and name4|
|which test1 good5|who and name4|
|which test1 good5|who and name4|
+-----------------+-------------+

18/07/03 01:52:19 AUDIT CarbonDropTableCommand: [asf927.gq1.ygridcore.net][jenkins][Thread-1]Deleting
table [persontable] under database [default]
18/07/03 01:52:19 AUDIT CarbonDropTableCommand: [asf927.gq1.ygridcore.net][jenkins][Thread-1]Deleted
table [persontable] under database [default]
- LuceneDataMapExample
18/07/03 01:52:19 AUDIT CarbonCreateTableCommand: [asf927.gq1.ygridcore.net][jenkins][Thread-1]Creating
Table with Database name [default] and Table name [origin_table]
18/07/03 01:52:19 AUDIT CarbonCreateTableCommand: [asf927.gq1.ygridcore.net][jenkins][Thread-1]Table
created with Database name [default] and Table name [origin_table]
18/07/03 01:52:19 AUDIT CarbonDataRDDFactory$: [asf927.gq1.ygridcore.net][jenkins][Thread-1]Data
load request has been received for table default.origin_table
18/07/03 01:52:20 ERROR DataLoadExecutor: [Executor task launch worker for task 2298][partitionID:table;queryID:16842996625921028]
Data Load is partially success for table origin_table
18/07/03 01:52:20 AUDIT CarbonDataRDDFactory$: [asf927.gq1.ygridcore.net][jenkins][Thread-1]Data
load is successful for default.origin_table
18/07/03 01:52:20 AUDIT CarbonDataRDDFactory$: [asf927.gq1.ygridcore.net][jenkins][Thread-1]Data
load request has been received for table default.origin_table
18/07/03 01:52:20 ERROR DataLoadExecutor: [Executor task launch worker for task 2299][partitionID:table;queryID:16842997158487242]
Data Load is partially success for table origin_table
18/07/03 01:52:20 AUDIT CarbonDataRDDFactory$: [asf927.gq1.ygridcore.net][jenkins][Thread-1]Data
load is successful for default.origin_table
18/07/03 01:52:20 AUDIT CarbonDataRDDFactory$: [asf927.gq1.ygridcore.net][jenkins][Thread-1]Data
load request has been received for table default.origin_table
18/07/03 01:52:21 ERROR DataLoadExecutor: [Executor task launch worker for task 2300][partitionID:table;queryID:16842997697202747]
Data Load is partially success for table origin_table
18/07/03 01:52:21 AUDIT CarbonDataRDDFactory$: [asf927.gq1.ygridcore.net][jenkins][Thread-1]Data
load is successful for default.origin_table
18/07/03 01:52:21 AUDIT CarbonDataRDDFactory$: [asf927.gq1.ygridcore.net][jenkins][Thread-1]Data
load request has been received for table default.origin_table
18/07/03 01:52:21 ERROR DataLoadExecutor: [Executor task launch worker for task 2301][partitionID:table;queryID:16842998234997972]
Data Load is partially success for table origin_table
18/07/03 01:52:21 AUDIT CarbonDataRDDFactory$: [asf927.gq1.ygridcore.net][jenkins][Thread-1]Data
load is successful for default.origin_table
+--------+
|count(1)|
+--------+
|      40|
+--------+

18/07/03 01:52:21 AUDIT CarbonCreateTableCommand: [asf927.gq1.ygridcore.net][jenkins][Thread-1]Creating
Table with Database name [default] and Table name [external_table]
18/07/03 01:52:21 AUDIT CarbonCreateTableCommand: [asf927.gq1.ygridcore.net][jenkins][Thread-1]Table
created with Database name [default] and Table name [external_table]
+--------+
|count(1)|
+--------+
|      40|
+--------+

18/07/03 01:52:21 AUDIT CarbonDataRDDFactory$: [asf927.gq1.ygridcore.net][jenkins][Thread-1]Data
load request has been received for table default.origin_table
18/07/03 01:52:22 ERROR DataLoadExecutor: [Executor task launch worker for task 2306][partitionID:table;queryID:16842998967845358]
Data Load is partially success for table origin_table
18/07/03 01:52:22 AUDIT CarbonDataRDDFactory$: [asf927.gq1.ygridcore.net][jenkins][Thread-1]Data
load is successful for default.origin_table
18/07/03 01:52:22 AUDIT CarbonDataRDDFactory$: [asf927.gq1.ygridcore.net][jenkins][Thread-1]Data
load request has been received for table default.origin_table
18/07/03 01:52:23 ERROR DataLoadExecutor: [Executor task launch worker for task 2307][partitionID:table;queryID:16842999488589099]
Data Load is partially success for table origin_table
18/07/03 01:52:23 AUDIT CarbonDataRDDFactory$: [asf927.gq1.ygridcore.net][jenkins][Thread-1]Data
load is successful for default.origin_table
+--------+
|count(1)|
+--------+
|      60|
+--------+

18/07/03 01:52:23 AUDIT CarbonDropTableCommand: [asf927.gq1.ygridcore.net][jenkins][Thread-1]Deleting
table [origin_table] under database [default]
18/07/03 01:52:23 AUDIT CarbonDropTableCommand: [asf927.gq1.ygridcore.net][jenkins][Thread-1]Deleted
table [origin_table] under database [default]
- ExternalTableExample
Run completed in 2 minutes, 17 seconds.
Total number of tests run: 17
Suites: completed 2, aborted 0
Tests: succeeded 17, failed 0, canceled 0, ignored 0, pending 0
All tests passed.
[JENKINS] Recording test results
[INFO] 
[INFO] --- maven-jar-plugin:2.5:jar (default-jar) @ carbondata-examples-spark2 ---
[INFO] Building jar: <https://builds.apache.org/job/carbondata-master-spark-2.2/ws/examples/spark2/target/carbondata-examples-spark2-1.5.0-SNAPSHOT.jar>
[INFO] 
[INFO] --- maven-site-plugin:3.4:attach-descriptor (attach-descriptor) @ carbondata-examples-spark2
---
[INFO] 
[INFO] --- jacoco-maven-plugin:0.7.9:prepare-agent-integration (default-prepare-agent-integration)
@ carbondata-examples-spark2 ---
[INFO] argLine set to -javaagent:/home/jenkins/jenkins-slave/maven-repositories/0/org/jacoco/org.jacoco.agent/0.7.9/org.jacoco.agent-0.7.9-runtime.jar=destfile=<https://builds.apache.org/job/carbondata-master-spark-2.2/ws/examples/spark2/target/jacoco-it.exec>
[INFO] 
[INFO] --- maven-checkstyle-plugin:2.17:check (default) @ carbondata-examples-spark2 ---
[INFO] 
[INFO] --- scalastyle-maven-plugin:0.8.0:check (default) @ carbondata-examples-spark2 ---
Saving to outputFile=<https://builds.apache.org/job/carbondata-master-spark-2.2/ws/examples/spark2/target/scalastyle-output.xml>
Processed 34 file(s)
Found 0 errors
Found 0 warnings
Found 0 infos
Finished in 687 ms
[INFO] 
[INFO] --- jacoco-maven-plugin:0.7.9:report (default-report) @ carbondata-examples-spark2
---
[INFO] Skipping JaCoCo execution due to missing execution data file.
[INFO] 
[INFO] --- jacoco-maven-plugin:0.7.9:report-integration (default-report-integration) @ carbondata-examples-spark2
---
[INFO] Skipping JaCoCo execution due to missing execution data file.
[INFO] 
[INFO] --- jacoco-maven-plugin:0.7.9:check (default-check) @ carbondata-examples-spark2 ---
[INFO] Skipping JaCoCo execution due to missing execution data <https://builds.apache.org/job/carbondata-master-spark-2.2/ws/examples/spark2/target/jacoco.exec>
[INFO] 
[INFO] --- maven-install-plugin:2.5.2:install (default-install) @ carbondata-examples-spark2
---
[INFO] Installing <https://builds.apache.org/job/carbondata-master-spark-2.2/ws/examples/spark2/target/carbondata-examples-spark2-1.5.0-SNAPSHOT.jar>
to /home/jenkins/jenkins-slave/maven-repositories/0/org/apache/carbondata/carbondata-examples-spark2/1.5.0-SNAPSHOT/carbondata-examples-spark2-1.5.0-SNAPSHOT.jar
[INFO] Installing <https://builds.apache.org/job/carbondata-master-spark-2.2/ws/examples/spark2/pom.xml>
to /home/jenkins/jenkins-slave/maven-repositories/0/org/apache/carbondata/carbondata-examples-spark2/1.5.0-SNAPSHOT/carbondata-examples-spark2-1.5.0-SNAPSHOT.pom
[INFO]                                                                         
[INFO] ------------------------------------------------------------------------
[INFO] Building Apache CarbonData :: Parent 1.5.0-SNAPSHOT
[INFO] ------------------------------------------------------------------------
[INFO] 
[INFO] --- coveralls-maven-plugin:4.3.0:report (default-cli) @ carbondata-parent ---
[INFO] Starting Coveralls job for jenkins (602 / https://builds.apache.org/job/carbondata-master-spark-2.2/602/)
[INFO] Using repository token <secret>
[INFO] Git commit dac5d3c in master
[INFO] Writing Coveralls data to <https://builds.apache.org/job/carbondata-master-spark-2.2/ws/target/coveralls.json...>
[INFO] Processing coverage report from <https://builds.apache.org/job/carbondata-master-spark-2.2/ws/target/carbondata-coverage-report/carbondata-coverage-report.xml>
[INFO] ------------------------------------------------------------------------
[INFO] Reactor Summary:
[INFO] 
[INFO] Apache CarbonData :: Parent ........................ FAILURE [  2.627 s]
[INFO] Apache CarbonData :: Common ........................ SUCCESS [ 17.280 s]
[INFO] Apache CarbonData :: Core .......................... SUCCESS [02:47 min]
[INFO] Apache CarbonData :: Processing .................... SUCCESS [ 31.480 s]
[INFO] Apache CarbonData :: Hadoop ........................ SUCCESS [ 26.149 s]
[INFO] Apache CarbonData :: Streaming ..................... SUCCESS [ 35.599 s]
[INFO] Apache CarbonData :: Spark Common .................. SUCCESS [01:16 min]
[INFO] Apache CarbonData :: Store SDK ..................... SUCCESS [01:06 min]
[INFO] Apache CarbonData :: Search ........................ SUCCESS [ 37.377 s]
[INFO] Apache CarbonData :: Lucene Index DataMap .......... SUCCESS [ 20.350 s]
[INFO] Apache CarbonData :: Bloom Index DataMap ........... SUCCESS [ 15.284 s]
[INFO] Apache CarbonData :: Spark2 ........................ SUCCESS [11:01 min]
[INFO] Apache CarbonData :: Spark Common Test ............. SUCCESS [  01:15 h]
[INFO] Apache CarbonData :: DataMap Examples .............. SUCCESS [ 12.616 s]
[INFO] Apache CarbonData :: Assembly ...................... SUCCESS [ 17.326 s]
[INFO] Apache CarbonData :: Hive .......................... SUCCESS [ 35.319 s]
[INFO] Apache CarbonData :: presto ........................ SUCCESS [01:19 min]
[INFO] Apache CarbonData :: Spark2 Examples ............... SUCCESS [03:03 min]
[INFO] ------------------------------------------------------------------------
[INFO] BUILD FAILURE
[INFO] ------------------------------------------------------------------------
[INFO] Total time: 01:42 h
[INFO] Finished at: 2018-07-03T08:52:56+00:00
[INFO] Final Memory: 182M/1647M
[INFO] ------------------------------------------------------------------------
Waiting for Jenkins to finish collecting data
[ERROR] Failed to execute goal org.eluder.coveralls:coveralls-maven-plugin:4.3.0:report (default-cli)
on project carbondata-parent: Build error: Line number 228 is greater than the source file
integration/presto/src/main/java/org/apache/carbondata/presto/CarbondataPageSource.java size
-> [Help 1]
org.apache.maven.lifecycle.LifecycleExecutionException: Failed to execute goal org.eluder.coveralls:coveralls-maven-plugin:4.3.0:report
(default-cli) on project carbondata-parent: Build error
	at org.apache.maven.lifecycle.internal.MojoExecutor.execute(MojoExecutor.java:212)
	at org.apache.maven.lifecycle.internal.MojoExecutor.execute(MojoExecutor.java:153)
	at org.apache.maven.lifecycle.internal.MojoExecutor.execute(MojoExecutor.java:145)
	at org.apache.maven.lifecycle.internal.LifecycleModuleBuilder.buildProject(LifecycleModuleBuilder.java:116)
	at org.apache.maven.lifecycle.internal.LifecycleModuleBuilder.buildProject(LifecycleModuleBuilder.java:80)
	at org.apache.maven.lifecycle.internal.builder.singlethreaded.SingleThreadedBuilder.build(SingleThreadedBuilder.java:51)
	at org.apache.maven.lifecycle.internal.LifecycleStarter.execute(LifecycleStarter.java:128)
	at org.apache.maven.DefaultMaven.doExecute(DefaultMaven.java:307)
	at org.apache.maven.DefaultMaven.doExecute(DefaultMaven.java:193)
	at org.apache.maven.DefaultMaven.execute(DefaultMaven.java:106)
	at org.jvnet.hudson.maven3.launcher.Maven33Launcher.main(Maven33Launcher.java:129)
	at sun.reflect.NativeMethodAccessorImpl.invoke0(Native Method)
	at sun.reflect.NativeMethodAccessorImpl.invoke(NativeMethodAccessorImpl.java:62)
	at sun.reflect.DelegatingMethodAccessorImpl.invoke(DelegatingMethodAccessorImpl.java:43)
	at java.lang.reflect.Method.invoke(Method.java:498)
	at org.codehaus.plexus.classworlds.launcher.Launcher.launchStandard(Launcher.java:330)
	at org.codehaus.plexus.classworlds.launcher.Launcher.launch(Launcher.java:238)
	at jenkins.maven3.agent.Maven33Main.launch(Maven33Main.java:176)
	at sun.reflect.NativeMethodAccessorImpl.invoke0(Native Method)
	at sun.reflect.NativeMethodAccessorImpl.invoke(NativeMethodAccessorImpl.java:62)
	at sun.reflect.DelegatingMethodAccessorImpl.invoke(DelegatingMethodAccessorImpl.java:43)
	at java.lang.reflect.Method.invoke(Method.java:498)
	at hudson.maven.Maven3Builder.call(Maven3Builder.java:139)
	at hudson.maven.Maven3Builder.call(Maven3Builder.java:70)
	at hudson.remoting.UserRequest.perform(UserRequest.java:212)
	at hudson.remoting.UserRequest.perform(UserRequest.java:54)
	at hudson.remoting.Request$2.run(Request.java:369)
	at hudson.remoting.InterceptingExecutorService$1.call(InterceptingExecutorService.java:72)
	at java.util.concurrent.FutureTask.run(FutureTask.java:266)
	at java.util.concurrent.ThreadPoolExecutor.runWorker(ThreadPoolExecutor.java:1149)
	at java.util.concurrent.ThreadPoolExecutor$Worker.run(ThreadPoolExecutor.java:624)
	at java.lang.Thread.run(Thread.java:748)
Caused by: org.apache.maven.plugin.MojoExecutionException: Build error
	at org.eluder.coveralls.maven.plugin.CoverallsReportMojo.execute(CoverallsReportMojo.java:261)
	at org.apache.maven.plugin.DefaultBuildPluginManager.executeMojo(DefaultBuildPluginManager.java:134)
	at org.apache.maven.lifecycle.internal.MojoExecutor.execute(MojoExecutor.java:207)
	... 31 more
Caused by: java.lang.IllegalArgumentException: Line number 228 is greater than the source
file integration/presto/src/main/java/org/apache/carbondata/presto/CarbondataPageSource.java
size
	at org.eluder.coveralls.maven.plugin.domain.Source.addCoverage(Source.java:92)
	at org.eluder.coveralls.maven.plugin.parser.JaCoCoParser.onEvent(JaCoCoParser.java:61)
	at org.eluder.coveralls.maven.plugin.parser.AbstractXmlEventParser.parse(AbstractXmlEventParser.java:64)
	at org.eluder.coveralls.maven.plugin.CoverallsReportMojo.writeCoveralls(CoverallsReportMojo.java:386)
	at org.eluder.coveralls.maven.plugin.CoverallsReportMojo.execute(CoverallsReportMojo.java:250)
	... 33 more
[ERROR] 
[ERROR] Re-run Maven using the -X switch to enable full debug logging.
[ERROR] 
[ERROR] For more information about the errors and possible solutions, please read the following
articles:
[ERROR] [Help 1] http://cwiki.apache.org/confluence/display/MAVEN/MojoExecutionException
[JENKINS] Archiving <https://builds.apache.org/job/carbondata-master-spark-2.2/ws/processing/pom.xml>
to org.apache.carbondata/carbondata-processing/1.5.0-SNAPSHOT/carbondata-processing-1.5.0-SNAPSHOT.pom
[JENKINS] Archiving <https://builds.apache.org/job/carbondata-master-spark-2.2/ws/processing/target/carbondata-processing-1.5.0-SNAPSHOT.jar>
to org.apache.carbondata/carbondata-processing/1.5.0-SNAPSHOT/carbondata-processing-1.5.0-SNAPSHOT.jar
[Fast Archiver] No artifacts from carbondata-master-spark-2.2 » Apache CarbonData :: Processing
#603 to compare, so performing full copy of artifacts
[JENKINS] Archiving <https://builds.apache.org/job/carbondata-master-spark-2.2/ws/datamap/examples/pom.xml>
to org.apache.carbondata/carbondata-datamap-examples/1.5.0-SNAPSHOT/carbondata-datamap-examples-1.5.0-SNAPSHOT.pom
[JENKINS] Archiving <https://builds.apache.org/job/carbondata-master-spark-2.2/ws/datamap/examples/target/carbondata-datamap-examples-1.5.0-SNAPSHOT.jar>
to org.apache.carbondata/carbondata-datamap-examples/1.5.0-SNAPSHOT/carbondata-datamap-examples-1.5.0-SNAPSHOT.jar
[JENKINS] Archiving <https://builds.apache.org/job/carbondata-master-spark-2.2/ws/store/search/pom.xml>
to org.apache.carbondata/carbondata-search/1.5.0-SNAPSHOT/carbondata-search-1.5.0-SNAPSHOT.pom
[JENKINS] Archiving <https://builds.apache.org/job/carbondata-master-spark-2.2/ws/store/search/target/carbondata-search-1.5.0-SNAPSHOT.jar>
to org.apache.carbondata/carbondata-search/1.5.0-SNAPSHOT/carbondata-search-1.5.0-SNAPSHOT.jar
[Fast Archiver] No artifacts from carbondata-master-spark-2.2 » Apache CarbonData :: Search
#603 to compare, so performing full copy of artifacts
[JENKINS] Archiving <https://builds.apache.org/job/carbondata-master-spark-2.2/ws/streaming/pom.xml>
to org.apache.carbondata/carbondata-streaming/1.5.0-SNAPSHOT/carbondata-streaming-1.5.0-SNAPSHOT.pom
[JENKINS] Archiving <https://builds.apache.org/job/carbondata-master-spark-2.2/ws/streaming/target/carbondata-streaming-1.5.0-SNAPSHOT.jar>
to org.apache.carbondata/carbondata-streaming/1.5.0-SNAPSHOT/carbondata-streaming-1.5.0-SNAPSHOT.jar
[Fast Archiver] No artifacts from carbondata-master-spark-2.2 » Apache CarbonData :: Streaming
#603 to compare, so performing full copy of artifacts
[JENKINS] Archiving <https://builds.apache.org/job/carbondata-master-spark-2.2/ws/integration/spark-common/pom.xml>
to org.apache.carbondata/carbondata-spark-common/1.5.0-SNAPSHOT/carbondata-spark-common-1.5.0-SNAPSHOT.pom
[JENKINS] Archiving <https://builds.apache.org/job/carbondata-master-spark-2.2/ws/integration/spark-common/target/carbondata-spark-common-1.5.0-SNAPSHOT.jar>
to org.apache.carbondata/carbondata-spark-common/1.5.0-SNAPSHOT/carbondata-spark-common-1.5.0-SNAPSHOT.jar
[Fast Archiver] No artifacts from carbondata-master-spark-2.2 » Apache CarbonData :: Spark
Common #603 to compare, so performing full copy of artifacts
[JENKINS] Archiving <https://builds.apache.org/job/carbondata-master-spark-2.2/ws/datamap/lucene/pom.xml>
to org.apache.carbondata/carbondata-lucene/1.5.0-SNAPSHOT/carbondata-lucene-1.5.0-SNAPSHOT.pom
[JENKINS] Archiving <https://builds.apache.org/job/carbondata-master-spark-2.2/ws/datamap/lucene/target/carbondata-lucene-1.5.0-SNAPSHOT.jar>
to org.apache.carbondata/carbondata-lucene/1.5.0-SNAPSHOT/carbondata-lucene-1.5.0-SNAPSHOT.jar
[Fast Archiver] No artifacts from carbondata-master-spark-2.2 » Apache CarbonData :: Lucene
Index DataMap #603 to compare, so performing full copy of artifacts
[JENKINS] Archiving <https://builds.apache.org/job/carbondata-master-spark-2.2/ws/integration/hive/pom.xml>
to org.apache.carbondata/carbondata-hive/1.5.0-SNAPSHOT/carbondata-hive-1.5.0-SNAPSHOT.pom
[JENKINS] Archiving <https://builds.apache.org/job/carbondata-master-spark-2.2/ws/integration/hive/target/carbondata-hive-1.5.0-SNAPSHOT.jar>
to org.apache.carbondata/carbondata-hive/1.5.0-SNAPSHOT/carbondata-hive-1.5.0-SNAPSHOT.jar
[JENKINS] Archiving <https://builds.apache.org/job/carbondata-master-spark-2.2/ws/common/pom.xml>
to org.apache.carbondata/carbondata-common/1.5.0-SNAPSHOT/carbondata-common-1.5.0-SNAPSHOT.pom
[JENKINS] Archiving <https://builds.apache.org/job/carbondata-master-spark-2.2/ws/common/target/carbondata-common-1.5.0-SNAPSHOT.jar>
to org.apache.carbondata/carbondata-common/1.5.0-SNAPSHOT/carbondata-common-1.5.0-SNAPSHOT.jar
[Fast Archiver] No artifacts from carbondata-master-spark-2.2 » Apache CarbonData :: Common
#603 to compare, so performing full copy of artifacts
[JENKINS] Archiving <https://builds.apache.org/job/carbondata-master-spark-2.2/ws/examples/spark2/pom.xml>
to org.apache.carbondata/carbondata-examples-spark2/1.5.0-SNAPSHOT/carbondata-examples-spark2-1.5.0-SNAPSHOT.pom
[JENKINS] Archiving <https://builds.apache.org/job/carbondata-master-spark-2.2/ws/examples/spark2/target/carbondata-examples-spark2-1.5.0-SNAPSHOT.jar>
to org.apache.carbondata/carbondata-examples-spark2/1.5.0-SNAPSHOT/carbondata-examples-spark2-1.5.0-SNAPSHOT.jar
[JENKINS] Archiving <https://builds.apache.org/job/carbondata-master-spark-2.2/ws/integration/spark2/pom.xml>
to org.apache.carbondata/carbondata-spark2/1.5.0-SNAPSHOT/carbondata-spark2-1.5.0-SNAPSHOT.pom
[JENKINS] Archiving <https://builds.apache.org/job/carbondata-master-spark-2.2/ws/integration/spark2/target/carbondata-spark2-1.5.0-SNAPSHOT.jar>
to org.apache.carbondata/carbondata-spark2/1.5.0-SNAPSHOT/carbondata-spark2-1.5.0-SNAPSHOT.jar
[JENKINS] Archiving <https://builds.apache.org/job/carbondata-master-spark-2.2/ws/datamap/bloom/pom.xml>
to org.apache.carbondata/carbondata-bloom/1.5.0-SNAPSHOT/carbondata-bloom-1.5.0-SNAPSHOT.pom
[JENKINS] Archiving <https://builds.apache.org/job/carbondata-master-spark-2.2/ws/datamap/bloom/target/carbondata-bloom-1.5.0-SNAPSHOT.jar>
to org.apache.carbondata/carbondata-bloom/1.5.0-SNAPSHOT/carbondata-bloom-1.5.0-SNAPSHOT.jar
[Fast Archiver] No artifacts from carbondata-master-spark-2.2 » Apache CarbonData :: Bloom
Index DataMap #603 to compare, so performing full copy of artifacts
[JENKINS] Archiving <https://builds.apache.org/job/carbondata-master-spark-2.2/ws/assembly/pom.xml>
to org.apache.carbondata/carbondata-assembly/1.5.0-SNAPSHOT/carbondata-assembly-1.5.0-SNAPSHOT.pom
[JENKINS] Archiving <https://builds.apache.org/job/carbondata-master-spark-2.2/ws/pom.xml>
to org.apache.carbondata/carbondata-parent/1.5.0-SNAPSHOT/carbondata-parent-1.5.0-SNAPSHOT.pom
[Fast Archiver] No artifacts from carbondata-master-spark-2.2 » Apache CarbonData :: Parent
#603 to compare, so performing full copy of artifacts
[JENKINS] Archiving <https://builds.apache.org/job/carbondata-master-spark-2.2/ws/core/pom.xml>
to org.apache.carbondata/carbondata-core/1.5.0-SNAPSHOT/carbondata-core-1.5.0-SNAPSHOT.pom
[JENKINS] Archiving <https://builds.apache.org/job/carbondata-master-spark-2.2/ws/core/target/carbondata-core-1.5.0-SNAPSHOT.jar>
to org.apache.carbondata/carbondata-core/1.5.0-SNAPSHOT/carbondata-core-1.5.0-SNAPSHOT.jar
[Fast Archiver] No artifacts from carbondata-master-spark-2.2 » Apache CarbonData :: Core
#603 to compare, so performing full copy of artifacts
[JENKINS] Archiving <https://builds.apache.org/job/carbondata-master-spark-2.2/ws/hadoop/pom.xml>
to org.apache.carbondata/carbondata-hadoop/1.5.0-SNAPSHOT/carbondata-hadoop-1.5.0-SNAPSHOT.pom
[JENKINS] Archiving <https://builds.apache.org/job/carbondata-master-spark-2.2/ws/hadoop/target/carbondata-hadoop-1.5.0-SNAPSHOT.jar>
to org.apache.carbondata/carbondata-hadoop/1.5.0-SNAPSHOT/carbondata-hadoop-1.5.0-SNAPSHOT.jar
[Fast Archiver] No artifacts from carbondata-master-spark-2.2 » Apache CarbonData :: Hadoop
#603 to compare, so performing full copy of artifacts
[JENKINS] Archiving <https://builds.apache.org/job/carbondata-master-spark-2.2/ws/integration/presto/pom.xml>
to org.apache.carbondata/carbondata-presto/1.5.0-SNAPSHOT/carbondata-presto-1.5.0-SNAPSHOT.pom
[JENKINS] Archiving <https://builds.apache.org/job/carbondata-master-spark-2.2/ws/integration/presto/target/carbondata-presto-1.5.0-SNAPSHOT.zip>
to org.apache.carbondata/carbondata-presto/1.5.0-SNAPSHOT/carbondata-presto-1.5.0-SNAPSHOT.zip
[JENKINS] Archiving <https://builds.apache.org/job/carbondata-master-spark-2.2/ws/integration/presto/target/carbondata-presto-1.5.0-SNAPSHOT.jar>
to org.apache.carbondata/carbondata-presto/1.5.0-SNAPSHOT/carbondata-presto-1.5.0-SNAPSHOT.jar
[Fast Archiver] Compressed 104.23 MB of artifacts by 94.9% relative to #601
[JENKINS] Archiving <https://builds.apache.org/job/carbondata-master-spark-2.2/ws/integration/spark-common-test/pom.xml>
to org.apache.carbondata/carbondata-spark-common-test/1.5.0-SNAPSHOT/carbondata-spark-common-test-1.5.0-SNAPSHOT.pom
[JENKINS] Archiving <https://builds.apache.org/job/carbondata-master-spark-2.2/ws/integration/spark-common-test/target/carbondata-spark-common-test-1.5.0-SNAPSHOT.jar>
to org.apache.carbondata/carbondata-spark-common-test/1.5.0-SNAPSHOT/carbondata-spark-common-test-1.5.0-SNAPSHOT.jar
[JENKINS] Archiving <https://builds.apache.org/job/carbondata-master-spark-2.2/ws/store/sdk/pom.xml>
to org.apache.carbondata/carbondata-store-sdk/1.5.0-SNAPSHOT/carbondata-store-sdk-1.5.0-SNAPSHOT.pom
[JENKINS] Archiving <https://builds.apache.org/job/carbondata-master-spark-2.2/ws/store/sdk/target/carbondata-store-sdk-1.5.0-SNAPSHOT.jar>
to org.apache.carbondata/carbondata-store-sdk/1.5.0-SNAPSHOT/carbondata-store-sdk-1.5.0-SNAPSHOT.jar
[Fast Archiver] No artifacts from carbondata-master-spark-2.2 » Apache CarbonData :: Store
SDK #603 to compare, so performing full copy of artifacts
Sending e-mails to: commits@carbondata.apache.org
Sending e-mails to: commits@carbondata.apache.org
channel stopped

Mime
View raw message