carbondata-commits mailing list archives

Site index · List index
Message view « Date » · « Thread »
Top « Date » · « Thread »
From Apache Jenkins Server <jenk...@builds.apache.org>
Subject Build failed in Jenkins: carbondata-master-spark-2.2 #591
Date Fri, 29 Jun 2018 09:14:17 GMT
See <https://builds.apache.org/job/carbondata-master-spark-2.2/591/display/redirect?page=changes>

Changes:

[ravipesala] [CARBONDATA-2585][CARBONDATA-2586][Local Dictionary]Local dictionary

------------------------------------------
[...truncated 21.02 KB...]
[INFO] --- jacoco-maven-plugin:0.7.9:check (default-check) @ carbondata-common ---
[INFO] Skipping JaCoCo execution due to missing execution data <https://builds.apache.org/job/carbondata-master-spark-2.2/ws/common/target/jacoco.exec>
[INFO] 
[INFO] --- maven-install-plugin:2.5.2:install (default-install) @ carbondata-common ---
[INFO] Installing <https://builds.apache.org/job/carbondata-master-spark-2.2/ws/common/target/carbondata-common-1.5.0-SNAPSHOT.jar>
to /home/jenkins/jenkins-slave/maven-repositories/1/org/apache/carbondata/carbondata-common/1.5.0-SNAPSHOT/carbondata-common-1.5.0-SNAPSHOT.jar
[INFO] Installing <https://builds.apache.org/job/carbondata-master-spark-2.2/ws/common/pom.xml>
to /home/jenkins/jenkins-slave/maven-repositories/1/org/apache/carbondata/carbondata-common/1.5.0-SNAPSHOT/carbondata-common-1.5.0-SNAPSHOT.pom
[INFO]                                                                         
[INFO] ------------------------------------------------------------------------
[INFO] Building Apache CarbonData :: Core 1.5.0-SNAPSHOT
[INFO] ------------------------------------------------------------------------
[INFO] Downloading: http://repository.apache.org/snapshots/org/apache/carbondata/carbondata-format/1.5.0-SNAPSHOT/maven-metadata.xml
[INFO] Downloading: http://repo1.maven.org/maven2/org/apache/carbondata/carbondata-format/1.5.0-SNAPSHOT/maven-metadata.xml
[INFO] Downloaded: http://repository.apache.org/snapshots/org/apache/carbondata/carbondata-format/1.5.0-SNAPSHOT/maven-metadata.xml
(788 B at 1.9 KB/sec)
[INFO] Downloading: http://repo1.maven.org/maven2/org/apache/carbondata/carbondata-format/1.5.0-SNAPSHOT/carbondata-format-1.5.0-20180628.082255-6.pom
[INFO] Downloading: http://repository.apache.org/snapshots/org/apache/carbondata/carbondata-format/1.5.0-SNAPSHOT/carbondata-format-1.5.0-20180628.082255-6.pom
[INFO] Downloaded: http://repository.apache.org/snapshots/org/apache/carbondata/carbondata-format/1.5.0-SNAPSHOT/carbondata-format-1.5.0-20180628.082255-6.pom
(3 KB at 8.3 KB/sec)
[INFO] Downloading: http://repository.apache.org/snapshots/org/apache/carbondata/carbondata-format/1.5.0-SNAPSHOT/carbondata-format-1.5.0-20180628.082255-6.jar
[INFO] Downloaded: http://repository.apache.org/snapshots/org/apache/carbondata/carbondata-format/1.5.0-SNAPSHOT/carbondata-format-1.5.0-20180628.082255-6.jar
(522 KB at 815.4 KB/sec)
[INFO] 
[INFO] --- maven-clean-plugin:2.5:clean (default-clean) @ carbondata-core ---
[INFO] 
[INFO] --- jacoco-maven-plugin:0.7.9:prepare-agent (default-prepare-agent) @ carbondata-core
---
[INFO] argLine set to -javaagent:/home/jenkins/jenkins-slave/maven-repositories/1/org/jacoco/org.jacoco.agent/0.7.9/org.jacoco.agent-0.7.9-runtime.jar=destfile=<https://builds.apache.org/job/carbondata-master-spark-2.2/ws/core/target/jacoco.exec>
[INFO] 
[INFO] --- maven-remote-resources-plugin:1.5:process (default) @ carbondata-core ---
[INFO] 
[INFO] --- exec-maven-plugin:1.2.1:exec (default) @ carbondata-core ---
[INFO] 
[INFO] --- maven-resources-plugin:2.7:resources (default-resources) @ carbondata-core ---
[INFO] Using 'UTF-8' encoding to copy filtered resources.
[INFO] Copying 1 resource
[INFO] Copying 1 resource
[INFO] Copying 3 resources
[INFO] 
[INFO] --- maven-compiler-plugin:3.2:compile (default-compile) @ carbondata-core ---
[INFO] Changes detected - recompiling the module!
[INFO] Compiling 645 source files to <https://builds.apache.org/job/carbondata-master-spark-2.2/ws/core/target/classes>
[WARNING] <https://builds.apache.org/job/carbondata-master-spark-2.2/ws/core/src/main/java/org/apache/carbondata/core/memory/CarbonUnsafe.java>:[23,16]
sun.misc.Unsafe is internal proprietary API and may be removed in a future release
[WARNING] <https://builds.apache.org/job/carbondata-master-spark-2.2/ws/core/src/main/java/org/apache/carbondata/core/memory/CarbonUnsafe.java>:[43,18]
sun.misc.Unsafe is internal proprietary API and may be removed in a future release
[WARNING] <https://builds.apache.org/job/carbondata-master-spark-2.2/ws/core/src/main/java/org/apache/carbondata/core/memory/CarbonUnsafe.java>:[47,21]
sun.misc.Unsafe is internal proprietary API and may be removed in a future release
[WARNING] <https://builds.apache.org/job/carbondata-master-spark-2.2/ws/core/src/main/java/org/apache/carbondata/core/memory/CarbonUnsafe.java>:[49,17]
sun.misc.Unsafe is internal proprietary API and may be removed in a future release
[WARNING] <https://builds.apache.org/job/carbondata-master-spark-2.2/ws/core/src/main/java/org/apache/carbondata/core/memory/CarbonUnsafe.java>:[70,17]
sun.misc.Unsafe is internal proprietary API and may be removed in a future release
[INFO] <https://builds.apache.org/job/carbondata-master-spark-2.2/ws/core/src/main/java/org/apache/carbondata/core/util/ByteUtil.java>:
<https://builds.apache.org/job/carbondata-master-spark-2.2/ws/core/src/main/java/org/apache/carbondata/core/util/ByteUtil.java>
uses or overrides a deprecated API.
[INFO] <https://builds.apache.org/job/carbondata-master-spark-2.2/ws/core/src/main/java/org/apache/carbondata/core/util/ByteUtil.java>:
Recompile with -Xlint:deprecation for details.
[INFO] <https://builds.apache.org/job/carbondata-master-spark-2.2/ws/core/src/main/java/org/apache/carbondata/core/metadata/schema/table/DataMapSchema.java>:
Some input files use unchecked or unsafe operations.
[INFO] <https://builds.apache.org/job/carbondata-master-spark-2.2/ws/core/src/main/java/org/apache/carbondata/core/metadata/schema/table/DataMapSchema.java>:
Recompile with -Xlint:unchecked for details.
[INFO] 
[INFO] >>> findbugs-maven-plugin:3.0.4:check (analyze-compile) > :findbugs @ carbondata-core
>>>
[INFO] 
[INFO] --- findbugs-maven-plugin:3.0.4:findbugs (findbugs) @ carbondata-core ---
[INFO] Fork Value is true
[INFO] Done FindBugs Analysis....
[INFO] 
[INFO] <<< findbugs-maven-plugin:3.0.4:check (analyze-compile) < :findbugs @ carbondata-core
<<<
[INFO] 
[INFO] --- findbugs-maven-plugin:3.0.4:check (analyze-compile) @ carbondata-core ---
[INFO] BugInstance size is 0
[INFO] Error size is 0
[INFO] No errors/warnings found
[INFO] 
[INFO] --- maven-resources-plugin:2.7:testResources (default-testResources) @ carbondata-core
---
[INFO] Using 'UTF-8' encoding to copy filtered resources.
[INFO] Copying 1 resource
[INFO] Copying 3 resources
[INFO] 
[INFO] --- maven-compiler-plugin:3.2:testCompile (default-testCompile) @ carbondata-core ---
[INFO] Changes detected - recompiling the module!
[INFO] Compiling 113 source files to <https://builds.apache.org/job/carbondata-master-spark-2.2/ws/core/target/test-classes>
[INFO] <https://builds.apache.org/job/carbondata-master-spark-2.2/ws/core/src/test/java/org/apache/carbondata/core/scan/expression/conditional/LessThanEqualToExpressionUnitTest.java>:
Some input files use or override a deprecated API.
[INFO] <https://builds.apache.org/job/carbondata-master-spark-2.2/ws/core/src/test/java/org/apache/carbondata/core/scan/expression/conditional/LessThanEqualToExpressionUnitTest.java>:
Recompile with -Xlint:deprecation for details.
[INFO] <https://builds.apache.org/job/carbondata-master-spark-2.2/ws/core/src/test/java/org/apache/carbondata/core/cache/dictionary/AbstractDictionaryCacheTest.java>:
Some input files use unchecked or unsafe operations.
[INFO] <https://builds.apache.org/job/carbondata-master-spark-2.2/ws/core/src/test/java/org/apache/carbondata/core/cache/dictionary/AbstractDictionaryCacheTest.java>:
Recompile with -Xlint:unchecked for details.
[INFO] -------------------------------------------------------------
[WARNING] COMPILATION WARNING : 
[INFO] -------------------------------------------------------------
[WARNING] <https://builds.apache.org/job/carbondata-master-spark-2.2/ws/core/src/test/java/org/apache/carbondata/core/datastore/filesystem/LocalCarbonFileTest.java>:[27,18]
sun.nio.ch.FileChannelImpl is internal proprietary API and may be removed in a future release
[WARNING] <https://builds.apache.org/job/carbondata-master-spark-2.2/ws/core/src/test/java/org/apache/carbondata/core/datastore/filesystem/LocalCarbonFileTest.java>:[200,20]
sun.nio.ch.FileChannelImpl is internal proprietary API and may be removed in a future release
[INFO] 2 warnings 
[INFO] -------------------------------------------------------------
[INFO] -------------------------------------------------------------
[ERROR] COMPILATION ERROR : 
[INFO] -------------------------------------------------------------
[ERROR] <https://builds.apache.org/job/carbondata-master-spark-2.2/ws/core/src/test/java/org/apache/carbondata/core/localdictionary/TestPageLevelDictionary.java>:[29,42]
constructor ColumnLocalDictionaryGenerator in class org.apache.carbondata.core.localdictionary.generator.ColumnLocalDictionaryGenerator
cannot be applied to given types;
  required: int,int
  found: int
  reason: actual and formal argument lists differ in length
[ERROR] <https://builds.apache.org/job/carbondata-master-spark-2.2/ws/core/src/test/java/org/apache/carbondata/core/localdictionary/TestPageLevelDictionary.java>:[44,42]
constructor ColumnLocalDictionaryGenerator in class org.apache.carbondata.core.localdictionary.generator.ColumnLocalDictionaryGenerator
cannot be applied to given types;
  required: int,int
  found: int
  reason: actual and formal argument lists differ in length
[ERROR] <https://builds.apache.org/job/carbondata-master-spark-2.2/ws/core/src/test/java/org/apache/carbondata/core/localdictionary/TestPageLevelDictionary.java>:[96,42]
constructor ColumnLocalDictionaryGenerator in class org.apache.carbondata.core.localdictionary.generator.ColumnLocalDictionaryGenerator
cannot be applied to given types;
  required: int,int
  found: int
  reason: actual and formal argument lists differ in length
[ERROR] <https://builds.apache.org/job/carbondata-master-spark-2.2/ws/core/src/test/java/org/apache/carbondata/core/localdictionary/TestLocalDictionaryGenerator.java>:[33,42]
constructor ColumnLocalDictionaryGenerator in class org.apache.carbondata.core.localdictionary.generator.ColumnLocalDictionaryGenerator
cannot be applied to given types;
  required: int,int
  found: int
  reason: actual and formal argument lists differ in length
[ERROR] <https://builds.apache.org/job/carbondata-master-spark-2.2/ws/core/src/test/java/org/apache/carbondata/core/localdictionary/TestLocalDictionaryGenerator.java>:[54,42]
constructor ColumnLocalDictionaryGenerator in class org.apache.carbondata.core.localdictionary.generator.ColumnLocalDictionaryGenerator
cannot be applied to given types;
  required: int,int
  found: int
  reason: actual and formal argument lists differ in length
[ERROR] <https://builds.apache.org/job/carbondata-master-spark-2.2/ws/core/src/test/java/org/apache/carbondata/core/localdictionary/TestLocalDictionaryGenerator.java>:[68,42]
constructor ColumnLocalDictionaryGenerator in class org.apache.carbondata.core.localdictionary.generator.ColumnLocalDictionaryGenerator
cannot be applied to given types;
  required: int,int
  found: int
  reason: actual and formal argument lists differ in length
[INFO] 6 errors 
[INFO] -------------------------------------------------------------
[INFO]                                                                         
[INFO] ------------------------------------------------------------------------
[INFO] Skipping Apache CarbonData :: Parent
[INFO] This project has been banned from the build due to previous failures.
[INFO] ------------------------------------------------------------------------
[INFO] ------------------------------------------------------------------------
[INFO] Reactor Summary:
[INFO] 
[INFO] Apache CarbonData :: Parent ........................ SUCCESS [ 17.400 s]
[INFO] Apache CarbonData :: Common ........................ SUCCESS [ 18.183 s]
[INFO] Apache CarbonData :: Core .......................... FAILURE [ 44.670 s]
[INFO] Apache CarbonData :: Processing .................... SKIPPED
[INFO] Apache CarbonData :: Hadoop ........................ SKIPPED
[INFO] Apache CarbonData :: Streaming ..................... SKIPPED
[INFO] Apache CarbonData :: Spark Common .................. SKIPPED
[INFO] Apache CarbonData :: Store SDK ..................... SKIPPED
[INFO] Apache CarbonData :: Search ........................ SKIPPED
[INFO] Apache CarbonData :: Lucene Index DataMap .......... SKIPPED
[INFO] Apache CarbonData :: Bloom Index DataMap ........... SKIPPED
[INFO] Apache CarbonData :: Spark2 ........................ SKIPPED
[INFO] Apache CarbonData :: Spark Common Test ............. SKIPPED
[INFO] Apache CarbonData :: DataMap Examples .............. SKIPPED
[INFO] Apache CarbonData :: Assembly ...................... SKIPPED
[INFO] Apache CarbonData :: Hive .......................... SKIPPED
[INFO] Apache CarbonData :: presto ........................ SKIPPED
[INFO] Apache CarbonData :: Spark2 Examples ............... SKIPPED
[INFO] ------------------------------------------------------------------------
[INFO] BUILD FAILURE
[INFO] ------------------------------------------------------------------------
[INFO] Total time: 01:52 min
[INFO] Finished at: 2018-06-29T09:13:14+00:00
[INFO] Final Memory: 78M/1032M
[INFO] ------------------------------------------------------------------------
Waiting for Jenkins to finish collecting data
[ERROR] Failed to execute goal org.apache.maven.plugins:maven-compiler-plugin:3.2:testCompile
(default-testCompile) on project carbondata-core: Compilation failure: Compilation failure:
[ERROR] <https://builds.apache.org/job/carbondata-master-spark-2.2/ws/core/src/test/java/org/apache/carbondata/core/localdictionary/TestPageLevelDictionary.java>:[29,42]
constructor ColumnLocalDictionaryGenerator in class org.apache.carbondata.core.localdictionary.generator.ColumnLocalDictionaryGenerator
cannot be applied to given types;
[ERROR] required: int,int
[ERROR] found: int
[ERROR] reason: actual and formal argument lists differ in length
[ERROR] <https://builds.apache.org/job/carbondata-master-spark-2.2/ws/core/src/test/java/org/apache/carbondata/core/localdictionary/TestPageLevelDictionary.java>:[44,42]
constructor ColumnLocalDictionaryGenerator in class org.apache.carbondata.core.localdictionary.generator.ColumnLocalDictionaryGenerator
cannot be applied to given types;
[ERROR] required: int,int
[ERROR] found: int
[ERROR] reason: actual and formal argument lists differ in length
[ERROR] <https://builds.apache.org/job/carbondata-master-spark-2.2/ws/core/src/test/java/org/apache/carbondata/core/localdictionary/TestPageLevelDictionary.java>:[96,42]
constructor ColumnLocalDictionaryGenerator in class org.apache.carbondata.core.localdictionary.generator.ColumnLocalDictionaryGenerator
cannot be applied to given types;
[ERROR] required: int,int
[ERROR] found: int
[ERROR] reason: actual and formal argument lists differ in length
[ERROR] <https://builds.apache.org/job/carbondata-master-spark-2.2/ws/core/src/test/java/org/apache/carbondata/core/localdictionary/TestLocalDictionaryGenerator.java>:[33,42]
constructor ColumnLocalDictionaryGenerator in class org.apache.carbondata.core.localdictionary.generator.ColumnLocalDictionaryGenerator
cannot be applied to given types;
[ERROR] required: int,int
[ERROR] found: int
[ERROR] reason: actual and formal argument lists differ in length
[ERROR] <https://builds.apache.org/job/carbondata-master-spark-2.2/ws/core/src/test/java/org/apache/carbondata/core/localdictionary/TestLocalDictionaryGenerator.java>:[54,42]
constructor ColumnLocalDictionaryGenerator in class org.apache.carbondata.core.localdictionary.generator.ColumnLocalDictionaryGenerator
cannot be applied to given types;
[ERROR] required: int,int
[ERROR] found: int
[ERROR] reason: actual and formal argument lists differ in length
[ERROR] <https://builds.apache.org/job/carbondata-master-spark-2.2/ws/core/src/test/java/org/apache/carbondata/core/localdictionary/TestLocalDictionaryGenerator.java>:[68,42]
constructor ColumnLocalDictionaryGenerator in class org.apache.carbondata.core.localdictionary.generator.ColumnLocalDictionaryGenerator
cannot be applied to given types;
[ERROR] required: int,int
[ERROR] found: int
[ERROR] reason: actual and formal argument lists differ in length
[ERROR] -> [Help 1]
org.apache.maven.lifecycle.LifecycleExecutionException: Failed to execute goal org.apache.maven.plugins:maven-compiler-plugin:3.2:testCompile
(default-testCompile) on project carbondata-core: Compilation failure
	at org.apache.maven.lifecycle.internal.MojoExecutor.execute(MojoExecutor.java:212)
	at org.apache.maven.lifecycle.internal.MojoExecutor.execute(MojoExecutor.java:153)
	at org.apache.maven.lifecycle.internal.MojoExecutor.execute(MojoExecutor.java:145)
	at org.apache.maven.lifecycle.internal.LifecycleModuleBuilder.buildProject(LifecycleModuleBuilder.java:116)
	at org.apache.maven.lifecycle.internal.LifecycleModuleBuilder.buildProject(LifecycleModuleBuilder.java:80)
	at org.apache.maven.lifecycle.internal.builder.singlethreaded.SingleThreadedBuilder.build(SingleThreadedBuilder.java:51)
	at org.apache.maven.lifecycle.internal.LifecycleStarter.execute(LifecycleStarter.java:128)
	at org.apache.maven.DefaultMaven.doExecute(DefaultMaven.java:307)
	at org.apache.maven.DefaultMaven.doExecute(DefaultMaven.java:193)
	at org.apache.maven.DefaultMaven.execute(DefaultMaven.java:106)
	at org.jvnet.hudson.maven3.launcher.Maven33Launcher.main(Maven33Launcher.java:129)
	at sun.reflect.NativeMethodAccessorImpl.invoke0(Native Method)
	at sun.reflect.NativeMethodAccessorImpl.invoke(NativeMethodAccessorImpl.java:62)
	at sun.reflect.DelegatingMethodAccessorImpl.invoke(DelegatingMethodAccessorImpl.java:43)
	at java.lang.reflect.Method.invoke(Method.java:498)
	at org.codehaus.plexus.classworlds.launcher.Launcher.launchStandard(Launcher.java:330)
	at org.codehaus.plexus.classworlds.launcher.Launcher.launch(Launcher.java:238)
	at jenkins.maven3.agent.Maven33Main.launch(Maven33Main.java:176)
	at sun.reflect.NativeMethodAccessorImpl.invoke0(Native Method)
	at sun.reflect.NativeMethodAccessorImpl.invoke(NativeMethodAccessorImpl.java:62)
	at sun.reflect.DelegatingMethodAccessorImpl.invoke(DelegatingMethodAccessorImpl.java:43)
	at java.lang.reflect.Method.invoke(Method.java:498)
	at hudson.maven.Maven3Builder.call(Maven3Builder.java:139)
	at hudson.maven.Maven3Builder.call(Maven3Builder.java:70)
	at hudson.remoting.UserRequest.perform(UserRequest.java:207)
	at hudson.remoting.UserRequest.perform(UserRequest.java:53)
	at hudson.remoting.Request$2.run(Request.java:358)
	at hudson.remoting.InterceptingExecutorService$1.call(InterceptingExecutorService.java:72)
	at java.util.concurrent.FutureTask.run(FutureTask.java:266)
	at java.util.concurrent.ThreadPoolExecutor.runWorker(ThreadPoolExecutor.java:1149)
	at java.util.concurrent.ThreadPoolExecutor$Worker.run(ThreadPoolExecutor.java:624)
	at java.lang.Thread.run(Thread.java:748)
Caused by: org.apache.maven.plugin.compiler.CompilationFailureException: Compilation failure
	at org.apache.maven.plugin.compiler.AbstractCompilerMojo.execute(AbstractCompilerMojo.java:909)
	at org.apache.maven.plugin.compiler.TestCompilerMojo.execute(TestCompilerMojo.java:153)
	at org.apache.maven.plugin.DefaultBuildPluginManager.executeMojo(DefaultBuildPluginManager.java:134)
	at org.apache.maven.lifecycle.internal.MojoExecutor.execute(MojoExecutor.java:207)
	... 31 more
[ERROR] 
[ERROR] Re-run Maven using the -X switch to enable full debug logging.
[ERROR] 
[ERROR] For more information about the errors and possible solutions, please read the following
articles:
[ERROR] [Help 1] http://cwiki.apache.org/confluence/display/MAVEN/MojoFailureException
[ERROR] 
[ERROR] After correcting the problems, you can resume the build with the command
[ERROR]   mvn <goals> -rf :carbondata-core
[JENKINS] Archiving <https://builds.apache.org/job/carbondata-master-spark-2.2/ws/processing/pom.xml>
to org.apache.carbondata/carbondata-processing/1.5.0-SNAPSHOT/carbondata-processing-1.5.0-SNAPSHOT.pom
[Fast Archiver] No artifacts from carbondata-master-spark-2.2 » Apache CarbonData :: Processing
#590 to compare, so performing full copy of artifacts
[JENKINS] Archiving <https://builds.apache.org/job/carbondata-master-spark-2.2/ws/datamap/examples/pom.xml>
to org.apache.carbondata/carbondata-datamap-examples/1.5.0-SNAPSHOT/carbondata-datamap-examples-1.5.0-SNAPSHOT.pom
[JENKINS] Archiving <https://builds.apache.org/job/carbondata-master-spark-2.2/ws/store/search/pom.xml>
to org.apache.carbondata/carbondata-search/1.5.0-SNAPSHOT/carbondata-search-1.5.0-SNAPSHOT.pom
[Fast Archiver] No artifacts from carbondata-master-spark-2.2 » Apache CarbonData :: Search
#590 to compare, so performing full copy of artifacts
[JENKINS] Archiving <https://builds.apache.org/job/carbondata-master-spark-2.2/ws/streaming/pom.xml>
to org.apache.carbondata/carbondata-streaming/1.5.0-SNAPSHOT/carbondata-streaming-1.5.0-SNAPSHOT.pom
[Fast Archiver] No artifacts from carbondata-master-spark-2.2 » Apache CarbonData :: Streaming
#590 to compare, so performing full copy of artifacts
[JENKINS] Archiving <https://builds.apache.org/job/carbondata-master-spark-2.2/ws/integration/spark-common/pom.xml>
to org.apache.carbondata/carbondata-spark-common/1.5.0-SNAPSHOT/carbondata-spark-common-1.5.0-SNAPSHOT.pom
[Fast Archiver] No artifacts from carbondata-master-spark-2.2 » Apache CarbonData :: Spark
Common #590 to compare, so performing full copy of artifacts
[JENKINS] Archiving <https://builds.apache.org/job/carbondata-master-spark-2.2/ws/datamap/lucene/pom.xml>
to org.apache.carbondata/carbondata-lucene/1.5.0-SNAPSHOT/carbondata-lucene-1.5.0-SNAPSHOT.pom
[Fast Archiver] No artifacts from carbondata-master-spark-2.2 » Apache CarbonData :: Lucene
Index DataMap #590 to compare, so performing full copy of artifacts
[JENKINS] Archiving <https://builds.apache.org/job/carbondata-master-spark-2.2/ws/integration/hive/pom.xml>
to org.apache.carbondata/carbondata-hive/1.5.0-SNAPSHOT/carbondata-hive-1.5.0-SNAPSHOT.pom
[JENKINS] Archiving <https://builds.apache.org/job/carbondata-master-spark-2.2/ws/common/pom.xml>
to org.apache.carbondata/carbondata-common/1.5.0-SNAPSHOT/carbondata-common-1.5.0-SNAPSHOT.pom
[JENKINS] Archiving <https://builds.apache.org/job/carbondata-master-spark-2.2/ws/common/target/carbondata-common-1.5.0-SNAPSHOT.jar>
to org.apache.carbondata/carbondata-common/1.5.0-SNAPSHOT/carbondata-common-1.5.0-SNAPSHOT.jar
[Fast Archiver] No artifacts from carbondata-master-spark-2.2 » Apache CarbonData :: Common
#590 to compare, so performing full copy of artifacts
[JENKINS] Archiving <https://builds.apache.org/job/carbondata-master-spark-2.2/ws/examples/spark2/pom.xml>
to org.apache.carbondata/carbondata-examples-spark2/1.5.0-SNAPSHOT/carbondata-examples-spark2-1.5.0-SNAPSHOT.pom
[JENKINS] Archiving <https://builds.apache.org/job/carbondata-master-spark-2.2/ws/integration/spark2/pom.xml>
to org.apache.carbondata/carbondata-spark2/1.5.0-SNAPSHOT/carbondata-spark2-1.5.0-SNAPSHOT.pom
[Fast Archiver] No artifacts from carbondata-master-spark-2.2 » Apache CarbonData :: Spark2
#590 to compare, so performing full copy of artifacts
[JENKINS] Archiving <https://builds.apache.org/job/carbondata-master-spark-2.2/ws/datamap/bloom/pom.xml>
to org.apache.carbondata/carbondata-bloom/1.5.0-SNAPSHOT/carbondata-bloom-1.5.0-SNAPSHOT.pom
[Fast Archiver] No artifacts from carbondata-master-spark-2.2 » Apache CarbonData :: Bloom
Index DataMap #590 to compare, so performing full copy of artifacts
[JENKINS] Archiving <https://builds.apache.org/job/carbondata-master-spark-2.2/ws/assembly/pom.xml>
to org.apache.carbondata/carbondata-assembly/1.5.0-SNAPSHOT/carbondata-assembly-1.5.0-SNAPSHOT.pom
[JENKINS] Archiving <https://builds.apache.org/job/carbondata-master-spark-2.2/ws/pom.xml>
to org.apache.carbondata/carbondata-parent/1.5.0-SNAPSHOT/carbondata-parent-1.5.0-SNAPSHOT.pom
[Fast Archiver] No artifacts from carbondata-master-spark-2.2 » Apache CarbonData :: Parent
#590 to compare, so performing full copy of artifacts
[JENKINS] Archiving <https://builds.apache.org/job/carbondata-master-spark-2.2/ws/core/pom.xml>
to org.apache.carbondata/carbondata-core/1.5.0-SNAPSHOT/carbondata-core-1.5.0-SNAPSHOT.pom
[Fast Archiver] No artifacts from carbondata-master-spark-2.2 » Apache CarbonData :: Core
#590 to compare, so performing full copy of artifacts
[JENKINS] Archiving <https://builds.apache.org/job/carbondata-master-spark-2.2/ws/hadoop/pom.xml>
to org.apache.carbondata/carbondata-hadoop/1.5.0-SNAPSHOT/carbondata-hadoop-1.5.0-SNAPSHOT.pom
[Fast Archiver] No artifacts from carbondata-master-spark-2.2 » Apache CarbonData :: Hadoop
#590 to compare, so performing full copy of artifacts
[JENKINS] Archiving <https://builds.apache.org/job/carbondata-master-spark-2.2/ws/integration/presto/pom.xml>
to org.apache.carbondata/carbondata-presto/1.5.0-SNAPSHOT/carbondata-presto-1.5.0-SNAPSHOT.pom
[JENKINS] Archiving <https://builds.apache.org/job/carbondata-master-spark-2.2/ws/integration/spark-common-test/pom.xml>
to org.apache.carbondata/carbondata-spark-common-test/1.5.0-SNAPSHOT/carbondata-spark-common-test-1.5.0-SNAPSHOT.pom
[JENKINS] Archiving <https://builds.apache.org/job/carbondata-master-spark-2.2/ws/store/sdk/pom.xml>
to org.apache.carbondata/carbondata-store-sdk/1.5.0-SNAPSHOT/carbondata-store-sdk-1.5.0-SNAPSHOT.pom
[Fast Archiver] No artifacts from carbondata-master-spark-2.2 » Apache CarbonData :: Store
SDK #590 to compare, so performing full copy of artifacts
Sending e-mails to: commits@carbondata.apache.org ravi.pesala@gmail.com
channel stopped
Not sending mail to unregistered user jacky.likun@qq.com

Mime
View raw message