carbondata-commits mailing list archives

Site index · List index
Message view « Date » · « Thread »
Top « Date » · « Thread »
From Apache Jenkins Server <jenk...@builds.apache.org>
Subject Build failed in Jenkins: carbondata-master-spark-2.1 #2498
Date Tue, 12 Jun 2018 18:06:00 GMT
See <https://builds.apache.org/job/carbondata-master-spark-2.1/2498/display/redirect?page=changes>

Changes:

[jacky.likun] [CARBONDATA-2309][DataLoad] Add strategy to generate bigger carbondata

------------------------------------------
[...truncated 55.88 KB...]
Running org.apache.carbondata.core.dictionary.generator.IncrementalColumnDictionaryGeneratorTest
true/tmp/tmp/test/TestTable/Metadata/empNameCol.dict
Tests run: 7, Failures: 0, Errors: 0, Skipped: 0, Time elapsed: 0.008 sec - in org.apache.carbondata.core.dictionary.generator.IncrementalColumnDictionaryGeneratorTest
Running org.apache.carbondata.core.dictionary.generator.TableDictionaryGeneratorTest
Tests run: 6, Failures: 0, Errors: 0, Skipped: 0, Time elapsed: 0.011 sec - in org.apache.carbondata.core.dictionary.generator.TableDictionaryGeneratorTest
Running org.apache.carbondata.core.dictionary.client.DictionaryClientTest
Tests run: 2, Failures: 0, Errors: 0, Skipped: 0, Time elapsed: 6.947 sec - in org.apache.carbondata.core.dictionary.client.DictionaryClientTest
Running org.apache.carbondata.core.CarbonPropertiesValidationTest
Tests run: 13, Failures: 0, Errors: 0, Skipped: 0, Time elapsed: 0.047 sec - in org.apache.carbondata.core.CarbonPropertiesValidationTest
Running org.apache.carbondata.core.memory.MemoryAllocatorUnitTest
Tests run: 2, Failures: 0, Errors: 0, Skipped: 0, Time elapsed: 0.003 sec - in org.apache.carbondata.core.memory.MemoryAllocatorUnitTest

Results :

Tests run: 806, Failures: 0, Errors: 0, Skipped: 0

[JENKINS] Recording test results
[INFO] 
[INFO] --- maven-jar-plugin:2.5:jar (default-jar) @ carbondata-core ---
[INFO] Building jar: <https://builds.apache.org/job/carbondata-master-spark-2.1/ws/core/target/carbondata-core-1.5.0-SNAPSHOT.jar>
[INFO] 
[INFO] --- maven-site-plugin:3.4:attach-descriptor (attach-descriptor) @ carbondata-core ---
[INFO] 
[INFO] --- jacoco-maven-plugin:0.7.9:prepare-agent-integration (default-prepare-agent-integration)
@ carbondata-core ---
[INFO] argLine set to -javaagent:/home/jenkins/jenkins-slave/maven-repositories/0/org/jacoco/org.jacoco.agent/0.7.9/org.jacoco.agent-0.7.9-runtime.jar=destfile=<https://builds.apache.org/job/carbondata-master-spark-2.1/ws/core/target/jacoco-it.exec>
[INFO] 
[INFO] --- maven-checkstyle-plugin:2.17:check (default) @ carbondata-core ---
[INFO] Starting audit...
Audit done.
[INFO] 
[INFO] --- scalastyle-maven-plugin:0.8.0:check (default) @ carbondata-core ---
[WARNING] sourceDirectory is not specified or does not exist value=<https://builds.apache.org/job/carbondata-master-spark-2.1/ws/core/src/main/scala>
Saving to outputFile=<https://builds.apache.org/job/carbondata-master-spark-2.1/ws/core/target/scalastyle-output.xml>
Processed 0 file(s)
Found 0 errors
Found 0 warnings
Found 0 infos
Finished in 1 ms
[INFO] 
[INFO] --- jacoco-maven-plugin:0.7.9:report (default-report) @ carbondata-core ---
[INFO] Loading execution data file <https://builds.apache.org/job/carbondata-master-spark-2.1/ws/core/target/jacoco.exec>
[INFO] Analyzed bundle 'Apache CarbonData :: Core' with 707 classes
[INFO] 
[INFO] --- jacoco-maven-plugin:0.7.9:report-integration (default-report-integration) @ carbondata-core
---
[INFO] Skipping JaCoCo execution due to missing execution data file.
[INFO] 
[INFO] --- jacoco-maven-plugin:0.7.9:check (default-check) @ carbondata-core ---
[INFO] Loading execution data file <https://builds.apache.org/job/carbondata-master-spark-2.1/ws/core/target/jacoco.exec>
[INFO] Analyzed bundle 'carbondata-core' with 0 classes
[INFO] All coverage checks have been met.
[INFO] 
[INFO] --- maven-install-plugin:2.5.2:install (default-install) @ carbondata-core ---
[INFO] Installing <https://builds.apache.org/job/carbondata-master-spark-2.1/ws/core/target/carbondata-core-1.5.0-SNAPSHOT.jar>
to /home/jenkins/jenkins-slave/maven-repositories/0/org/apache/carbondata/carbondata-core/1.5.0-SNAPSHOT/carbondata-core-1.5.0-SNAPSHOT.jar
[INFO] Installing <https://builds.apache.org/job/carbondata-master-spark-2.1/ws/core/pom.xml>
to /home/jenkins/jenkins-slave/maven-repositories/0/org/apache/carbondata/carbondata-core/1.5.0-SNAPSHOT/carbondata-core-1.5.0-SNAPSHOT.pom
[INFO]                                                                         
[INFO] ------------------------------------------------------------------------
[INFO] Building Apache CarbonData :: Processing 1.5.0-SNAPSHOT
[INFO] ------------------------------------------------------------------------
[INFO] 
[INFO] --- maven-clean-plugin:2.5:clean (default-clean) @ carbondata-processing ---
[INFO] Deleting <https://builds.apache.org/job/carbondata-master-spark-2.1/ws/processing/target>
[INFO] 
[INFO] --- jacoco-maven-plugin:0.7.9:prepare-agent (default-prepare-agent) @ carbondata-processing
---
[INFO] argLine set to -javaagent:/home/jenkins/jenkins-slave/maven-repositories/0/org/jacoco/org.jacoco.agent/0.7.9/org.jacoco.agent-0.7.9-runtime.jar=destfile=<https://builds.apache.org/job/carbondata-master-spark-2.1/ws/processing/target/jacoco.exec>
[INFO] 
[INFO] --- maven-remote-resources-plugin:1.5:process (default) @ carbondata-processing ---
[INFO] 
[INFO] --- maven-resources-plugin:2.7:resources (default-resources) @ carbondata-processing
---
[INFO] Using 'UTF-8' encoding to copy filtered resources.
[INFO] Copying 1 resource
[INFO] Copying 1 resource
[INFO] Copying 3 resources
[INFO] 
[INFO] --- maven-compiler-plugin:3.2:compile (default-compile) @ carbondata-processing ---
[INFO] Changes detected - recompiling the module!
[INFO] Compiling 149 source files to <https://builds.apache.org/job/carbondata-master-spark-2.1/ws/processing/target/classes>
[INFO] <https://builds.apache.org/job/carbondata-master-spark-2.1/ws/processing/src/main/java/org/apache/carbondata/processing/merger/CarbonDataMergerUtil.java>:
<https://builds.apache.org/job/carbondata-master-spark-2.1/ws/processing/src/main/java/org/apache/carbondata/processing/merger/CarbonDataMergerUtil.java>
uses or overrides a deprecated API.
[INFO] <https://builds.apache.org/job/carbondata-master-spark-2.1/ws/processing/src/main/java/org/apache/carbondata/processing/merger/CarbonDataMergerUtil.java>:
Recompile with -Xlint:deprecation for details.
[INFO] <https://builds.apache.org/job/carbondata-master-spark-2.1/ws/processing/src/main/java/org/apache/carbondata/processing/loading/sort/impl/UnsafeParallelReadMergeSorterWithColumnRangeImpl.java>:
Some input files use unchecked or unsafe operations.
[INFO] <https://builds.apache.org/job/carbondata-master-spark-2.1/ws/processing/src/main/java/org/apache/carbondata/processing/loading/sort/impl/UnsafeParallelReadMergeSorterWithColumnRangeImpl.java>:
Recompile with -Xlint:unchecked for details.
[INFO] 
[INFO] >>> findbugs-maven-plugin:3.0.4:check (analyze-compile) > :findbugs @ carbondata-processing
>>>
[INFO] 
[INFO] --- findbugs-maven-plugin:3.0.4:findbugs (findbugs) @ carbondata-processing ---
[INFO] Fork Value is true
[INFO] Done FindBugs Analysis....
[INFO] 
[INFO] <<< findbugs-maven-plugin:3.0.4:check (analyze-compile) < :findbugs @ carbondata-processing
<<<
[INFO] 
[INFO] --- findbugs-maven-plugin:3.0.4:check (analyze-compile) @ carbondata-processing ---
[INFO] BugInstance size is 0
[INFO] Error size is 0
[INFO] No errors/warnings found
[INFO] 
[INFO] --- maven-resources-plugin:2.7:testResources (default-testResources) @ carbondata-processing
---
[INFO] Using 'UTF-8' encoding to copy filtered resources.
[INFO] Copying 17 resources
[INFO] Copying 3 resources
[INFO] 
[INFO] --- maven-compiler-plugin:3.2:testCompile (default-testCompile) @ carbondata-processing
---
[INFO] Changes detected - recompiling the module!
[INFO] Compiling 5 source files to <https://builds.apache.org/job/carbondata-master-spark-2.1/ws/processing/target/test-classes>
[INFO] 
[INFO] --- maven-surefire-plugin:2.18.1:test (default-test) @ carbondata-processing ---
[INFO] Surefire report directory: <https://builds.apache.org/job/carbondata-master-spark-2.1/ws/processing/target/surefire-reports>

-------------------------------------------------------
 T E S T S
-------------------------------------------------------
Running org.apache.carbondata.lcm.locks.LocalFileLockTest
log4j:WARN No appenders could be found for logger (org.apache.carbondata.core.util.CarbonProperties).
log4j:WARN Please initialize the log4j system properly.
log4j:WARN See http://logging.apache.org/log4j/1.2/faq.html#noconfig for more info.
Tests run: 1, Failures: 0, Errors: 0, Skipped: 0, Time elapsed: 0.698 sec - in org.apache.carbondata.lcm.locks.LocalFileLockTest
Running org.apache.carbondata.core.keygenerator.directdictionary.timestamp.TimeStampDirectDictionaryGeneratorTest
Tests run: 5, Failures: 0, Errors: 0, Skipped: 0, Time elapsed: 0.012 sec - in org.apache.carbondata.core.keygenerator.directdictionary.timestamp.TimeStampDirectDictionaryGeneratorTest
Running org.apache.carbondata.processing.loading.csvinput.CSVInputFormatTest
Tests run: 2, Failures: 0, Errors: 0, Skipped: 0, Time elapsed: 3.627 sec - in org.apache.carbondata.processing.loading.csvinput.CSVInputFormatTest
Running org.apache.carbondata.processing.util.CarbonLoaderUtilTest
Tests run: 2, Failures: 0, Errors: 0, Skipped: 0, Time elapsed: 0.041 sec - in org.apache.carbondata.processing.util.CarbonLoaderUtilTest

Results :

Tests run: 10, Failures: 0, Errors: 0, Skipped: 0

[JENKINS] Recording test results
[INFO] 
[INFO] --- maven-jar-plugin:2.5:jar (default-jar) @ carbondata-processing ---
[INFO] Building jar: <https://builds.apache.org/job/carbondata-master-spark-2.1/ws/processing/target/carbondata-processing-1.5.0-SNAPSHOT.jar>
[INFO] 
[INFO] --- maven-site-plugin:3.4:attach-descriptor (attach-descriptor) @ carbondata-processing
---
[INFO] 
[INFO] --- jacoco-maven-plugin:0.7.9:prepare-agent-integration (default-prepare-agent-integration)
@ carbondata-processing ---
[INFO] argLine set to -javaagent:/home/jenkins/jenkins-slave/maven-repositories/0/org/jacoco/org.jacoco.agent/0.7.9/org.jacoco.agent-0.7.9-runtime.jar=destfile=<https://builds.apache.org/job/carbondata-master-spark-2.1/ws/processing/target/jacoco-it.exec>
[INFO] 
[INFO] --- maven-checkstyle-plugin:2.17:check (default) @ carbondata-processing ---
[INFO] Starting audit...
<https://builds.apache.org/job/carbondata-master-spark-2.1/ws/processing/src/main/java/org/apache/carbondata/processing/loading/model/LoadOption.java>:199:
error: Line is longer than 100 characters (found 166).
<https://builds.apache.org/job/carbondata-master-spark-2.1/ws/processing/src/main/java/org/apache/carbondata/processing/loading/model/CarbonLoadModelBuilder.java>:273:
error: Line is longer than 100 characters (found 102).
<https://builds.apache.org/job/carbondata-master-spark-2.1/ws/processing/src/main/java/org/apache/carbondata/processing/loading/model/CarbonLoadModel.java>:213:
error: No trailing whitespace allowed.
<https://builds.apache.org/job/carbondata-master-spark-2.1/ws/processing/src/main/java/org/apache/carbondata/processing/util/CarbonLoaderUtil.java>:585:85:
error: ')' is preceded with whitespace.
<https://builds.apache.org/job/carbondata-master-spark-2.1/ws/processing/src/main/java/org/apache/carbondata/processing/util/CarbonLoaderUtil.java>:633:
error: Line is longer than 100 characters (found 103).
<https://builds.apache.org/job/carbondata-master-spark-2.1/ws/processing/src/main/java/org/apache/carbondata/processing/util/CarbonLoaderUtil.java>:639:
error: No trailing whitespace allowed.
<https://builds.apache.org/job/carbondata-master-spark-2.1/ws/processing/src/main/java/org/apache/carbondata/processing/util/CarbonLoaderUtil.java>:661:
error: No trailing whitespace allowed.
Audit done.
[INFO] ------------------------------------------------------------------------
[INFO] Reactor Summary:
[INFO] 
[INFO] Apache CarbonData :: Parent ........................ SUCCESS [ 16.521 s]
[INFO] Apache CarbonData :: Common ........................ SUCCESS [ 16.755 s]
[INFO] Apache CarbonData :: Core .......................... SUCCESS [02:45 min]
[INFO] Apache CarbonData :: Processing .................... FAILURE [ 27.680 s]
[INFO] Apache CarbonData :: Hadoop ........................ SKIPPED
[INFO] Apache CarbonData :: Streaming ..................... SKIPPED
[INFO] Apache CarbonData :: Spark Common .................. SKIPPED
[INFO] Apache CarbonData :: Store SDK ..................... SKIPPED
[INFO] Apache CarbonData :: Search ........................ SKIPPED
[INFO] Apache CarbonData :: Lucene Index DataMap .......... SKIPPED
[INFO] Apache CarbonData :: Bloom Index DataMap ........... SKIPPED
[INFO] Apache CarbonData :: Spark2 ........................ SKIPPED
[INFO] Apache CarbonData :: Spark Common Test ............. SKIPPED
[INFO] Apache CarbonData :: DataMap Examples .............. SKIPPED
[INFO] Apache CarbonData :: Assembly ...................... SKIPPED
[INFO] Apache CarbonData :: Hive .......................... SKIPPED
[INFO] Apache CarbonData :: presto ........................ SKIPPED
[INFO] Apache CarbonData :: Spark2 Examples ............... SKIPPED
[INFO] ------------------------------------------------------------------------
[INFO] BUILD FAILURE
[INFO] ------------------------------------------------------------------------
[INFO] Total time: 04:19 min
[INFO] Finished at: 2018-06-12T18:05:01+00:00
[INFO] Final Memory: 88M/1388M
[INFO] ------------------------------------------------------------------------
[ERROR] Failed to execute goal org.apache.maven.plugins:maven-checkstyle-plugin:2.17:check
(default) on project carbondata-processing: Failed during checkstyle execution: There are
7 errors reported by Checkstyle 6.11.2 with <https://builds.apache.org/job/carbondata-master-spark-2.1/ws/processing/../dev/javastyle-config.xml>
ruleset. -> [Help 1]
org.apache.maven.lifecycle.LifecycleExecutionException: Failed to execute goal org.apache.maven.plugins:maven-checkstyle-plugin:2.17:check
(default) on project carbondata-processing: Failed during checkstyle execution
	at org.apache.maven.lifecycle.internal.MojoExecutor.execute(MojoExecutor.java:212)
	at org.apache.maven.lifecycle.internal.MojoExecutor.execute(MojoExecutor.java:153)
	at org.apache.maven.lifecycle.internal.MojoExecutor.execute(MojoExecutor.java:145)
	at org.apache.maven.lifecycle.internal.LifecycleModuleBuilder.buildProject(LifecycleModuleBuilder.java:116)
	at org.apache.maven.lifecycle.internal.LifecycleModuleBuilder.buildProject(LifecycleModuleBuilder.java:80)
	at org.apache.maven.lifecycle.internal.builder.singlethreaded.SingleThreadedBuilder.build(SingleThreadedBuilder.java:51)
	at org.apache.maven.lifecycle.internal.LifecycleStarter.execute(LifecycleStarter.java:128)
	at org.apache.maven.DefaultMaven.doExecute(DefaultMaven.java:307)
	at org.apache.maven.DefaultMaven.doExecute(DefaultMaven.java:193)
	at org.apache.maven.DefaultMaven.execute(DefaultMaven.java:106)
	at org.jvnet.hudson.maven3.launcher.Maven33Launcher.main(Maven33Launcher.java:129)
	at sun.reflect.NativeMethodAccessorImpl.invoke0(Native Method)
	at sun.reflect.NativeMethodAccessorImpl.invoke(NativeMethodAccessorImpl.java:62)
	at sun.reflect.DelegatingMethodAccessorImpl.invoke(DelegatingMethodAccessorImpl.java:43)
	at java.lang.reflect.Method.invoke(Method.java:498)
	at org.codehaus.plexus.classworlds.launcher.Launcher.launchStandard(Launcher.java:330)
	at org.codehaus.plexus.classworlds.launcher.Launcher.launch(Launcher.java:238)
	at jenkins.maven3.agent.Maven33Main.launch(Maven33Main.java:176)
	at sun.reflect.NativeMethodAccessorImpl.invoke0(Native Method)
	at sun.reflect.NativeMethodAccessorImpl.invoke(NativeMethodAccessorImpl.java:62)
	at sun.reflect.DelegatingMethodAccessorImpl.invoke(DelegatingMethodAccessorImpl.java:43)
	at java.lang.reflect.Method.invoke(Method.java:498)
	at hudson.maven.Maven3Builder.call(Maven3Builder.java:139)
	at hudson.maven.Maven3Builder.call(Maven3Builder.java:70)
	at hudson.remoting.UserRequest.perform(UserRequest.java:207)
	at hudson.remoting.UserRequest.perform(UserRequest.java:53)
	at hudson.remoting.Request$2.run(Request.java:358)
	at hudson.remoting.InterceptingExecutorService$1.call(InterceptingExecutorService.java:72)
	at java.util.concurrent.FutureTask.run(FutureTask.java:266)
	at java.util.concurrent.ThreadPoolExecutor.runWorker(ThreadPoolExecutor.java:1149)
	at java.util.concurrent.ThreadPoolExecutor$Worker.run(ThreadPoolExecutor.java:624)
	at java.lang.Thread.run(Thread.java:748)
Caused by: org.apache.maven.plugin.MojoExecutionException: Failed during checkstyle execution
	at org.apache.maven.plugin.checkstyle.CheckstyleViolationCheckMojo.execute(CheckstyleViolationCheckMojo.java:547)
	at org.apache.maven.plugin.DefaultBuildPluginManager.executeMojo(DefaultBuildPluginManager.java:134)
	at org.apache.maven.lifecycle.internal.MojoExecutor.execute(MojoExecutor.java:207)
	... 31 more
Caused by: org.apache.maven.plugin.checkstyle.exec.CheckstyleExecutorException: There are
7 errors reported by Checkstyle 6.11.2 with <https://builds.apache.org/job/carbondata-master-spark-2.1/ws/processing/../dev/javastyle-config.xml>
ruleset.
	at org.apache.maven.plugin.checkstyle.exec.DefaultCheckstyleExecutor.executeCheckstyle(DefaultCheckstyleExecutor.java:313)
	at org.apache.maven.plugin.checkstyle.CheckstyleViolationCheckMojo.execute(CheckstyleViolationCheckMojo.java:538)
	... 33 more
[ERROR] 
[ERROR] Re-run Maven using the -X switch to enable full debug logging.
[ERROR] 
[ERROR] For more information about the errors and possible solutions, please read the following
articles:
[ERROR] [Help 1] http://cwiki.apache.org/confluence/display/MAVEN/MojoExecutionException
[ERROR] 
[ERROR] After correcting the problems, you can resume the build with the command
[ERROR]   mvn <goals> -rf :carbondata-processing
[JENKINS] Archiving <https://builds.apache.org/job/carbondata-master-spark-2.1/ws/processing/pom.xml>
to org.apache.carbondata/carbondata-processing/1.5.0-SNAPSHOT/carbondata-processing-1.5.0-SNAPSHOT.pom
[JENKINS] Archiving <https://builds.apache.org/job/carbondata-master-spark-2.1/ws/processing/target/carbondata-processing-1.5.0-SNAPSHOT.jar>
to org.apache.carbondata/carbondata-processing/1.5.0-SNAPSHOT/carbondata-processing-1.5.0-SNAPSHOT.jar
[JENKINS] Archiving <https://builds.apache.org/job/carbondata-master-spark-2.1/ws/datamap/examples/pom.xml>
to org.apache.carbondata/carbondata-datamap-examples/1.5.0-SNAPSHOT/carbondata-datamap-examples-1.5.0-SNAPSHOT.pom
[JENKINS] Archiving <https://builds.apache.org/job/carbondata-master-spark-2.1/ws/store/search/pom.xml>
to org.apache.carbondata/carbondata-search/1.5.0-SNAPSHOT/carbondata-search-1.5.0-SNAPSHOT.pom
[JENKINS] Archiving <https://builds.apache.org/job/carbondata-master-spark-2.1/ws/streaming/pom.xml>
to org.apache.carbondata/carbondata-streaming/1.5.0-SNAPSHOT/carbondata-streaming-1.5.0-SNAPSHOT.pom
[JENKINS] Archiving <https://builds.apache.org/job/carbondata-master-spark-2.1/ws/integration/spark-common/pom.xml>
to org.apache.carbondata/carbondata-spark-common/1.5.0-SNAPSHOT/carbondata-spark-common-1.5.0-SNAPSHOT.pom
[JENKINS] Archiving <https://builds.apache.org/job/carbondata-master-spark-2.1/ws/datamap/lucene/pom.xml>
to org.apache.carbondata/carbondata-lucene/1.5.0-SNAPSHOT/carbondata-lucene-1.5.0-SNAPSHOT.pom
[JENKINS] Archiving <https://builds.apache.org/job/carbondata-master-spark-2.1/ws/integration/hive/pom.xml>
to org.apache.carbondata/carbondata-hive/1.5.0-SNAPSHOT/carbondata-hive-1.5.0-SNAPSHOT.pom
[JENKINS] Archiving <https://builds.apache.org/job/carbondata-master-spark-2.1/ws/common/pom.xml>
to org.apache.carbondata/carbondata-common/1.5.0-SNAPSHOT/carbondata-common-1.5.0-SNAPSHOT.pom
[JENKINS] Archiving <https://builds.apache.org/job/carbondata-master-spark-2.1/ws/common/target/carbondata-common-1.5.0-SNAPSHOT.jar>
to org.apache.carbondata/carbondata-common/1.5.0-SNAPSHOT/carbondata-common-1.5.0-SNAPSHOT.jar
[JENKINS] Archiving <https://builds.apache.org/job/carbondata-master-spark-2.1/ws/examples/spark2/pom.xml>
to org.apache.carbondata/carbondata-examples-spark2/1.5.0-SNAPSHOT/carbondata-examples-spark2-1.5.0-SNAPSHOT.pom
[JENKINS] Archiving <https://builds.apache.org/job/carbondata-master-spark-2.1/ws/integration/spark2/pom.xml>
to org.apache.carbondata/carbondata-spark2/1.5.0-SNAPSHOT/carbondata-spark2-1.5.0-SNAPSHOT.pom
[JENKINS] Archiving <https://builds.apache.org/job/carbondata-master-spark-2.1/ws/datamap/bloom/pom.xml>
to org.apache.carbondata/carbondata-bloom/1.5.0-SNAPSHOT/carbondata-bloom-1.5.0-SNAPSHOT.pom
[JENKINS] Archiving <https://builds.apache.org/job/carbondata-master-spark-2.1/ws/assembly/pom.xml>
to org.apache.carbondata/carbondata-assembly/1.5.0-SNAPSHOT/carbondata-assembly-1.5.0-SNAPSHOT.pom
[JENKINS] Archiving <https://builds.apache.org/job/carbondata-master-spark-2.1/ws/pom.xml>
to org.apache.carbondata/carbondata-parent/1.5.0-SNAPSHOT/carbondata-parent-1.5.0-SNAPSHOT.pom
[JENKINS] Archiving <https://builds.apache.org/job/carbondata-master-spark-2.1/ws/core/pom.xml>
to org.apache.carbondata/carbondata-core/1.5.0-SNAPSHOT/carbondata-core-1.5.0-SNAPSHOT.pom
[JENKINS] Archiving <https://builds.apache.org/job/carbondata-master-spark-2.1/ws/core/target/carbondata-core-1.5.0-SNAPSHOT.jar>
to org.apache.carbondata/carbondata-core/1.5.0-SNAPSHOT/carbondata-core-1.5.0-SNAPSHOT.jar
[JENKINS] Archiving <https://builds.apache.org/job/carbondata-master-spark-2.1/ws/hadoop/pom.xml>
to org.apache.carbondata/carbondata-hadoop/1.5.0-SNAPSHOT/carbondata-hadoop-1.5.0-SNAPSHOT.pom
[JENKINS] Archiving <https://builds.apache.org/job/carbondata-master-spark-2.1/ws/integration/presto/pom.xml>
to org.apache.carbondata/carbondata-presto/1.5.0-SNAPSHOT/carbondata-presto-1.5.0-SNAPSHOT.pom
[JENKINS] Archiving <https://builds.apache.org/job/carbondata-master-spark-2.1/ws/integration/spark-common-test/pom.xml>
to org.apache.carbondata/carbondata-spark-common-test/1.5.0-SNAPSHOT/carbondata-spark-common-test-1.5.0-SNAPSHOT.pom
[JENKINS] Archiving <https://builds.apache.org/job/carbondata-master-spark-2.1/ws/store/sdk/pom.xml>
to org.apache.carbondata/carbondata-store-sdk/1.5.0-SNAPSHOT/carbondata-store-sdk-1.5.0-SNAPSHOT.pom
Not sending mail to unregistered user jacky.likun@qq.com
Sending e-mails to: commits@carbondata.apache.org
channel stopped
Not sending mail to unregistered user jacky.likun@qq.com

Mime
View raw message