carbondata-commits mailing list archives

Site index · List index
Message view « Date » · « Thread »
Top « Date » · « Thread »
From Apache Jenkins Server <jenk...@builds.apache.org>
Subject Build failed in Jenkins: carbondata-master-spark-2.2 #409
Date Wed, 09 May 2018 04:07:42 GMT
See <https://builds.apache.org/job/carbondata-master-spark-2.2/409/display/redirect?page=changes>

Changes:

[jacky.likun] [CARBONDATA-2441][Datamap] Implement distribute interface for bloom

------------------------------------------
[...truncated 5.12 MB...]
time for query on table without lucene datamap table:0.269
+-----------------+-------------+
|               id|         name|
+-----------------+-------------+
|which test1 good0|who and name0|
|which test1 good0|who and name0|
|which test1 good2|who and name7|
|which test1 good2|who and name7|
|which test1 good4|who and name7|
|which test1 good4|who and name7|
|which test1 good8|who and name2|
|which test1 good8|who and name2|
|which test1 good8|who and name4|
|which test1 good8|who and name4|
|which test1 good8|who and name4|
|which test1 good8|who and name4|
+-----------------+-------------+

+-----------------+-------------+
|               id|         name|
+-----------------+-------------+
|which test1 good0|who and name0|
|which test1 good0|who and name0|
|which test1 good2|who and name7|
|which test1 good2|who and name7|
|which test1 good4|who and name7|
|which test1 good4|who and name7|
|which test1 good8|who and name2|
|which test1 good8|who and name2|
|which test1 good8|who and name4|
|which test1 good8|who and name4|
+-----------------+-------------+

18/05/08 21:06:39 AUDIT CarbonDropTableCommand: [asf923.gq1.ygridcore.net][jenkins][Thread-1]Deleting
table [persontable] under database [default]
18/05/08 21:06:39 AUDIT CarbonDropTableCommand: [asf923.gq1.ygridcore.net][jenkins][Thread-1]Deleted
table [persontable] under database [default]
- LuceneDataMapExample
18/05/08 21:06:39 AUDIT CarbonCreateTableCommand: [asf923.gq1.ygridcore.net][jenkins][Thread-1]Creating
Table with Database name [default] and Table name [origin_table]
18/05/08 21:06:39 AUDIT CarbonCreateTableCommand: [asf923.gq1.ygridcore.net][jenkins][Thread-1]Table
created with Database name [default] and Table name [origin_table]
18/05/08 21:06:39 AUDIT CarbonDataRDDFactory$: [asf923.gq1.ygridcore.net][jenkins][Thread-1]Data
load request has been received for table default.origin_table
18/05/08 21:06:40 ERROR DataLoadExecutor: [Executor task launch worker for task 2296][partitionID:table;queryID:49092663692079265]
Data Load is partially success for table origin_table
18/05/08 21:06:40 AUDIT CarbonDataRDDFactory$: [asf923.gq1.ygridcore.net][jenkins][Thread-1]Data
load is successful for default.origin_table
18/05/08 21:06:40 AUDIT CarbonDataRDDFactory$: [asf923.gq1.ygridcore.net][jenkins][Thread-1]Data
load request has been received for table default.origin_table
18/05/08 21:06:40 ERROR DataLoadExecutor: [Executor task launch worker for task 2297][partitionID:table;queryID:49092664180562410]
Data Load is partially success for table origin_table
18/05/08 21:06:40 AUDIT CarbonDataRDDFactory$: [asf923.gq1.ygridcore.net][jenkins][Thread-1]Data
load is successful for default.origin_table
18/05/08 21:06:40 AUDIT CarbonDataRDDFactory$: [asf923.gq1.ygridcore.net][jenkins][Thread-1]Data
load request has been received for table default.origin_table
18/05/08 21:06:41 ERROR DataLoadExecutor: [Executor task launch worker for task 2298][partitionID:table;queryID:49092664673956384]
Data Load is partially success for table origin_table
18/05/08 21:06:41 AUDIT CarbonDataRDDFactory$: [asf923.gq1.ygridcore.net][jenkins][Thread-1]Data
load is successful for default.origin_table
18/05/08 21:06:41 AUDIT CarbonDataRDDFactory$: [asf923.gq1.ygridcore.net][jenkins][Thread-1]Data
load request has been received for table default.origin_table
18/05/08 21:06:41 ERROR DataLoadExecutor: [Executor task launch worker for task 2299][partitionID:table;queryID:49092665158165613]
Data Load is partially success for table origin_table
18/05/08 21:06:41 AUDIT CarbonDataRDDFactory$: [asf923.gq1.ygridcore.net][jenkins][Thread-1]Data
load is successful for default.origin_table
+--------+
|count(1)|
+--------+
|      40|
+--------+

18/05/08 21:06:41 AUDIT CarbonCreateTableCommand: [asf923.gq1.ygridcore.net][jenkins][Thread-1]Creating
Table with Database name [default] and Table name [external_table]
18/05/08 21:06:41 AUDIT CarbonCreateTableCommand: [asf923.gq1.ygridcore.net][jenkins][Thread-1]Table
created with Database name [default] and Table name [external_table]
+--------+
|count(1)|
+--------+
|      40|
+--------+

18/05/08 21:06:41 AUDIT CarbonDataRDDFactory$: [asf923.gq1.ygridcore.net][jenkins][Thread-1]Data
load request has been received for table default.origin_table
18/05/08 21:06:42 ERROR DataLoadExecutor: [Executor task launch worker for task 2304][partitionID:table;queryID:49092665789813180]
Data Load is partially success for table origin_table
18/05/08 21:06:42 AUDIT CarbonDataRDDFactory$: [asf923.gq1.ygridcore.net][jenkins][Thread-1]Data
load is successful for default.origin_table
18/05/08 21:06:42 AUDIT CarbonDataRDDFactory$: [asf923.gq1.ygridcore.net][jenkins][Thread-1]Data
load request has been received for table default.origin_table
18/05/08 21:06:42 ERROR DataLoadExecutor: [Executor task launch worker for task 2305][partitionID:table;queryID:49092666274757354]
Data Load is partially success for table origin_table
18/05/08 21:06:42 AUDIT CarbonDataRDDFactory$: [asf923.gq1.ygridcore.net][jenkins][Thread-1]Data
load is successful for default.origin_table
+--------+
|count(1)|
+--------+
|      60|
+--------+

18/05/08 21:06:42 AUDIT CarbonDropTableCommand: [asf923.gq1.ygridcore.net][jenkins][Thread-1]Deleting
table [origin_table] under database [default]
18/05/08 21:06:42 AUDIT CarbonDropTableCommand: [asf923.gq1.ygridcore.net][jenkins][Thread-1]Deleted
table [origin_table] under database [default]
- ExternalTableExample
Run completed in 1 minute, 55 seconds.
Total number of tests run: 17
Suites: completed 2, aborted 0
Tests: succeeded 17, failed 0, canceled 0, ignored 0, pending 0
All tests passed.
[JENKINS] Recording test results
[INFO] 
[INFO] --- maven-jar-plugin:2.5:jar (default-jar) @ carbondata-examples-spark2 ---
[INFO] Building jar: <https://builds.apache.org/job/carbondata-master-spark-2.2/ws/examples/spark2/target/carbondata-examples-spark2-1.4.0-SNAPSHOT.jar>
[INFO] 
[INFO] --- maven-site-plugin:3.4:attach-descriptor (attach-descriptor) @ carbondata-examples-spark2
---
[INFO] 
[INFO] --- scalastyle-maven-plugin:0.8.0:check (default-cli) @ carbondata-examples-spark2
---
Saving to outputFile=<https://builds.apache.org/job/carbondata-master-spark-2.2/ws/examples/spark2/target/scalastyle-output.xml>
Processed 33 file(s)
Found 0 errors
Found 0 warnings
Found 0 infos
Finished in 509 ms
[INFO] 
[INFO] --- maven-checkstyle-plugin:2.17:check (default-cli) @ carbondata-examples-spark2 ---
[INFO]                                                                         
[INFO] ------------------------------------------------------------------------
[INFO] Building Apache CarbonData :: Parent 1.4.0-SNAPSHOT
[INFO] ------------------------------------------------------------------------
[INFO] 
[INFO] --- coveralls-maven-plugin:4.3.0:report (default-cli) @ carbondata-parent ---
[INFO] Downloading: https://repo.maven.apache.org/maven2/org/sonatype/sisu/sisu-inject-plexus/1.4.3.2/sisu-inject-plexus-1.4.3.2.pom
[INFO] Downloaded: https://repo.maven.apache.org/maven2/org/sonatype/sisu/sisu-inject-plexus/1.4.3.2/sisu-inject-plexus-1.4.3.2.pom
(6 KB at 282.7 KB/sec)
[INFO] Downloading: https://repo.maven.apache.org/maven2/org/sonatype/sisu/inject/guice-plexus/1.4.3.2/guice-plexus-1.4.3.2.pom
[INFO] Downloaded: https://repo.maven.apache.org/maven2/org/sonatype/sisu/inject/guice-plexus/1.4.3.2/guice-plexus-1.4.3.2.pom
(3 KB at 164.6 KB/sec)
[INFO] Downloading: https://repo.maven.apache.org/maven2/org/sonatype/sisu/inject/guice-bean/1.4.3.2/guice-bean-1.4.3.2.pom
[INFO] Downloaded: https://repo.maven.apache.org/maven2/org/sonatype/sisu/inject/guice-bean/1.4.3.2/guice-bean-1.4.3.2.pom
(3 KB at 145.2 KB/sec)
[INFO] Downloading: https://repo.maven.apache.org/maven2/org/sonatype/sisu/sisu-inject/1.4.3.2/sisu-inject-1.4.3.2.pom
[INFO] Downloaded: https://repo.maven.apache.org/maven2/org/sonatype/sisu/sisu-inject/1.4.3.2/sisu-inject-1.4.3.2.pom
(2 KB at 61.9 KB/sec)
[INFO] Downloading: https://repo.maven.apache.org/maven2/org/sonatype/sisu/sisu-parent/1.4.3.2/sisu-parent-1.4.3.2.pom
[INFO] Downloaded: https://repo.maven.apache.org/maven2/org/sonatype/sisu/sisu-parent/1.4.3.2/sisu-parent-1.4.3.2.pom
(8 KB at 254.6 KB/sec)
[INFO] Downloading: https://repo.maven.apache.org/maven2/org/sonatype/sisu/sisu-inject-bean/1.4.3.2/sisu-inject-bean-1.4.3.2.pom
[INFO] Downloaded: https://repo.maven.apache.org/maven2/org/sonatype/sisu/sisu-inject-bean/1.4.3.2/sisu-inject-bean-1.4.3.2.pom
(6 KB at 304.4 KB/sec)
[INFO] Downloading: https://repo.maven.apache.org/maven2/org/sonatype/sisu/sisu-guice/2.9.2/sisu-guice-2.9.2.pom
[INFO] Downloaded: https://repo.maven.apache.org/maven2/org/sonatype/sisu/sisu-guice/2.9.2/sisu-guice-2.9.2.pom
(8 KB at 398.7 KB/sec)
[INFO] Downloading: https://repo.maven.apache.org/maven2/org/sonatype/sisu/inject/guice-parent/2.9.2/guice-parent-2.9.2.pom
[INFO] Downloaded: https://repo.maven.apache.org/maven2/org/sonatype/sisu/inject/guice-parent/2.9.2/guice-parent-2.9.2.pom
(12 KB at 597.9 KB/sec)
[INFO] Downloading: https://repo.maven.apache.org/maven2/org/codehaus/plexus/plexus-utils/2.0.7/plexus-utils-2.0.7.jar
[INFO] Downloading: https://repo.maven.apache.org/maven2/org/sonatype/sisu/sisu-inject-plexus/1.4.3.2/sisu-inject-plexus-1.4.3.2.jar
[INFO] Downloading: https://repo.maven.apache.org/maven2/org/sonatype/sisu/sisu-inject-bean/1.4.3.2/sisu-inject-bean-1.4.3.2.jar
[INFO] Downloading: https://repo.maven.apache.org/maven2/org/sonatype/sisu/sisu-guice/2.9.2/sisu-guice-2.9.2-no_aop.jar
[INFO] Downloaded: https://repo.maven.apache.org/maven2/org/codehaus/plexus/plexus-utils/2.0.7/plexus-utils-2.0.7.jar
(219 KB at 2877.6 KB/sec)
[INFO] Downloaded: https://repo.maven.apache.org/maven2/org/sonatype/sisu/sisu-inject-bean/1.4.3.2/sisu-inject-bean-1.4.3.2.jar
(157 KB at 1536.0 KB/sec)
[INFO] Downloaded: https://repo.maven.apache.org/maven2/org/sonatype/sisu/sisu-inject-plexus/1.4.3.2/sisu-inject-plexus-1.4.3.2.jar
(201 KB at 1905.4 KB/sec)
[INFO] Downloaded: https://repo.maven.apache.org/maven2/org/sonatype/sisu/sisu-guice/2.9.2/sisu-guice-2.9.2-no_aop.jar
(469 KB at 3445.4 KB/sec)
[INFO] ------------------------------------------------------------------------
[INFO] Reactor Summary:
[INFO] 
[INFO] Apache CarbonData :: Parent ........................ FAILURE [  1.634 s]
[INFO] Apache CarbonData :: Common ........................ SUCCESS [ 15.911 s]
[INFO] Apache CarbonData :: Core .......................... SUCCESS [02:45 min]
[INFO] Apache CarbonData :: Processing .................... SUCCESS [ 32.362 s]
[INFO] Apache CarbonData :: Hadoop ........................ SUCCESS [ 25.746 s]
[INFO] Apache CarbonData :: Streaming ..................... SUCCESS [ 38.710 s]
[INFO] Apache CarbonData :: Spark Common .................. SUCCESS [01:22 min]
[INFO] Apache CarbonData :: Store SDK ..................... SUCCESS [ 52.961 s]
[INFO] Apache CarbonData :: Search ........................ SUCCESS [ 34.962 s]
[INFO] Apache CarbonData :: Lucene Index DataMap .......... SUCCESS [ 18.510 s]
[INFO] Apache CarbonData :: Bloom Index DataMap ........... SUCCESS [ 15.382 s]
[INFO] Apache CarbonData :: Spark2 ........................ SUCCESS [21:39 min]
[INFO] Apache CarbonData :: Spark Common Test ............. SUCCESS [54:23 min]
[INFO] Apache CarbonData :: DataMap Examples .............. SUCCESS [ 10.247 s]
[INFO] Apache CarbonData :: Assembly ...................... SUCCESS [ 16.493 s]
[INFO] Apache CarbonData :: Hive .......................... SUCCESS [ 33.010 s]
[INFO] Apache CarbonData :: presto ........................ SUCCESS [01:12 min]
[INFO] Apache CarbonData :: Spark2 Examples ............... SUCCESS [02:43 min]
[INFO] ------------------------------------------------------------------------
[INFO] BUILD FAILURE
[INFO] ------------------------------------------------------------------------
[INFO] Total time: 01:30 h
[INFO] Finished at: 2018-05-09T04:07:11+00:00
[INFO] Final Memory: 174M/1633M
[INFO] ------------------------------------------------------------------------
Waiting for Jenkins to finish collecting data
[ERROR] Failed to execute goal org.eluder.coveralls:coveralls-maven-plugin:4.3.0:report (default-cli)
on project carbondata-parent: I/O operation failed: No coverage report files found -> [Help
1]
org.apache.maven.lifecycle.LifecycleExecutionException: Failed to execute goal org.eluder.coveralls:coveralls-maven-plugin:4.3.0:report
(default-cli) on project carbondata-parent: I/O operation failed
	at org.apache.maven.lifecycle.internal.MojoExecutor.execute(MojoExecutor.java:212)
	at org.apache.maven.lifecycle.internal.MojoExecutor.execute(MojoExecutor.java:153)
	at org.apache.maven.lifecycle.internal.MojoExecutor.execute(MojoExecutor.java:145)
	at org.apache.maven.lifecycle.internal.LifecycleModuleBuilder.buildProject(LifecycleModuleBuilder.java:116)
	at org.apache.maven.lifecycle.internal.LifecycleModuleBuilder.buildProject(LifecycleModuleBuilder.java:80)
	at org.apache.maven.lifecycle.internal.builder.singlethreaded.SingleThreadedBuilder.build(SingleThreadedBuilder.java:51)
	at org.apache.maven.lifecycle.internal.LifecycleStarter.execute(LifecycleStarter.java:128)
	at org.apache.maven.DefaultMaven.doExecute(DefaultMaven.java:307)
	at org.apache.maven.DefaultMaven.doExecute(DefaultMaven.java:193)
	at org.apache.maven.DefaultMaven.execute(DefaultMaven.java:106)
	at org.jvnet.hudson.maven3.launcher.Maven33Launcher.main(Maven33Launcher.java:129)
	at sun.reflect.NativeMethodAccessorImpl.invoke0(Native Method)
	at sun.reflect.NativeMethodAccessorImpl.invoke(NativeMethodAccessorImpl.java:62)
	at sun.reflect.DelegatingMethodAccessorImpl.invoke(DelegatingMethodAccessorImpl.java:43)
	at java.lang.reflect.Method.invoke(Method.java:498)
	at org.codehaus.plexus.classworlds.launcher.Launcher.launchStandard(Launcher.java:330)
	at org.codehaus.plexus.classworlds.launcher.Launcher.launch(Launcher.java:238)
	at jenkins.maven3.agent.Maven33Main.launch(Maven33Main.java:176)
	at sun.reflect.NativeMethodAccessorImpl.invoke0(Native Method)
	at sun.reflect.NativeMethodAccessorImpl.invoke(NativeMethodAccessorImpl.java:62)
	at sun.reflect.DelegatingMethodAccessorImpl.invoke(DelegatingMethodAccessorImpl.java:43)
	at java.lang.reflect.Method.invoke(Method.java:498)
	at hudson.maven.Maven3Builder.call(Maven3Builder.java:139)
	at hudson.maven.Maven3Builder.call(Maven3Builder.java:70)
	at hudson.remoting.UserRequest.perform(UserRequest.java:207)
	at hudson.remoting.UserRequest.perform(UserRequest.java:53)
	at hudson.remoting.Request$2.run(Request.java:358)
	at hudson.remoting.InterceptingExecutorService$1.call(InterceptingExecutorService.java:72)
	at java.util.concurrent.FutureTask.run(FutureTask.java:266)
	at java.util.concurrent.ThreadPoolExecutor.runWorker(ThreadPoolExecutor.java:1149)
	at java.util.concurrent.ThreadPoolExecutor$Worker.run(ThreadPoolExecutor.java:624)
	at java.lang.Thread.run(Thread.java:748)
Caused by: org.apache.maven.plugin.MojoFailureException: I/O operation failed
	at org.eluder.coveralls.maven.plugin.CoverallsReportMojo.execute(CoverallsReportMojo.java:259)
	at org.apache.maven.plugin.DefaultBuildPluginManager.executeMojo(DefaultBuildPluginManager.java:134)
	at org.apache.maven.lifecycle.internal.MojoExecutor.execute(MojoExecutor.java:207)
	... 31 more
Caused by: java.io.IOException: No coverage report files found
	at org.eluder.coveralls.maven.plugin.util.CoverageParsersFactory.createParsers(CoverageParsersFactory.java:132)
	at org.eluder.coveralls.maven.plugin.CoverallsReportMojo.createCoverageParsers(CoverallsReportMojo.java:277)
	at org.eluder.coveralls.maven.plugin.CoverallsReportMojo.execute(CoverallsReportMojo.java:241)
	... 33 more
[ERROR] 
[ERROR] Re-run Maven using the -X switch to enable full debug logging.
[ERROR] 
[ERROR] For more information about the errors and possible solutions, please read the following
articles:
[ERROR] [Help 1] http://cwiki.apache.org/confluence/display/MAVEN/MojoFailureException
[JENKINS] Archiving <https://builds.apache.org/job/carbondata-master-spark-2.2/ws/processing/pom.xml>
to org.apache.carbondata/carbondata-processing/1.4.0-SNAPSHOT/carbondata-processing-1.4.0-SNAPSHOT.pom
[JENKINS] Archiving <https://builds.apache.org/job/carbondata-master-spark-2.2/ws/processing/target/carbondata-processing-1.4.0-SNAPSHOT.jar>
to org.apache.carbondata/carbondata-processing/1.4.0-SNAPSHOT/carbondata-processing-1.4.0-SNAPSHOT.jar
[JENKINS] Archiving <https://builds.apache.org/job/carbondata-master-spark-2.2/ws/datamap/examples/pom.xml>
to org.apache.carbondata/carbondata-datamap-examples/1.4.0-SNAPSHOT/carbondata-datamap-examples-1.4.0-SNAPSHOT.pom
[JENKINS] Archiving <https://builds.apache.org/job/carbondata-master-spark-2.2/ws/datamap/examples/target/carbondata-datamap-examples-1.4.0-SNAPSHOT.jar>
to org.apache.carbondata/carbondata-datamap-examples/1.4.0-SNAPSHOT/carbondata-datamap-examples-1.4.0-SNAPSHOT.jar
[JENKINS] Archiving <https://builds.apache.org/job/carbondata-master-spark-2.2/ws/store/search/pom.xml>
to org.apache.carbondata/carbondata-search/1.4.0-SNAPSHOT/carbondata-search-1.4.0-SNAPSHOT.pom
[JENKINS] Archiving <https://builds.apache.org/job/carbondata-master-spark-2.2/ws/store/search/target/carbondata-search-1.4.0-SNAPSHOT.jar>
to org.apache.carbondata/carbondata-search/1.4.0-SNAPSHOT/carbondata-search-1.4.0-SNAPSHOT.jar
[JENKINS] Archiving <https://builds.apache.org/job/carbondata-master-spark-2.2/ws/streaming/pom.xml>
to org.apache.carbondata/carbondata-streaming/1.4.0-SNAPSHOT/carbondata-streaming-1.4.0-SNAPSHOT.pom
[JENKINS] Archiving <https://builds.apache.org/job/carbondata-master-spark-2.2/ws/streaming/target/carbondata-streaming-1.4.0-SNAPSHOT.jar>
to org.apache.carbondata/carbondata-streaming/1.4.0-SNAPSHOT/carbondata-streaming-1.4.0-SNAPSHOT.jar
[JENKINS] Archiving <https://builds.apache.org/job/carbondata-master-spark-2.2/ws/integration/spark-common/pom.xml>
to org.apache.carbondata/carbondata-spark-common/1.4.0-SNAPSHOT/carbondata-spark-common-1.4.0-SNAPSHOT.pom
[JENKINS] Archiving <https://builds.apache.org/job/carbondata-master-spark-2.2/ws/integration/spark-common/target/carbondata-spark-common-1.4.0-SNAPSHOT.jar>
to org.apache.carbondata/carbondata-spark-common/1.4.0-SNAPSHOT/carbondata-spark-common-1.4.0-SNAPSHOT.jar
[JENKINS] Archiving <https://builds.apache.org/job/carbondata-master-spark-2.2/ws/datamap/lucene/pom.xml>
to org.apache.carbondata/carbondata-lucene/1.4.0-SNAPSHOT/carbondata-lucene-1.4.0-SNAPSHOT.pom
[JENKINS] Archiving <https://builds.apache.org/job/carbondata-master-spark-2.2/ws/datamap/lucene/target/carbondata-lucene-1.4.0-SNAPSHOT.jar>
to org.apache.carbondata/carbondata-lucene/1.4.0-SNAPSHOT/carbondata-lucene-1.4.0-SNAPSHOT.jar
[JENKINS] Archiving <https://builds.apache.org/job/carbondata-master-spark-2.2/ws/integration/hive/pom.xml>
to org.apache.carbondata/carbondata-hive/1.4.0-SNAPSHOT/carbondata-hive-1.4.0-SNAPSHOT.pom
[JENKINS] Archiving <https://builds.apache.org/job/carbondata-master-spark-2.2/ws/integration/hive/target/carbondata-hive-1.4.0-SNAPSHOT.jar>
to org.apache.carbondata/carbondata-hive/1.4.0-SNAPSHOT/carbondata-hive-1.4.0-SNAPSHOT.jar
[JENKINS] Archiving <https://builds.apache.org/job/carbondata-master-spark-2.2/ws/common/pom.xml>
to org.apache.carbondata/carbondata-common/1.4.0-SNAPSHOT/carbondata-common-1.4.0-SNAPSHOT.pom
[JENKINS] Archiving <https://builds.apache.org/job/carbondata-master-spark-2.2/ws/common/target/carbondata-common-1.4.0-SNAPSHOT.jar>
to org.apache.carbondata/carbondata-common/1.4.0-SNAPSHOT/carbondata-common-1.4.0-SNAPSHOT.jar
[JENKINS] Archiving <https://builds.apache.org/job/carbondata-master-spark-2.2/ws/examples/spark2/pom.xml>
to org.apache.carbondata/carbondata-examples-spark2/1.4.0-SNAPSHOT/carbondata-examples-spark2-1.4.0-SNAPSHOT.pom
[JENKINS] Archiving <https://builds.apache.org/job/carbondata-master-spark-2.2/ws/examples/spark2/target/carbondata-examples-spark2-1.4.0-SNAPSHOT.jar>
to org.apache.carbondata/carbondata-examples-spark2/1.4.0-SNAPSHOT/carbondata-examples-spark2-1.4.0-SNAPSHOT.jar
[JENKINS] Archiving <https://builds.apache.org/job/carbondata-master-spark-2.2/ws/integration/spark2/pom.xml>
to org.apache.carbondata/carbondata-spark2/1.4.0-SNAPSHOT/carbondata-spark2-1.4.0-SNAPSHOT.pom
[JENKINS] Archiving <https://builds.apache.org/job/carbondata-master-spark-2.2/ws/integration/spark2/target/carbondata-spark2-1.4.0-SNAPSHOT.jar>
to org.apache.carbondata/carbondata-spark2/1.4.0-SNAPSHOT/carbondata-spark2-1.4.0-SNAPSHOT.jar
[JENKINS] Archiving <https://builds.apache.org/job/carbondata-master-spark-2.2/ws/datamap/bloom/pom.xml>
to org.apache.carbondata/carbondata-bloom/1.4.0-SNAPSHOT/carbondata-bloom-1.4.0-SNAPSHOT.pom
[JENKINS] Archiving <https://builds.apache.org/job/carbondata-master-spark-2.2/ws/datamap/bloom/target/carbondata-bloom-1.4.0-SNAPSHOT.jar>
to org.apache.carbondata/carbondata-bloom/1.4.0-SNAPSHOT/carbondata-bloom-1.4.0-SNAPSHOT.jar
[JENKINS] Archiving <https://builds.apache.org/job/carbondata-master-spark-2.2/ws/assembly/pom.xml>
to org.apache.carbondata/carbondata-assembly/1.4.0-SNAPSHOT/carbondata-assembly-1.4.0-SNAPSHOT.pom
[JENKINS] Archiving <https://builds.apache.org/job/carbondata-master-spark-2.2/ws/pom.xml>
to org.apache.carbondata/carbondata-parent/1.4.0-SNAPSHOT/carbondata-parent-1.4.0-SNAPSHOT.pom
[JENKINS] Archiving <https://builds.apache.org/job/carbondata-master-spark-2.2/ws/core/pom.xml>
to org.apache.carbondata/carbondata-core/1.4.0-SNAPSHOT/carbondata-core-1.4.0-SNAPSHOT.pom
[JENKINS] Archiving <https://builds.apache.org/job/carbondata-master-spark-2.2/ws/core/target/carbondata-core-1.4.0-SNAPSHOT.jar>
to org.apache.carbondata/carbondata-core/1.4.0-SNAPSHOT/carbondata-core-1.4.0-SNAPSHOT.jar
[JENKINS] Archiving <https://builds.apache.org/job/carbondata-master-spark-2.2/ws/hadoop/pom.xml>
to org.apache.carbondata/carbondata-hadoop/1.4.0-SNAPSHOT/carbondata-hadoop-1.4.0-SNAPSHOT.pom
[JENKINS] Archiving <https://builds.apache.org/job/carbondata-master-spark-2.2/ws/hadoop/target/carbondata-hadoop-1.4.0-SNAPSHOT.jar>
to org.apache.carbondata/carbondata-hadoop/1.4.0-SNAPSHOT/carbondata-hadoop-1.4.0-SNAPSHOT.jar
[JENKINS] Archiving <https://builds.apache.org/job/carbondata-master-spark-2.2/ws/integration/presto/pom.xml>
to org.apache.carbondata/carbondata-presto/1.4.0-SNAPSHOT/carbondata-presto-1.4.0-SNAPSHOT.pom
[JENKINS] Archiving <https://builds.apache.org/job/carbondata-master-spark-2.2/ws/integration/presto/target/carbondata-presto-1.4.0-SNAPSHOT.zip>
to org.apache.carbondata/carbondata-presto/1.4.0-SNAPSHOT/carbondata-presto-1.4.0-SNAPSHOT.zip
[JENKINS] Archiving <https://builds.apache.org/job/carbondata-master-spark-2.2/ws/integration/presto/target/carbondata-presto-1.4.0-SNAPSHOT.jar>
to org.apache.carbondata/carbondata-presto/1.4.0-SNAPSHOT/carbondata-presto-1.4.0-SNAPSHOT.jar
[Fast Archiver] Compressed 77.33 MB of artifacts by 94.9% relative to #408
[JENKINS] Archiving <https://builds.apache.org/job/carbondata-master-spark-2.2/ws/integration/spark-common-test/pom.xml>
to org.apache.carbondata/carbondata-spark-common-test/1.4.0-SNAPSHOT/carbondata-spark-common-test-1.4.0-SNAPSHOT.pom
[JENKINS] Archiving <https://builds.apache.org/job/carbondata-master-spark-2.2/ws/integration/spark-common-test/target/carbondata-spark-common-test-1.4.0-SNAPSHOT.jar>
to org.apache.carbondata/carbondata-spark-common-test/1.4.0-SNAPSHOT/carbondata-spark-common-test-1.4.0-SNAPSHOT.jar
[JENKINS] Archiving <https://builds.apache.org/job/carbondata-master-spark-2.2/ws/store/sdk/pom.xml>
to org.apache.carbondata/carbondata-store-sdk/1.4.0-SNAPSHOT/carbondata-store-sdk-1.4.0-SNAPSHOT.pom
[JENKINS] Archiving <https://builds.apache.org/job/carbondata-master-spark-2.2/ws/store/sdk/target/carbondata-store-sdk-1.4.0-SNAPSHOT.jar>
to org.apache.carbondata/carbondata-store-sdk/1.4.0-SNAPSHOT/carbondata-store-sdk-1.4.0-SNAPSHOT.jar
Sending e-mails to: commits@carbondata.apache.org
Sending e-mails to: commits@carbondata.apache.org
channel stopped
Not sending mail to unregistered user jacky.likun@qq.com
Not sending mail to unregistered user kunalkapoor642@gmail.com

Mime
View raw message