carbondata-commits mailing list archives

Site index · List index
Message view « Date » · « Thread »
Top « Date » · « Thread »
From Apache Jenkins Server <jenk...@builds.apache.org>
Subject Build failed in Jenkins: carbondata-master-spark-2.1 #2229
Date Sun, 08 Apr 2018 07:57:17 GMT
See <https://builds.apache.org/job/carbondata-master-spark-2.1/2229/display/redirect>

------------------------------------------
[...truncated 1.62 MB...]
[INFO] Including org.apache.hadoop:hadoop-mapreduce-client-core:jar:2.7.2 in the shaded jar.
[INFO] Including org.apache.hadoop:hadoop-yarn-common:jar:2.7.2 in the shaded jar.
[INFO] Including com.sun.jersey:jersey-client:jar:1.9 in the shaded jar.
[INFO] Including org.apache.hadoop:hadoop-mapreduce-client-jobclient:jar:2.7.2 in the shaded
jar.
[INFO] Including org.apache.zookeeper:zookeeper:jar:3.4.7 in the shaded jar.
[INFO] Including org.roaringbitmap:RoaringBitmap:jar:0.5.11 in the shaded jar.
[INFO] Including io.netty:netty-all:jar:4.0.42.Final in the shaded jar.
[INFO] Including net.jpountz.lz4:lz4:jar:1.3.0 in the shaded jar.
[INFO] Including org.scala-lang:scala-library:jar:2.11.8 in the shaded jar.
[INFO] Including com.univocity:univocity-parsers:jar:2.2.1 in the shaded jar.
[INFO] Including org.apache.commons:commons-lang3:jar:3.3.2 in the shaded jar.
[INFO] Including org.apache.hadoop:hadoop-common:jar:2.7.2 in the shaded jar.
[INFO] Including org.apache.hadoop:hadoop-annotations:jar:2.7.2 in the shaded jar.
[INFO] Including com.google.guava:guava:jar:11.0.2 in the shaded jar.
[INFO] Including commons-cli:commons-cli:jar:1.2 in the shaded jar.
[INFO] Including org.apache.commons:commons-math3:jar:3.1.1 in the shaded jar.
[INFO] Including xmlenc:xmlenc:jar:0.52 in the shaded jar.
[INFO] Including commons-httpclient:commons-httpclient:jar:3.1 in the shaded jar.
[INFO] Including commons-codec:commons-codec:jar:1.4 in the shaded jar.
[INFO] Including commons-io:commons-io:jar:2.4 in the shaded jar.
[INFO] Including commons-net:commons-net:jar:3.1 in the shaded jar.
[INFO] Including commons-collections:commons-collections:jar:3.2.2 in the shaded jar.
[INFO] Including org.mortbay.jetty:jetty:jar:6.1.26 in the shaded jar.
[INFO] Including org.mortbay.jetty:jetty-util:jar:6.1.26 in the shaded jar.
[INFO] Including com.sun.jersey:jersey-core:jar:1.9 in the shaded jar.
[INFO] Including com.sun.jersey:jersey-json:jar:1.9 in the shaded jar.
[INFO] Including org.codehaus.jettison:jettison:jar:1.1 in the shaded jar.
[INFO] Including com.sun.xml.bind:jaxb-impl:jar:2.2.3-1 in the shaded jar.
[INFO] Including javax.xml.bind:jaxb-api:jar:2.2.2 in the shaded jar.
[INFO] Including javax.xml.stream:stax-api:jar:1.0-2 in the shaded jar.
[INFO] Including javax.activation:activation:jar:1.1 in the shaded jar.
[INFO] Including org.codehaus.jackson:jackson-jaxrs:jar:1.8.3 in the shaded jar.
[INFO] Including org.codehaus.jackson:jackson-xc:jar:1.8.3 in the shaded jar.
[INFO] Including com.sun.jersey:jersey-server:jar:1.9 in the shaded jar.
[INFO] Including asm:asm:jar:3.1 in the shaded jar.
[INFO] Including commons-logging:commons-logging:jar:1.1.3 in the shaded jar.
[INFO] Including log4j:log4j:jar:1.2.17 in the shaded jar.
[INFO] Including net.java.dev.jets3t:jets3t:jar:0.9.0 in the shaded jar.
[INFO] Including org.apache.httpcomponents:httpclient:jar:4.1.2 in the shaded jar.
[INFO] Including org.apache.httpcomponents:httpcore:jar:4.1.2 in the shaded jar.
[INFO] Including com.jamesmurty.utils:java-xmlbuilder:jar:0.4 in the shaded jar.
[INFO] Including commons-lang:commons-lang:jar:2.6 in the shaded jar.
[INFO] Including commons-configuration:commons-configuration:jar:1.6 in the shaded jar.
[INFO] Including commons-digester:commons-digester:jar:1.8 in the shaded jar.
[INFO] Including commons-beanutils:commons-beanutils:jar:1.7.0 in the shaded jar.
[INFO] Including commons-beanutils:commons-beanutils-core:jar:1.8.0 in the shaded jar.
[INFO] Including org.slf4j:slf4j-log4j12:jar:1.7.10 in the shaded jar.
[INFO] Including com.google.protobuf:protobuf-java:jar:2.5.0 in the shaded jar.
[INFO] Including org.apache.hadoop:hadoop-auth:jar:2.7.2 in the shaded jar.
[INFO] Including org.apache.directory.server:apacheds-kerberos-codec:jar:2.0.0-M15 in the
shaded jar.
[INFO] Including org.apache.directory.server:apacheds-i18n:jar:2.0.0-M15 in the shaded jar.
[INFO] Including org.apache.directory.api:api-asn1-api:jar:1.0.0-M20 in the shaded jar.
[INFO] Including org.apache.directory.api:api-util:jar:1.0.0-M20 in the shaded jar.
[INFO] Including org.apache.curator:curator-framework:jar:2.7.1 in the shaded jar.
[INFO] Including com.jcraft:jsch:jar:0.1.42 in the shaded jar.
[INFO] Including org.apache.curator:curator-client:jar:2.7.1 in the shaded jar.
[INFO] Including org.apache.curator:curator-recipes:jar:2.7.1 in the shaded jar.
[INFO] Including com.google.code.findbugs:jsr305:jar:3.0.0 in the shaded jar.
[INFO] Including org.apache.htrace:htrace-core:jar:3.1.0-incubating in the shaded jar.
[INFO] Including org.apache.hadoop:hadoop-hdfs:jar:2.7.2 in the shaded jar.
[INFO] Including commons-daemon:commons-daemon:jar:1.0.13 in the shaded jar.
[INFO] Including io.netty:netty:jar:3.6.2.Final in the shaded jar.
[INFO] Including xerces:xercesImpl:jar:2.9.1 in the shaded jar.
[INFO] Including xml-apis:xml-apis:jar:1.3.04 in the shaded jar.
[INFO] Including org.fusesource.leveldbjni:leveldbjni-all:jar:1.8 in the shaded jar.
[INFO] Including org.apache.avro:avro:jar:1.8.1 in the shaded jar.
[INFO] Including org.codehaus.jackson:jackson-core-asl:jar:1.9.13 in the shaded jar.
[INFO] Including org.codehaus.jackson:jackson-mapper-asl:jar:1.9.13 in the shaded jar.
[INFO] Including com.thoughtworks.paranamer:paranamer:jar:2.7 in the shaded jar.
[INFO] Including org.xerial.snappy:snappy-java:jar:1.1.1.3 in the shaded jar.
[INFO] Including org.apache.commons:commons-compress:jar:1.8.1 in the shaded jar.
[INFO] Including org.tukaani:xz:jar:1.5 in the shaded jar.
[INFO] Including org.slf4j:slf4j-api:jar:1.7.7 in the shaded jar.
[WARNING] commons-collections-3.2.2.jar, commons-beanutils-core-1.8.0.jar, commons-beanutils-1.7.0.jar
define 10 overlapping classes: 
[WARNING]   - org.apache.commons.collections.FastHashMap$EntrySet
[WARNING]   - org.apache.commons.collections.FastHashMap$KeySet
[WARNING]   - org.apache.commons.collections.FastHashMap$CollectionView$CollectionViewIterator
[WARNING]   - org.apache.commons.collections.ArrayStack
[WARNING]   - org.apache.commons.collections.FastHashMap$Values
[WARNING]   - org.apache.commons.collections.FastHashMap$CollectionView
[WARNING]   - org.apache.commons.collections.FastHashMap$1
[WARNING]   - org.apache.commons.collections.Buffer
[WARNING]   - org.apache.commons.collections.FastHashMap
[WARNING]   - org.apache.commons.collections.BufferUnderflowException
[WARNING] commons-beanutils-core-1.8.0.jar, commons-beanutils-1.7.0.jar define 82 overlapping
classes: 
[WARNING]   - org.apache.commons.beanutils.ConvertUtilsBean
[WARNING]   - org.apache.commons.beanutils.converters.SqlTimeConverter
[WARNING]   - org.apache.commons.beanutils.Converter
[WARNING]   - org.apache.commons.beanutils.converters.FloatArrayConverter
[WARNING]   - org.apache.commons.beanutils.NestedNullException
[WARNING]   - org.apache.commons.beanutils.ConvertingWrapDynaBean
[WARNING]   - org.apache.commons.beanutils.converters.LongArrayConverter
[WARNING]   - org.apache.commons.beanutils.converters.SqlDateConverter
[WARNING]   - org.apache.commons.beanutils.converters.BooleanArrayConverter
[WARNING]   - org.apache.commons.beanutils.converters.StringConverter
[WARNING]   - 72 more...
[WARNING] maven-shade-plugin has detected that some class files are
[WARNING] present in two or more JARs. When this happens, only one
[WARNING] single version of the class is copied to the uber jar.
[WARNING] Usually this is not harmful and you can skip these warnings,
[WARNING] otherwise try to manually exclude artifacts based on
[WARNING] mvn dependency:tree -Ddetail=true and the above output.
[WARNING] See http://maven.apache.org/plugins/maven-shade-plugin/
[INFO] 
[INFO] --- jacoco-maven-plugin:0.7.9:prepare-agent-integration (default-prepare-agent-integration)
@ carbondata-store-sdk ---
[INFO] argLine set to -javaagent:/home/jenkins/jenkins-slave/maven-repositories/0/org/jacoco/org.jacoco.agent/0.7.9/org.jacoco.agent-0.7.9-runtime.jar=destfile=<https://builds.apache.org/job/carbondata-master-spark-2.1/ws/store/sdk/target/jacoco-it.exec>
[INFO] 
[INFO] --- maven-checkstyle-plugin:2.17:check (default) @ carbondata-store-sdk ---
[INFO] Starting audit...
Audit done.
[INFO] 
[INFO] --- scalastyle-maven-plugin:0.8.0:check (default) @ carbondata-store-sdk ---
[WARNING] sourceDirectory is not specified or does not exist value=<https://builds.apache.org/job/carbondata-master-spark-2.1/ws/store/sdk/src/main/scala>
Saving to outputFile=<https://builds.apache.org/job/carbondata-master-spark-2.1/ws/store/sdk/target/scalastyle-output.xml>
Processed 0 file(s)
Found 0 errors
Found 0 warnings
Found 0 infos
Finished in 514 ms
[INFO] 
[INFO] --- jacoco-maven-plugin:0.7.9:report (default-report) @ carbondata-store-sdk ---
[INFO] Loading execution data file <https://builds.apache.org/job/carbondata-master-spark-2.1/ws/store/sdk/target/jacoco.exec>
[INFO] ------------------------------------------------------------------------
[INFO] Reactor Summary:
[INFO] 
[INFO] Apache CarbonData :: Parent ........................ SUCCESS [ 10.560 s]
[INFO] Apache CarbonData :: Common ........................ SUCCESS [ 14.369 s]
[INFO] Apache CarbonData :: Core .......................... SUCCESS [02:39 min]
[INFO] Apache CarbonData :: Processing .................... SUCCESS [ 32.053 s]
[INFO] Apache CarbonData :: Hadoop ........................ SUCCESS [ 23.542 s]
[INFO] Apache CarbonData :: Streaming ..................... SUCCESS [ 33.157 s]
[INFO] Apache CarbonData :: Spark Common .................. SUCCESS [01:08 min]
[INFO] Apache CarbonData :: Spark2 ........................ SUCCESS [17:14 min]
[INFO] Apache CarbonData :: Lucene Index DataMap .......... SUCCESS [ 26.785 s]
[INFO] Apache CarbonData :: Store SDK ..................... FAILURE [ 51.445 s]
[INFO] Apache CarbonData :: Spark Common Test ............. SKIPPED
[INFO] Apache CarbonData :: DataMap Examples .............. SKIPPED
[INFO] Apache CarbonData :: Assembly ...................... SKIPPED
[INFO] Apache CarbonData :: Hive .......................... SKIPPED
[INFO] Apache CarbonData :: presto ........................ SKIPPED
[INFO] Apache CarbonData :: Spark2 Examples ............... SKIPPED
[INFO] ------------------------------------------------------------------------
[INFO] BUILD FAILURE
[INFO] ------------------------------------------------------------------------
[INFO] Total time: 25:06 min
[INFO] Finished at: 2018-04-08T07:56:16+00:00
[INFO] Final Memory: 128M/1732M
[INFO] ------------------------------------------------------------------------
[ERROR] Failed to execute goal org.jacoco:jacoco-maven-plugin:0.7.9:report (default-report)
on project carbondata-store-sdk: An error has occurred in JaCoCo report generation. Error
while creating report: Error while analyzing <https://builds.apache.org/job/carbondata-master-spark-2.1/ws/store/sdk/target/classes/org/apache/carbondata/sdk/file/CarbonWriterBuilder.class.>
Can't add different class with same name: org/apache/carbondata/sdk/file/CarbonWriterBuilder
-> [Help 1]
org.apache.maven.lifecycle.LifecycleExecutionException: Failed to execute goal org.jacoco:jacoco-maven-plugin:0.7.9:report
(default-report) on project carbondata-store-sdk: An error has occurred in JaCoCo report generation.
	at org.apache.maven.lifecycle.internal.MojoExecutor.execute(MojoExecutor.java:212)
	at org.apache.maven.lifecycle.internal.MojoExecutor.execute(MojoExecutor.java:153)
	at org.apache.maven.lifecycle.internal.MojoExecutor.execute(MojoExecutor.java:145)
	at org.apache.maven.lifecycle.internal.LifecycleModuleBuilder.buildProject(LifecycleModuleBuilder.java:116)
	at org.apache.maven.lifecycle.internal.LifecycleModuleBuilder.buildProject(LifecycleModuleBuilder.java:80)
	at org.apache.maven.lifecycle.internal.builder.singlethreaded.SingleThreadedBuilder.build(SingleThreadedBuilder.java:51)
	at org.apache.maven.lifecycle.internal.LifecycleStarter.execute(LifecycleStarter.java:128)
	at org.apache.maven.DefaultMaven.doExecute(DefaultMaven.java:307)
	at org.apache.maven.DefaultMaven.doExecute(DefaultMaven.java:193)
	at org.apache.maven.DefaultMaven.execute(DefaultMaven.java:106)
	at org.jvnet.hudson.maven3.launcher.Maven33Launcher.main(Maven33Launcher.java:129)
	at sun.reflect.NativeMethodAccessorImpl.invoke0(Native Method)
	at sun.reflect.NativeMethodAccessorImpl.invoke(NativeMethodAccessorImpl.java:62)
	at sun.reflect.DelegatingMethodAccessorImpl.invoke(DelegatingMethodAccessorImpl.java:43)
	at java.lang.reflect.Method.invoke(Method.java:498)
	at org.codehaus.plexus.classworlds.launcher.Launcher.launchStandard(Launcher.java:330)
	at org.codehaus.plexus.classworlds.launcher.Launcher.launch(Launcher.java:238)
	at jenkins.maven3.agent.Maven33Main.launch(Maven33Main.java:176)
	at sun.reflect.NativeMethodAccessorImpl.invoke0(Native Method)
	at sun.reflect.NativeMethodAccessorImpl.invoke(NativeMethodAccessorImpl.java:62)
	at sun.reflect.DelegatingMethodAccessorImpl.invoke(DelegatingMethodAccessorImpl.java:43)
	at java.lang.reflect.Method.invoke(Method.java:498)
	at hudson.maven.Maven3Builder.call(Maven3Builder.java:139)
	at hudson.maven.Maven3Builder.call(Maven3Builder.java:70)
	at hudson.remoting.UserRequest.perform(UserRequest.java:207)
	at hudson.remoting.UserRequest.perform(UserRequest.java:53)
	at hudson.remoting.Request$2.run(Request.java:358)
	at hudson.remoting.InterceptingExecutorService$1.call(InterceptingExecutorService.java:72)
	at java.util.concurrent.FutureTask.run(FutureTask.java:266)
	at java.util.concurrent.ThreadPoolExecutor.runWorker(ThreadPoolExecutor.java:1149)
	at java.util.concurrent.ThreadPoolExecutor$Worker.run(ThreadPoolExecutor.java:624)
	at java.lang.Thread.run(Thread.java:748)
Caused by: org.apache.maven.plugin.MojoExecutionException: An error has occurred in JaCoCo
report generation.
	at org.jacoco.maven.AbstractReportMojo.execute(AbstractReportMojo.java:167)
	at org.apache.maven.plugin.DefaultBuildPluginManager.executeMojo(DefaultBuildPluginManager.java:134)
	at org.apache.maven.lifecycle.internal.MojoExecutor.execute(MojoExecutor.java:207)
	... 31 more
Caused by: org.apache.maven.reporting.MavenReportException: Error while creating report: Error
while analyzing <https://builds.apache.org/job/carbondata-master-spark-2.1/ws/store/sdk/target/classes/org/apache/carbondata/sdk/file/CarbonWriterBuilder.class.>
	at org.jacoco.maven.AbstractReportMojo.executeReport(AbstractReportMojo.java:183)
	at org.jacoco.maven.AbstractReportMojo.execute(AbstractReportMojo.java:165)
	... 33 more
Caused by: java.io.IOException: Error while analyzing <https://builds.apache.org/job/carbondata-master-spark-2.1/ws/store/sdk/target/classes/org/apache/carbondata/sdk/file/CarbonWriterBuilder.class.>
	at org.jacoco.core.analysis.Analyzer.analyzerError(Analyzer.java:155)
	at org.jacoco.core.analysis.Analyzer.analyzeClass(Analyzer.java:130)
	at org.jacoco.core.analysis.Analyzer.analyzeClass(Analyzer.java:147)
	at org.jacoco.core.analysis.Analyzer.analyzeAll(Analyzer.java:185)
	at org.jacoco.core.analysis.Analyzer.analyzeAll(Analyzer.java:218)
	at org.jacoco.maven.ReportSupport.processProject(ReportSupport.java:200)
	at org.jacoco.maven.ReportSupport.processProject(ReportSupport.java:183)
	at org.jacoco.maven.ReportMojo.createReport(ReportMojo.java:73)
	at org.jacoco.maven.AbstractReportMojo.executeReport(AbstractReportMojo.java:180)
	... 34 more
Caused by: java.lang.IllegalStateException: Can't add different class with same name: org/apache/carbondata/sdk/file/CarbonWriterBuilder
	at org.jacoco.core.analysis.CoverageBuilder.visitCoverage(CoverageBuilder.java:107)
	at org.jacoco.core.analysis.Analyzer$1.visitEnd(Analyzer.java:96)
	at org.objectweb.asm.ClassVisitor.visitEnd(ClassVisitor.java:317)
	at org.jacoco.core.internal.flow.ClassProbesAdapter.visitEnd(ClassProbesAdapter.java:98)
	at org.objectweb.asm.ClassReader.accept(ClassReader.java:712)
	at org.objectweb.asm.ClassReader.accept(ClassReader.java:521)
	at org.jacoco.core.analysis.Analyzer.analyzeClass(Analyzer.java:111)
	at org.jacoco.core.analysis.Analyzer.analyzeClass(Analyzer.java:127)
	... 41 more
[ERROR] 
[ERROR] Re-run Maven using the -X switch to enable full debug logging.
[ERROR] 
[ERROR] For more information about the errors and possible solutions, please read the following
articles:
[ERROR] [Help 1] http://cwiki.apache.org/confluence/display/MAVEN/MojoExecutionException
[ERROR] 
[ERROR] After correcting the problems, you can resume the build with the command
[ERROR]   mvn <goals> -rf :carbondata-store-sdk
[JENKINS] Archiving <https://builds.apache.org/job/carbondata-master-spark-2.1/ws/processing/pom.xml>
to org.apache.carbondata/carbondata-processing/1.4.0-SNAPSHOT/carbondata-processing-1.4.0-SNAPSHOT.pom
[JENKINS] Archiving <https://builds.apache.org/job/carbondata-master-spark-2.1/ws/processing/target/carbondata-processing-1.4.0-SNAPSHOT.jar>
to org.apache.carbondata/carbondata-processing/1.4.0-SNAPSHOT/carbondata-processing-1.4.0-SNAPSHOT.jar
[JENKINS] Archiving <https://builds.apache.org/job/carbondata-master-spark-2.1/ws/datamap/examples/pom.xml>
to org.apache.carbondata/carbondata-datamap-examples/1.4.0-SNAPSHOT/carbondata-datamap-examples-1.4.0-SNAPSHOT.pom
[JENKINS] Archiving <https://builds.apache.org/job/carbondata-master-spark-2.1/ws/streaming/pom.xml>
to org.apache.carbondata/carbondata-streaming/1.4.0-SNAPSHOT/carbondata-streaming-1.4.0-SNAPSHOT.pom
[JENKINS] Archiving <https://builds.apache.org/job/carbondata-master-spark-2.1/ws/streaming/target/carbondata-streaming-1.4.0-SNAPSHOT.jar>
to org.apache.carbondata/carbondata-streaming/1.4.0-SNAPSHOT/carbondata-streaming-1.4.0-SNAPSHOT.jar
[JENKINS] Archiving <https://builds.apache.org/job/carbondata-master-spark-2.1/ws/integration/spark-common/pom.xml>
to org.apache.carbondata/carbondata-spark-common/1.4.0-SNAPSHOT/carbondata-spark-common-1.4.0-SNAPSHOT.pom
[JENKINS] Archiving <https://builds.apache.org/job/carbondata-master-spark-2.1/ws/integration/spark-common/target/carbondata-spark-common-1.4.0-SNAPSHOT.jar>
to org.apache.carbondata/carbondata-spark-common/1.4.0-SNAPSHOT/carbondata-spark-common-1.4.0-SNAPSHOT.jar
[JENKINS] Archiving <https://builds.apache.org/job/carbondata-master-spark-2.1/ws/datamap/lucene/pom.xml>
to org.apache.carbondata/carbondata-lucene/1.4.0-SNAPSHOT/carbondata-lucene-1.4.0-SNAPSHOT.pom
[JENKINS] Archiving <https://builds.apache.org/job/carbondata-master-spark-2.1/ws/datamap/lucene/target/carbondata-lucene-1.4.0-SNAPSHOT.jar>
to org.apache.carbondata/carbondata-lucene/1.4.0-SNAPSHOT/carbondata-lucene-1.4.0-SNAPSHOT.jar
[JENKINS] Archiving <https://builds.apache.org/job/carbondata-master-spark-2.1/ws/integration/hive/pom.xml>
to org.apache.carbondata/carbondata-hive/1.4.0-SNAPSHOT/carbondata-hive-1.4.0-SNAPSHOT.pom
[JENKINS] Archiving <https://builds.apache.org/job/carbondata-master-spark-2.1/ws/common/pom.xml>
to org.apache.carbondata/carbondata-common/1.4.0-SNAPSHOT/carbondata-common-1.4.0-SNAPSHOT.pom
[JENKINS] Archiving <https://builds.apache.org/job/carbondata-master-spark-2.1/ws/common/target/carbondata-common-1.4.0-SNAPSHOT.jar>
to org.apache.carbondata/carbondata-common/1.4.0-SNAPSHOT/carbondata-common-1.4.0-SNAPSHOT.jar
[JENKINS] Archiving <https://builds.apache.org/job/carbondata-master-spark-2.1/ws/examples/spark2/pom.xml>
to org.apache.carbondata/carbondata-examples-spark2/1.4.0-SNAPSHOT/carbondata-examples-spark2-1.4.0-SNAPSHOT.pom
[JENKINS] Archiving <https://builds.apache.org/job/carbondata-master-spark-2.1/ws/integration/spark2/pom.xml>
to org.apache.carbondata/carbondata-spark2/1.4.0-SNAPSHOT/carbondata-spark2-1.4.0-SNAPSHOT.pom
[JENKINS] Archiving <https://builds.apache.org/job/carbondata-master-spark-2.1/ws/integration/spark2/target/carbondata-spark2-1.4.0-SNAPSHOT.jar>
to org.apache.carbondata/carbondata-spark2/1.4.0-SNAPSHOT/carbondata-spark2-1.4.0-SNAPSHOT.jar
[JENKINS] Archiving <https://builds.apache.org/job/carbondata-master-spark-2.1/ws/assembly/pom.xml>
to org.apache.carbondata/carbondata-assembly/1.4.0-SNAPSHOT/carbondata-assembly-1.4.0-SNAPSHOT.pom
[JENKINS] Archiving <https://builds.apache.org/job/carbondata-master-spark-2.1/ws/pom.xml>
to org.apache.carbondata/carbondata-parent/1.4.0-SNAPSHOT/carbondata-parent-1.4.0-SNAPSHOT.pom
[JENKINS] Archiving <https://builds.apache.org/job/carbondata-master-spark-2.1/ws/core/pom.xml>
to org.apache.carbondata/carbondata-core/1.4.0-SNAPSHOT/carbondata-core-1.4.0-SNAPSHOT.pom
[JENKINS] Archiving <https://builds.apache.org/job/carbondata-master-spark-2.1/ws/core/target/carbondata-core-1.4.0-SNAPSHOT.jar>
to org.apache.carbondata/carbondata-core/1.4.0-SNAPSHOT/carbondata-core-1.4.0-SNAPSHOT.jar
[JENKINS] Archiving <https://builds.apache.org/job/carbondata-master-spark-2.1/ws/hadoop/pom.xml>
to org.apache.carbondata/carbondata-hadoop/1.4.0-SNAPSHOT/carbondata-hadoop-1.4.0-SNAPSHOT.pom
[JENKINS] Archiving <https://builds.apache.org/job/carbondata-master-spark-2.1/ws/hadoop/target/carbondata-hadoop-1.4.0-SNAPSHOT.jar>
to org.apache.carbondata/carbondata-hadoop/1.4.0-SNAPSHOT/carbondata-hadoop-1.4.0-SNAPSHOT.jar
[JENKINS] Archiving <https://builds.apache.org/job/carbondata-master-spark-2.1/ws/integration/presto/pom.xml>
to org.apache.carbondata/carbondata-presto/1.4.0-SNAPSHOT/carbondata-presto-1.4.0-SNAPSHOT.pom
[JENKINS] Archiving <https://builds.apache.org/job/carbondata-master-spark-2.1/ws/integration/spark-common-test/pom.xml>
to org.apache.carbondata/carbondata-spark-common-test/1.4.0-SNAPSHOT/carbondata-spark-common-test-1.4.0-SNAPSHOT.pom
[JENKINS] Archiving <https://builds.apache.org/job/carbondata-master-spark-2.1/ws/store/sdk/pom.xml>
to org.apache.carbondata/carbondata-store-sdk/1.4.0-SNAPSHOT/carbondata-store-sdk-1.4.0-SNAPSHOT.pom
[JENKINS] Archiving <https://builds.apache.org/job/carbondata-master-spark-2.1/ws/store/sdk/target/carbondata-store-sdk-1.4.0-SNAPSHOT.jar>
to org.apache.carbondata/carbondata-store-sdk/1.4.0-SNAPSHOT/carbondata-store-sdk-1.4.0-SNAPSHOT.jar
[Fast Archiver] No artifacts from carbondata-master-spark-2.1 ยป Apache CarbonData :: Store
SDK #2227 to compare, so performing full copy of artifacts
Sending e-mails to: commits@carbondata.apache.org
channel stopped
Not sending mail to unregistered user jacky.likun@qq.com

Mime
View raw message