carbondata-commits mailing list archives

Site index · List index
Message view « Date » · « Thread »
Top « Date » · « Thread »
From Apache Jenkins Server <jenk...@builds.apache.org>
Subject Build failed in Jenkins: carbondata-master-spark-2.2 #223
Date Tue, 27 Mar 2018 13:20:43 GMT
See <https://builds.apache.org/job/carbondata-master-spark-2.2/223/display/redirect?page=changes>

Changes:

[chenliang613] [HOT-FIX] fixed issue related to generating PDF

------------------------------------------
[...truncated 5.14 MB...]
	at org.scalatest.SuperEngine.runImpl(Engine.scala:545)
	at org.scalatest.FunSuiteLike$class.run(FunSuiteLike.scala:212)
	at org.apache.carbondata.examplesCI.RunExamples.org$scalatest$BeforeAndAfterAll$$super$run(RunExamples.scala:31)
	at org.scalatest.BeforeAndAfterAll$class.liftedTree1$1(BeforeAndAfterAll.scala:257)
	at org.scalatest.BeforeAndAfterAll$class.run(BeforeAndAfterAll.scala:256)
	at org.apache.carbondata.examplesCI.RunExamples.run(RunExamples.scala:31)
	at org.scalatest.Suite$class.callExecuteOnSuite$1(Suite.scala:1492)
	at org.scalatest.Suite$$anonfun$runNestedSuites$1.apply(Suite.scala:1528)
	at org.scalatest.Suite$$anonfun$runNestedSuites$1.apply(Suite.scala:1526)
	at scala.collection.IndexedSeqOptimized$class.foreach(IndexedSeqOptimized.scala:33)
	at scala.collection.mutable.ArrayOps$ofRef.foreach(ArrayOps.scala:186)
	at org.scalatest.Suite$class.runNestedSuites(Suite.scala:1526)
	at org.scalatest.tools.DiscoverySuite.runNestedSuites(DiscoverySuite.scala:29)
	at org.scalatest.Suite$class.run(Suite.scala:1421)
	at org.scalatest.tools.DiscoverySuite.run(DiscoverySuite.scala:29)
	at org.scalatest.tools.SuiteRunner.run(SuiteRunner.scala:55)
	at org.scalatest.tools.Runner$$anonfun$doRunRunRunDaDoRunRun$3.apply(Runner.scala:2563)
	at org.scalatest.tools.Runner$$anonfun$doRunRunRunDaDoRunRun$3.apply(Runner.scala:2557)
	at scala.collection.immutable.List.foreach(List.scala:381)
	at org.scalatest.tools.Runner$.doRunRunRunDaDoRunRun(Runner.scala:2557)
	at org.scalatest.tools.Runner$$anonfun$runOptionallyWithPassFailReporter$2.apply(Runner.scala:1044)
	at org.scalatest.tools.Runner$$anonfun$runOptionallyWithPassFailReporter$2.apply(Runner.scala:1043)
	at org.scalatest.tools.Runner$.withClassLoaderAndDispatchReporter(Runner.scala:2722)
	at org.scalatest.tools.Runner$.runOptionallyWithPassFailReporter(Runner.scala:1043)
	at org.scalatest.tools.Runner$.main(Runner.scala:860)
	at org.scalatest.tools.Runner.main(Runner.scala)
18/03/27 06:19:18 AUDIT CarbonLoadDataCommand: [asf933.gq1.ygridcore.net][jenkins][Thread-1]Dataload
failure for default.timeseriestable_agg0_hour. Please check the logs
18/03/27 06:19:18 ERROR CarbonLoadDataCommand: ScalaTest-main-running-RunExamples 
java.lang.Exception: DataLoad failure
	at org.apache.carbondata.spark.rdd.CarbonDataRDDFactory$.loadCarbonData(CarbonDataRDDFactory.scala:470)
	at org.apache.spark.sql.execution.command.management.CarbonLoadDataCommand.loadData(CarbonLoadDataCommand.scala:511)
	at org.apache.spark.sql.execution.command.management.CarbonLoadDataCommand.processData(CarbonLoadDataCommand.scala:282)
	at org.apache.spark.sql.execution.command.preaaggregate.PreAggregateUtil$.startDataLoadForDataMap(PreAggregateUtil.scala:598)
	at org.apache.spark.sql.execution.command.preaaggregate.LoadPostAggregateListener$$anonfun$onEvent$6.apply(PreAggregateListeners.scala:240)
	at org.apache.spark.sql.execution.command.preaaggregate.LoadPostAggregateListener$$anonfun$onEvent$6.apply(PreAggregateListeners.scala:213)
	at scala.collection.TraversableLike$WithFilter$$anonfun$foreach$1.apply(TraversableLike.scala:733)
	at scala.collection.mutable.ResizableArray$class.foreach(ResizableArray.scala:59)
	at scala.collection.mutable.ArrayBuffer.foreach(ArrayBuffer.scala:48)
	at scala.collection.TraversableLike$WithFilter.foreach(TraversableLike.scala:732)
	at org.apache.spark.sql.execution.command.preaaggregate.LoadPostAggregateListener$.onEvent(PreAggregateListeners.scala:213)
	at org.apache.carbondata.events.OperationListenerBus.fireEvent(OperationListenerBus.java:117)
	at org.apache.carbondata.spark.rdd.CarbonDataRDDFactory$.loadCarbonData(CarbonDataRDDFactory.scala:508)
	at org.apache.spark.sql.execution.command.management.CarbonLoadDataCommand.loadData(CarbonLoadDataCommand.scala:511)
	at org.apache.spark.sql.execution.command.management.CarbonLoadDataCommand.processData(CarbonLoadDataCommand.scala:282)
	at org.apache.spark.sql.execution.command.AtomicRunnableCommand.run(package.scala:92)
	at org.apache.spark.sql.CarbonDataFrameWriter.loadDataFrame(CarbonDataFrameWriter.scala:61)
	at org.apache.spark.sql.CarbonDataFrameWriter.writeToCarbonFile(CarbonDataFrameWriter.scala:45)
	at org.apache.spark.sql.CarbonDataFrameWriter.appendToCarbonFile(CarbonDataFrameWriter.scala:40)
	at org.apache.spark.sql.CarbonSource.createRelation(CarbonSource.scala:123)
	at org.apache.spark.sql.execution.datasources.DataSource.write(DataSource.scala:469)
	at org.apache.spark.sql.execution.datasources.SaveIntoDataSourceCommand.run(SaveIntoDataSourceCommand.scala:50)
	at org.apache.spark.sql.execution.command.ExecutedCommandExec.sideEffectResult$lzycompute(commands.scala:58)
	at org.apache.spark.sql.execution.command.ExecutedCommandExec.sideEffectResult(commands.scala:56)
	at org.apache.spark.sql.execution.command.ExecutedCommandExec.doExecute(commands.scala:74)
	at org.apache.spark.sql.execution.SparkPlan$$anonfun$execute$1.apply(SparkPlan.scala:117)
	at org.apache.spark.sql.execution.SparkPlan$$anonfun$execute$1.apply(SparkPlan.scala:117)
	at org.apache.spark.sql.execution.SparkPlan$$anonfun$executeQuery$1.apply(SparkPlan.scala:138)
	at org.apache.spark.rdd.RDDOperationScope$.withScope(RDDOperationScope.scala:151)
	at org.apache.spark.sql.execution.SparkPlan.executeQuery(SparkPlan.scala:135)
	at org.apache.spark.sql.execution.SparkPlan.execute(SparkPlan.scala:116)
	at org.apache.spark.sql.execution.QueryExecution.toRdd$lzycompute(QueryExecution.scala:92)
	at org.apache.spark.sql.execution.QueryExecution.toRdd(QueryExecution.scala:92)
	at org.apache.spark.sql.DataFrameWriter.runCommand(DataFrameWriter.scala:609)
	at org.apache.spark.sql.DataFrameWriter.save(DataFrameWriter.scala:233)
	at org.apache.carbondata.examples.TimeSeriesPreAggregateTableExample$.exampleBody(TimeSeriesPreAggregateTableExample.scala:85)
	at org.apache.carbondata.examplesCI.RunExamples$$anonfun$15.apply$mcV$sp(RunExamples.scala:106)
	at org.apache.carbondata.examplesCI.RunExamples$$anonfun$15.apply(RunExamples.scala:106)
	at org.apache.carbondata.examplesCI.RunExamples$$anonfun$15.apply(RunExamples.scala:106)
	at org.scalatest.Transformer$$anonfun$apply$1.apply$mcV$sp(Transformer.scala:22)
	at org.scalatest.OutcomeOf$class.outcomeOf(OutcomeOf.scala:85)
	at org.scalatest.OutcomeOf$.outcomeOf(OutcomeOf.scala:104)
	at org.scalatest.Transformer.apply(Transformer.scala:22)
	at org.scalatest.Transformer.apply(Transformer.scala:20)
	at org.scalatest.FunSuiteLike$$anon$1.apply(FunSuiteLike.scala:166)
	at org.apache.spark.sql.test.util.CarbonFunSuite.withFixture(CarbonFunSuite.scala:41)
	at org.scalatest.FunSuiteLike$class.invokeWithFixture$1(FunSuiteLike.scala:163)
	at org.scalatest.FunSuiteLike$$anonfun$runTest$1.apply(FunSuiteLike.scala:175)
	at org.scalatest.FunSuiteLike$$anonfun$runTest$1.apply(FunSuiteLike.scala:175)
	at org.scalatest.SuperEngine.runTestImpl(Engine.scala:306)
	at org.scalatest.FunSuiteLike$class.runTest(FunSuiteLike.scala:175)
	at org.scalatest.FunSuite.runTest(FunSuite.scala:1555)
	at org.scalatest.FunSuiteLike$$anonfun$runTests$1.apply(FunSuiteLike.scala:208)
	at org.scalatest.FunSuiteLike$$anonfun$runTests$1.apply(FunSuiteLike.scala:208)
	at org.scalatest.SuperEngine$$anonfun$traverseSubNodes$1$1.apply(Engine.scala:413)
	at org.scalatest.SuperEngine$$anonfun$traverseSubNodes$1$1.apply(Engine.scala:401)
	at scala.collection.immutable.List.foreach(List.scala:381)
	at org.scalatest.SuperEngine.traverseSubNodes$1(Engine.scala:401)
	at org.scalatest.SuperEngine.org$scalatest$SuperEngine$$runTestsInBranch(Engine.scala:396)
	at org.scalatest.SuperEngine.runTestsImpl(Engine.scala:483)
	at org.scalatest.FunSuiteLike$class.runTests(FunSuiteLike.scala:208)
	at org.scalatest.FunSuite.runTests(FunSuite.scala:1555)
	at org.scalatest.Suite$class.run(Suite.scala:1424)
	at org.scalatest.FunSuite.org$scalatest$FunSuiteLike$$super$run(FunSuite.scala:1555)
	at org.scalatest.FunSuiteLike$$anonfun$run$1.apply(FunSuiteLike.scala:212)
	at org.scalatest.FunSuiteLike$$anonfun$run$1.apply(FunSuiteLike.scala:212)
	at org.scalatest.SuperEngine.runImpl(Engine.scala:545)
	at org.scalatest.FunSuiteLike$class.run(FunSuiteLike.scala:212)
	at org.apache.carbondata.examplesCI.RunExamples.org$scalatest$BeforeAndAfterAll$$super$run(RunExamples.scala:31)
	at org.scalatest.BeforeAndAfterAll$class.liftedTree1$1(BeforeAndAfterAll.scala:257)
	at org.scalatest.BeforeAndAfterAll$class.run(BeforeAndAfterAll.scala:256)
	at org.apache.carbondata.examplesCI.RunExamples.run(RunExamples.scala:31)
	at org.scalatest.Suite$class.callExecuteOnSuite$1(Suite.scala:1492)
	at org.scalatest.Suite$$anonfun$runNestedSuites$1.apply(Suite.scala:1528)
	at org.scalatest.Suite$$anonfun$runNestedSuites$1.apply(Suite.scala:1526)
	at scala.collection.IndexedSeqOptimized$class.foreach(IndexedSeqOptimized.scala:33)
	at scala.collection.mutable.ArrayOps$ofRef.foreach(ArrayOps.scala:186)
	at org.scalatest.Suite$class.runNestedSuites(Suite.scala:1526)
	at org.scalatest.tools.DiscoverySuite.runNestedSuites(DiscoverySuite.scala:29)
	at org.scalatest.Suite$class.run(Suite.scala:1421)
	at org.scalatest.tools.DiscoverySuite.run(DiscoverySuite.scala:29)
	at org.scalatest.tools.SuiteRunner.run(SuiteRunner.scala:55)
	at org.scalatest.tools.Runner$$anonfun$doRunRunRunDaDoRunRun$3.apply(Runner.scala:2563)
	at org.scalatest.tools.Runner$$anonfun$doRunRunRunDaDoRunRun$3.apply(Runner.scala:2557)
	at scala.collection.immutable.List.foreach(List.scala:381)
	at org.scalatest.tools.Runner$.doRunRunRunDaDoRunRun(Runner.scala:2557)
	at org.scalatest.tools.Runner$$anonfun$runOptionallyWithPassFailReporter$2.apply(Runner.scala:1044)
	at org.scalatest.tools.Runner$$anonfun$runOptionallyWithPassFailReporter$2.apply(Runner.scala:1043)
	at org.scalatest.tools.Runner$.withClassLoaderAndDispatchReporter(Runner.scala:2722)
	at org.scalatest.tools.Runner$.runOptionallyWithPassFailReporter(Runner.scala:1043)
	at org.scalatest.tools.Runner$.main(Runner.scala:860)
	at org.scalatest.tools.Runner.main(Runner.scala)
18/03/27 06:19:18 AUDIT CarbonLoadDataCommand: [asf933.gq1.ygridcore.net][jenkins][Thread-1]Dataload
failure for default.timeSeriesTable. Please check the logs
18/03/27 06:19:18 ERROR CarbonLoadDataCommand: ScalaTest-main-running-RunExamples Got exception
java.lang.Exception: DataLoad failure when processing data. But this command does not support
undo yet, skipping the undo part.
- TimeSeriesPreAggregateTableExample *** FAILED ***
  java.lang.Exception: DataLoad failure
  at org.apache.carbondata.spark.rdd.CarbonDataRDDFactory$.loadCarbonData(CarbonDataRDDFactory.scala:470)
  at org.apache.spark.sql.execution.command.management.CarbonLoadDataCommand.loadData(CarbonLoadDataCommand.scala:511)
  at org.apache.spark.sql.execution.command.management.CarbonLoadDataCommand.processData(CarbonLoadDataCommand.scala:282)
  at org.apache.spark.sql.execution.command.preaaggregate.PreAggregateUtil$.startDataLoadForDataMap(PreAggregateUtil.scala:598)
  at org.apache.spark.sql.execution.command.preaaggregate.LoadPostAggregateListener$$anonfun$onEvent$6.apply(PreAggregateListeners.scala:240)
  at org.apache.spark.sql.execution.command.preaaggregate.LoadPostAggregateListener$$anonfun$onEvent$6.apply(PreAggregateListeners.scala:213)
  at scala.collection.TraversableLike$WithFilter$$anonfun$foreach$1.apply(TraversableLike.scala:733)
  at scala.collection.mutable.ResizableArray$class.foreach(ResizableArray.scala:59)
  at scala.collection.mutable.ArrayBuffer.foreach(ArrayBuffer.scala:48)
  at scala.collection.TraversableLike$WithFilter.foreach(TraversableLike.scala:732)
  ...
Run completed in 3 minutes, 36 seconds.
Total number of tests run: 15
Suites: completed 2, aborted 0
Tests: succeeded 12, failed 3, canceled 0, ignored 0, pending 0
*** 3 TESTS FAILED ***
[JENKINS] Recording test results
[INFO] ------------------------------------------------------------------------
[INFO] Reactor Summary:
[INFO] 
[INFO] Apache CarbonData :: Parent ........................ SUCCESS [ 12.764 s]
[INFO] Apache CarbonData :: Common ........................ SUCCESS [ 17.774 s]
[INFO] Apache CarbonData :: Core .......................... SUCCESS [03:00 min]
[INFO] Apache CarbonData :: Processing .................... SUCCESS [ 34.802 s]
[INFO] Apache CarbonData :: Hadoop ........................ SUCCESS [ 32.454 s]
[INFO] Apache CarbonData :: Spark Common .................. SUCCESS [01:28 min]
[INFO] Apache CarbonData :: Streaming ..................... SUCCESS [ 37.576 s]
[INFO] Apache CarbonData :: Spark2 ........................ SUCCESS [15:14 min]
[INFO] Apache CarbonData :: Lucene Index DataMap .......... SUCCESS [ 29.156 s]
[INFO] Apache CarbonData :: Store SDK ..................... SUCCESS [ 54.971 s]
[INFO] Apache CarbonData :: Spark Common Test ............. SUCCESS [49:11 min]
[INFO] Apache CarbonData :: DataMap Examples .............. SUCCESS [ 18.912 s]
[INFO] Apache CarbonData :: Assembly ...................... SUCCESS [ 23.014 s]
[INFO] Apache CarbonData :: Hive .......................... SUCCESS [ 38.304 s]
[INFO] Apache CarbonData :: presto ........................ SUCCESS [01:31 min]
[INFO] Apache CarbonData :: Spark2 Examples ............... FAILURE [04:28 min]
[INFO] ------------------------------------------------------------------------
[INFO] BUILD FAILURE
[INFO] ------------------------------------------------------------------------
[INFO] Total time: 01:20 h
[INFO] Finished at: 2018-03-27T13:19:38+00:00
[INFO] Final Memory: 165M/1385M
[INFO] ------------------------------------------------------------------------
Waiting for Jenkins to finish collecting data
[ERROR] Failed to execute goal org.scalatest:scalatest-maven-plugin:1.0:test (test) on project
carbondata-examples-spark2: There are test failures -> [Help 1]
org.apache.maven.lifecycle.LifecycleExecutionException: Failed to execute goal org.scalatest:scalatest-maven-plugin:1.0:test
(test) on project carbondata-examples-spark2: There are test failures
	at org.apache.maven.lifecycle.internal.MojoExecutor.execute(MojoExecutor.java:212)
	at org.apache.maven.lifecycle.internal.MojoExecutor.execute(MojoExecutor.java:153)
	at org.apache.maven.lifecycle.internal.MojoExecutor.execute(MojoExecutor.java:145)
	at org.apache.maven.lifecycle.internal.LifecycleModuleBuilder.buildProject(LifecycleModuleBuilder.java:116)
	at org.apache.maven.lifecycle.internal.LifecycleModuleBuilder.buildProject(LifecycleModuleBuilder.java:80)
	at org.apache.maven.lifecycle.internal.builder.singlethreaded.SingleThreadedBuilder.build(SingleThreadedBuilder.java:51)
	at org.apache.maven.lifecycle.internal.LifecycleStarter.execute(LifecycleStarter.java:128)
	at org.apache.maven.DefaultMaven.doExecute(DefaultMaven.java:307)
	at org.apache.maven.DefaultMaven.doExecute(DefaultMaven.java:193)
	at org.apache.maven.DefaultMaven.execute(DefaultMaven.java:106)
	at org.jvnet.hudson.maven3.launcher.Maven33Launcher.main(Maven33Launcher.java:129)
	at sun.reflect.NativeMethodAccessorImpl.invoke0(Native Method)
	at sun.reflect.NativeMethodAccessorImpl.invoke(NativeMethodAccessorImpl.java:62)
	at sun.reflect.DelegatingMethodAccessorImpl.invoke(DelegatingMethodAccessorImpl.java:43)
	at java.lang.reflect.Method.invoke(Method.java:498)
	at org.codehaus.plexus.classworlds.launcher.Launcher.launchStandard(Launcher.java:330)
	at org.codehaus.plexus.classworlds.launcher.Launcher.launch(Launcher.java:238)
	at jenkins.maven3.agent.Maven33Main.launch(Maven33Main.java:176)
	at sun.reflect.NativeMethodAccessorImpl.invoke0(Native Method)
	at sun.reflect.NativeMethodAccessorImpl.invoke(NativeMethodAccessorImpl.java:62)
	at sun.reflect.DelegatingMethodAccessorImpl.invoke(DelegatingMethodAccessorImpl.java:43)
	at java.lang.reflect.Method.invoke(Method.java:498)
	at hudson.maven.Maven3Builder.call(Maven3Builder.java:139)
	at hudson.maven.Maven3Builder.call(Maven3Builder.java:70)
	at hudson.remoting.UserRequest.perform(UserRequest.java:207)
	at hudson.remoting.UserRequest.perform(UserRequest.java:53)
	at hudson.remoting.Request$2.run(Request.java:358)
	at hudson.remoting.InterceptingExecutorService$1.call(InterceptingExecutorService.java:72)
	at java.util.concurrent.FutureTask.run(FutureTask.java:266)
	at java.util.concurrent.ThreadPoolExecutor.runWorker(ThreadPoolExecutor.java:1149)
	at java.util.concurrent.ThreadPoolExecutor$Worker.run(ThreadPoolExecutor.java:624)
	at java.lang.Thread.run(Thread.java:748)
Caused by: org.apache.maven.plugin.MojoFailureException: There are test failures
	at org.scalatest.tools.maven.TestMojo.execute(TestMojo.java:107)
	at org.apache.maven.plugin.DefaultBuildPluginManager.executeMojo(DefaultBuildPluginManager.java:134)
	at org.apache.maven.lifecycle.internal.MojoExecutor.execute(MojoExecutor.java:207)
	... 31 more
[ERROR] 
[ERROR] Re-run Maven using the -X switch to enable full debug logging.
[ERROR] 
[ERROR] For more information about the errors and possible solutions, please read the following
articles:
[ERROR] [Help 1] http://cwiki.apache.org/confluence/display/MAVEN/MojoFailureException
[ERROR] 
[ERROR] After correcting the problems, you can resume the build with the command
[ERROR]   mvn <goals> -rf :carbondata-examples-spark2
[JENKINS] Archiving <https://builds.apache.org/job/carbondata-master-spark-2.2/ws/processing/pom.xml>
to org.apache.carbondata/carbondata-processing/1.4.0-SNAPSHOT/carbondata-processing-1.4.0-SNAPSHOT.pom
[JENKINS] Archiving <https://builds.apache.org/job/carbondata-master-spark-2.2/ws/processing/target/carbondata-processing-1.4.0-SNAPSHOT.jar>
to org.apache.carbondata/carbondata-processing/1.4.0-SNAPSHOT/carbondata-processing-1.4.0-SNAPSHOT.jar
[JENKINS] Archiving <https://builds.apache.org/job/carbondata-master-spark-2.2/ws/datamap/examples/pom.xml>
to org.apache.carbondata/carbondata-datamap-examples/1.4.0-SNAPSHOT/carbondata-datamap-examples-1.4.0-SNAPSHOT.pom
[JENKINS] Archiving <https://builds.apache.org/job/carbondata-master-spark-2.2/ws/datamap/examples/target/carbondata-datamap-examples-1.4.0-SNAPSHOT.jar>
to org.apache.carbondata/carbondata-datamap-examples/1.4.0-SNAPSHOT/carbondata-datamap-examples-1.4.0-SNAPSHOT.jar
[JENKINS] Archiving <https://builds.apache.org/job/carbondata-master-spark-2.2/ws/streaming/pom.xml>
to org.apache.carbondata/carbondata-streaming/1.4.0-SNAPSHOT/carbondata-streaming-1.4.0-SNAPSHOT.pom
[JENKINS] Archiving <https://builds.apache.org/job/carbondata-master-spark-2.2/ws/streaming/target/carbondata-streaming-1.4.0-SNAPSHOT.jar>
to org.apache.carbondata/carbondata-streaming/1.4.0-SNAPSHOT/carbondata-streaming-1.4.0-SNAPSHOT.jar
[JENKINS] Archiving <https://builds.apache.org/job/carbondata-master-spark-2.2/ws/integration/spark-common/pom.xml>
to org.apache.carbondata/carbondata-spark-common/1.4.0-SNAPSHOT/carbondata-spark-common-1.4.0-SNAPSHOT.pom
[JENKINS] Archiving <https://builds.apache.org/job/carbondata-master-spark-2.2/ws/integration/spark-common/target/carbondata-spark-common-1.4.0-SNAPSHOT.jar>
to org.apache.carbondata/carbondata-spark-common/1.4.0-SNAPSHOT/carbondata-spark-common-1.4.0-SNAPSHOT.jar
[JENKINS] Archiving <https://builds.apache.org/job/carbondata-master-spark-2.2/ws/datamap/lucene/pom.xml>
to org.apache.carbondata/carbondata-lucene/1.4.0-SNAPSHOT/carbondata-lucene-1.4.0-SNAPSHOT.pom
[JENKINS] Archiving <https://builds.apache.org/job/carbondata-master-spark-2.2/ws/datamap/lucene/target/carbondata-lucene-1.4.0-SNAPSHOT.jar>
to org.apache.carbondata/carbondata-lucene/1.4.0-SNAPSHOT/carbondata-lucene-1.4.0-SNAPSHOT.jar
[JENKINS] Archiving <https://builds.apache.org/job/carbondata-master-spark-2.2/ws/integration/hive/pom.xml>
to org.apache.carbondata/carbondata-hive/1.4.0-SNAPSHOT/carbondata-hive-1.4.0-SNAPSHOT.pom
[JENKINS] Archiving <https://builds.apache.org/job/carbondata-master-spark-2.2/ws/integration/hive/target/carbondata-hive-1.4.0-SNAPSHOT.jar>
to org.apache.carbondata/carbondata-hive/1.4.0-SNAPSHOT/carbondata-hive-1.4.0-SNAPSHOT.jar
[JENKINS] Archiving <https://builds.apache.org/job/carbondata-master-spark-2.2/ws/common/pom.xml>
to org.apache.carbondata/carbondata-common/1.4.0-SNAPSHOT/carbondata-common-1.4.0-SNAPSHOT.pom
[JENKINS] Archiving <https://builds.apache.org/job/carbondata-master-spark-2.2/ws/common/target/carbondata-common-1.4.0-SNAPSHOT.jar>
to org.apache.carbondata/carbondata-common/1.4.0-SNAPSHOT/carbondata-common-1.4.0-SNAPSHOT.jar
[JENKINS] Archiving <https://builds.apache.org/job/carbondata-master-spark-2.2/ws/examples/spark2/pom.xml>
to org.apache.carbondata/carbondata-examples-spark2/1.4.0-SNAPSHOT/carbondata-examples-spark2-1.4.0-SNAPSHOT.pom
[JENKINS] Archiving <https://builds.apache.org/job/carbondata-master-spark-2.2/ws/integration/spark2/pom.xml>
to org.apache.carbondata/carbondata-spark2/1.4.0-SNAPSHOT/carbondata-spark2-1.4.0-SNAPSHOT.pom
[JENKINS] Archiving <https://builds.apache.org/job/carbondata-master-spark-2.2/ws/integration/spark2/target/carbondata-spark2-1.4.0-SNAPSHOT.jar>
to org.apache.carbondata/carbondata-spark2/1.4.0-SNAPSHOT/carbondata-spark2-1.4.0-SNAPSHOT.jar
[JENKINS] Archiving <https://builds.apache.org/job/carbondata-master-spark-2.2/ws/assembly/pom.xml>
to org.apache.carbondata/carbondata-assembly/1.4.0-SNAPSHOT/carbondata-assembly-1.4.0-SNAPSHOT.pom
[JENKINS] Archiving <https://builds.apache.org/job/carbondata-master-spark-2.2/ws/pom.xml>
to org.apache.carbondata/carbondata-parent/1.4.0-SNAPSHOT/carbondata-parent-1.4.0-SNAPSHOT.pom
[JENKINS] Archiving <https://builds.apache.org/job/carbondata-master-spark-2.2/ws/core/pom.xml>
to org.apache.carbondata/carbondata-core/1.4.0-SNAPSHOT/carbondata-core-1.4.0-SNAPSHOT.pom
[JENKINS] Archiving <https://builds.apache.org/job/carbondata-master-spark-2.2/ws/core/target/carbondata-core-1.4.0-SNAPSHOT.jar>
to org.apache.carbondata/carbondata-core/1.4.0-SNAPSHOT/carbondata-core-1.4.0-SNAPSHOT.jar
[JENKINS] Archiving <https://builds.apache.org/job/carbondata-master-spark-2.2/ws/hadoop/pom.xml>
to org.apache.carbondata/carbondata-hadoop/1.4.0-SNAPSHOT/carbondata-hadoop-1.4.0-SNAPSHOT.pom
[JENKINS] Archiving <https://builds.apache.org/job/carbondata-master-spark-2.2/ws/hadoop/target/carbondata-hadoop-1.4.0-SNAPSHOT.jar>
to org.apache.carbondata/carbondata-hadoop/1.4.0-SNAPSHOT/carbondata-hadoop-1.4.0-SNAPSHOT.jar
[JENKINS] Archiving <https://builds.apache.org/job/carbondata-master-spark-2.2/ws/integration/presto/pom.xml>
to org.apache.carbondata/carbondata-presto/1.4.0-SNAPSHOT/carbondata-presto-1.4.0-SNAPSHOT.pom
[JENKINS] Archiving <https://builds.apache.org/job/carbondata-master-spark-2.2/ws/integration/presto/target/carbondata-presto-1.4.0-SNAPSHOT.zip>
to org.apache.carbondata/carbondata-presto/1.4.0-SNAPSHOT/carbondata-presto-1.4.0-SNAPSHOT.zip
[JENKINS] Archiving <https://builds.apache.org/job/carbondata-master-spark-2.2/ws/integration/presto/target/carbondata-presto-1.4.0-SNAPSHOT.jar>
to org.apache.carbondata/carbondata-presto/1.4.0-SNAPSHOT/carbondata-presto-1.4.0-SNAPSHOT.jar
[Fast Archiver] Compressed 77.49 MB of artifacts by 94.9% relative to #222
[JENKINS] Archiving <https://builds.apache.org/job/carbondata-master-spark-2.2/ws/integration/spark-common-test/pom.xml>
to org.apache.carbondata/carbondata-spark-common-test/1.4.0-SNAPSHOT/carbondata-spark-common-test-1.4.0-SNAPSHOT.pom
[JENKINS] Archiving <https://builds.apache.org/job/carbondata-master-spark-2.2/ws/integration/spark-common-test/target/carbondata-spark-common-test-1.4.0-SNAPSHOT.jar>
to org.apache.carbondata/carbondata-spark-common-test/1.4.0-SNAPSHOT/carbondata-spark-common-test-1.4.0-SNAPSHOT.jar
[JENKINS] Archiving <https://builds.apache.org/job/carbondata-master-spark-2.2/ws/store/sdk/pom.xml>
to org.apache.carbondata/carbondata-store-sdk/1.4.0-SNAPSHOT/carbondata-store-sdk-1.4.0-SNAPSHOT.pom
[JENKINS] Archiving <https://builds.apache.org/job/carbondata-master-spark-2.2/ws/store/sdk/target/carbondata-store-sdk-1.4.0-SNAPSHOT.jar>
to org.apache.carbondata/carbondata-store-sdk/1.4.0-SNAPSHOT/carbondata-store-sdk-1.4.0-SNAPSHOT.jar
Sending e-mails to: commits@carbondata.apache.org
channel stopped

Mime
View raw message