carbondata-commits mailing list archives

Site index · List index
Message view « Date » · « Thread »
Top « Date » · « Thread »
From Apache Jenkins Server <jenk...@builds.apache.org>
Subject Build failed in Jenkins: carbondata-master-spark-2.2 » Apache CarbonData :: Spark2 Examples #223
Date Tue, 27 Mar 2018 13:20:38 GMT
See <https://builds.apache.org/job/carbondata-master-spark-2.2/org.apache.carbondata$carbondata-examples-spark2/223/display/redirect>

------------------------------------------
[...truncated 944.16 KB...]
	at org.scalatest.BeforeAndAfterAll$class.liftedTree1$1(BeforeAndAfterAll.scala:257)
	at org.scalatest.BeforeAndAfterAll$class.run(BeforeAndAfterAll.scala:256)
	at org.apache.carbondata.examplesCI.RunExamples.run(RunExamples.scala:31)
	at org.scalatest.Suite$class.callExecuteOnSuite$1(Suite.scala:1492)
	at org.scalatest.Suite$$anonfun$runNestedSuites$1.apply(Suite.scala:1528)
	at org.scalatest.Suite$$anonfun$runNestedSuites$1.apply(Suite.scala:1526)
	at scala.collection.IndexedSeqOptimized$class.foreach(IndexedSeqOptimized.scala:33)
	at scala.collection.mutable.ArrayOps$ofRef.foreach(ArrayOps.scala:186)
	at org.scalatest.Suite$class.runNestedSuites(Suite.scala:1526)
	at org.scalatest.tools.DiscoverySuite.runNestedSuites(DiscoverySuite.scala:29)
	at org.scalatest.Suite$class.run(Suite.scala:1421)
	at org.scalatest.tools.DiscoverySuite.run(DiscoverySuite.scala:29)
	at org.scalatest.tools.SuiteRunner.run(SuiteRunner.scala:55)
	at org.scalatest.tools.Runner$$anonfun$doRunRunRunDaDoRunRun$3.apply(Runner.scala:2563)
	at org.scalatest.tools.Runner$$anonfun$doRunRunRunDaDoRunRun$3.apply(Runner.scala:2557)
	at scala.collection.immutable.List.foreach(List.scala:381)
	at org.scalatest.tools.Runner$.doRunRunRunDaDoRunRun(Runner.scala:2557)
	at org.scalatest.tools.Runner$$anonfun$runOptionallyWithPassFailReporter$2.apply(Runner.scala:1044)
	at org.scalatest.tools.Runner$$anonfun$runOptionallyWithPassFailReporter$2.apply(Runner.scala:1043)
	at org.scalatest.tools.Runner$.withClassLoaderAndDispatchReporter(Runner.scala:2722)
	at org.scalatest.tools.Runner$.runOptionallyWithPassFailReporter(Runner.scala:1043)
	at org.scalatest.tools.Runner$.main(Runner.scala:860)
	at org.scalatest.tools.Runner.main(Runner.scala)
Caused by: java.io.FileNotFoundException: /tmp/blockmgr-10eaf673-d480-488b-b61f-83748281fa18/16/temp_shuffle_96db3be6-daf4-45b0-aa73-2f44c55cb6d2
(No such file or directory)
	at java.io.FileOutputStream.open0(Native Method)
	at java.io.FileOutputStream.open(FileOutputStream.java:270)
	at java.io.FileOutputStream.<init>(FileOutputStream.java:213)
	at org.apache.spark.storage.DiskBlockObjectWriter.initialize(DiskBlockObjectWriter.scala:103)
	at org.apache.spark.storage.DiskBlockObjectWriter.open(DiskBlockObjectWriter.scala:116)
	at org.apache.spark.storage.DiskBlockObjectWriter.write(DiskBlockObjectWriter.scala:237)
	at org.apache.spark.shuffle.sort.BypassMergeSortShuffleWriter.write(BypassMergeSortShuffleWriter.java:151)
	at org.apache.spark.scheduler.ShuffleMapTask.runTask(ShuffleMapTask.scala:96)
	at org.apache.spark.scheduler.ShuffleMapTask.runTask(ShuffleMapTask.scala:53)
	at org.apache.spark.scheduler.Task.run(Task.scala:108)
	at org.apache.spark.executor.Executor$TaskRunner.run(Executor.scala:338)
	at java.util.concurrent.ThreadPoolExecutor.runWorker(ThreadPoolExecutor.java:1149)
	at java.util.concurrent.ThreadPoolExecutor$Worker.run(ThreadPoolExecutor.java:624)
	at java.lang.Thread.run(Thread.java:748)
18/03/27 06:19:18 AUDIT CarbonDataRDDFactory$: [asf933.gq1.ygridcore.net][jenkins][Thread-1]Data
load is failed for default.timeseriestable_agg0_hour
18/03/27 06:19:18 ERROR CarbonLoadDataCommand: ScalaTest-main-running-RunExamples 
java.lang.Exception: DataLoad failure
	at org.apache.carbondata.spark.rdd.CarbonDataRDDFactory$.loadCarbonData(CarbonDataRDDFactory.scala:470)
	at org.apache.spark.sql.execution.command.management.CarbonLoadDataCommand.loadData(CarbonLoadDataCommand.scala:511)
	at org.apache.spark.sql.execution.command.management.CarbonLoadDataCommand.processData(CarbonLoadDataCommand.scala:282)
	at org.apache.spark.sql.execution.command.preaaggregate.PreAggregateUtil$.startDataLoadForDataMap(PreAggregateUtil.scala:598)
	at org.apache.spark.sql.execution.command.preaaggregate.LoadPostAggregateListener$$anonfun$onEvent$6.apply(PreAggregateListeners.scala:240)
	at org.apache.spark.sql.execution.command.preaaggregate.LoadPostAggregateListener$$anonfun$onEvent$6.apply(PreAggregateListeners.scala:213)
	at scala.collection.TraversableLike$WithFilter$$anonfun$foreach$1.apply(TraversableLike.scala:733)
	at scala.collection.mutable.ResizableArray$class.foreach(ResizableArray.scala:59)
	at scala.collection.mutable.ArrayBuffer.foreach(ArrayBuffer.scala:48)
	at scala.collection.TraversableLike$WithFilter.foreach(TraversableLike.scala:732)
	at org.apache.spark.sql.execution.command.preaaggregate.LoadPostAggregateListener$.onEvent(PreAggregateListeners.scala:213)
	at org.apache.carbondata.events.OperationListenerBus.fireEvent(OperationListenerBus.java:117)
	at org.apache.carbondata.spark.rdd.CarbonDataRDDFactory$.loadCarbonData(CarbonDataRDDFactory.scala:508)
	at org.apache.spark.sql.execution.command.management.CarbonLoadDataCommand.loadData(CarbonLoadDataCommand.scala:511)
	at org.apache.spark.sql.execution.command.management.CarbonLoadDataCommand.processData(CarbonLoadDataCommand.scala:282)
	at org.apache.spark.sql.execution.command.AtomicRunnableCommand.run(package.scala:92)
	at org.apache.spark.sql.CarbonDataFrameWriter.loadDataFrame(CarbonDataFrameWriter.scala:61)
	at org.apache.spark.sql.CarbonDataFrameWriter.writeToCarbonFile(CarbonDataFrameWriter.scala:45)
	at org.apache.spark.sql.CarbonDataFrameWriter.appendToCarbonFile(CarbonDataFrameWriter.scala:40)
	at org.apache.spark.sql.CarbonSource.createRelation(CarbonSource.scala:123)
	at org.apache.spark.sql.execution.datasources.DataSource.write(DataSource.scala:469)
	at org.apache.spark.sql.execution.datasources.SaveIntoDataSourceCommand.run(SaveIntoDataSourceCommand.scala:50)
	at org.apache.spark.sql.execution.command.ExecutedCommandExec.sideEffectResult$lzycompute(commands.scala:58)
	at org.apache.spark.sql.execution.command.ExecutedCommandExec.sideEffectResult(commands.scala:56)
	at org.apache.spark.sql.execution.command.ExecutedCommandExec.doExecute(commands.scala:74)
	at org.apache.spark.sql.execution.SparkPlan$$anonfun$execute$1.apply(SparkPlan.scala:117)
	at org.apache.spark.sql.execution.SparkPlan$$anonfun$execute$1.apply(SparkPlan.scala:117)
	at org.apache.spark.sql.execution.SparkPlan$$anonfun$executeQuery$1.apply(SparkPlan.scala:138)
	at org.apache.spark.rdd.RDDOperationScope$.withScope(RDDOperationScope.scala:151)
	at org.apache.spark.sql.execution.SparkPlan.executeQuery(SparkPlan.scala:135)
	at org.apache.spark.sql.execution.SparkPlan.execute(SparkPlan.scala:116)
	at org.apache.spark.sql.execution.QueryExecution.toRdd$lzycompute(QueryExecution.scala:92)
	at org.apache.spark.sql.execution.QueryExecution.toRdd(QueryExecution.scala:92)
	at org.apache.spark.sql.DataFrameWriter.runCommand(DataFrameWriter.scala:609)
	at org.apache.spark.sql.DataFrameWriter.save(DataFrameWriter.scala:233)
	at org.apache.carbondata.examples.TimeSeriesPreAggregateTableExample$.exampleBody(TimeSeriesPreAggregateTableExample.scala:85)
	at org.apache.carbondata.examplesCI.RunExamples$$anonfun$15.apply$mcV$sp(RunExamples.scala:106)
	at org.apache.carbondata.examplesCI.RunExamples$$anonfun$15.apply(RunExamples.scala:106)
	at org.apache.carbondata.examplesCI.RunExamples$$anonfun$15.apply(RunExamples.scala:106)
	at org.scalatest.Transformer$$anonfun$apply$1.apply$mcV$sp(Transformer.scala:22)
	at org.scalatest.OutcomeOf$class.outcomeOf(OutcomeOf.scala:85)
	at org.scalatest.OutcomeOf$.outcomeOf(OutcomeOf.scala:104)
	at org.scalatest.Transformer.apply(Transformer.scala:22)
	at org.scalatest.Transformer.apply(Transformer.scala:20)
	at org.scalatest.FunSuiteLike$$anon$1.apply(FunSuiteLike.scala:166)
	at org.apache.spark.sql.test.util.CarbonFunSuite.withFixture(CarbonFunSuite.scala:41)
	at org.scalatest.FunSuiteLike$class.invokeWithFixture$1(FunSuiteLike.scala:163)
	at org.scalatest.FunSuiteLike$$anonfun$runTest$1.apply(FunSuiteLike.scala:175)
	at org.scalatest.FunSuiteLike$$anonfun$runTest$1.apply(FunSuiteLike.scala:175)
	at org.scalatest.SuperEngine.runTestImpl(Engine.scala:306)
	at org.scalatest.FunSuiteLike$class.runTest(FunSuiteLike.scala:175)
	at org.scalatest.FunSuite.runTest(FunSuite.scala:1555)
	at org.scalatest.FunSuiteLike$$anonfun$runTests$1.apply(FunSuiteLike.scala:208)
	at org.scalatest.FunSuiteLike$$anonfun$runTests$1.apply(FunSuiteLike.scala:208)
	at org.scalatest.SuperEngine$$anonfun$traverseSubNodes$1$1.apply(Engine.scala:413)
	at org.scalatest.SuperEngine$$anonfun$traverseSubNodes$1$1.apply(Engine.scala:401)
	at scala.collection.immutable.List.foreach(List.scala:381)
	at org.scalatest.SuperEngine.traverseSubNodes$1(Engine.scala:401)
	at org.scalatest.SuperEngine.org$scalatest$SuperEngine$$runTestsInBranch(Engine.scala:396)
	at org.scalatest.SuperEngine.runTestsImpl(Engine.scala:483)
	at org.scalatest.FunSuiteLike$class.runTests(FunSuiteLike.scala:208)
	at org.scalatest.FunSuite.runTests(FunSuite.scala:1555)
	at org.scalatest.Suite$class.run(Suite.scala:1424)
	at org.scalatest.FunSuite.org$scalatest$FunSuiteLike$$super$run(FunSuite.scala:1555)
	at org.scalatest.FunSuiteLike$$anonfun$run$1.apply(FunSuiteLike.scala:212)
	at org.scalatest.FunSuiteLike$$anonfun$run$1.apply(FunSuiteLike.scala:212)
	at org.scalatest.SuperEngine.runImpl(Engine.scala:545)
	at org.scalatest.FunSuiteLike$class.run(FunSuiteLike.scala:212)
	at org.apache.carbondata.examplesCI.RunExamples.org$scalatest$BeforeAndAfterAll$$super$run(RunExamples.scala:31)
	at org.scalatest.BeforeAndAfterAll$class.liftedTree1$1(BeforeAndAfterAll.scala:257)
	at org.scalatest.BeforeAndAfterAll$class.run(BeforeAndAfterAll.scala:256)
	at org.apache.carbondata.examplesCI.RunExamples.run(RunExamples.scala:31)
	at org.scalatest.Suite$class.callExecuteOnSuite$1(Suite.scala:1492)
	at org.scalatest.Suite$$anonfun$runNestedSuites$1.apply(Suite.scala:1528)
	at org.scalatest.Suite$$anonfun$runNestedSuites$1.apply(Suite.scala:1526)
	at scala.collection.IndexedSeqOptimized$class.foreach(IndexedSeqOptimized.scala:33)
	at scala.collection.mutable.ArrayOps$ofRef.foreach(ArrayOps.scala:186)
	at org.scalatest.Suite$class.runNestedSuites(Suite.scala:1526)
	at org.scalatest.tools.DiscoverySuite.runNestedSuites(DiscoverySuite.scala:29)
	at org.scalatest.Suite$class.run(Suite.scala:1421)
	at org.scalatest.tools.DiscoverySuite.run(DiscoverySuite.scala:29)
	at org.scalatest.tools.SuiteRunner.run(SuiteRunner.scala:55)
	at org.scalatest.tools.Runner$$anonfun$doRunRunRunDaDoRunRun$3.apply(Runner.scala:2563)
	at org.scalatest.tools.Runner$$anonfun$doRunRunRunDaDoRunRun$3.apply(Runner.scala:2557)
	at scala.collection.immutable.List.foreach(List.scala:381)
	at org.scalatest.tools.Runner$.doRunRunRunDaDoRunRun(Runner.scala:2557)
	at org.scalatest.tools.Runner$$anonfun$runOptionallyWithPassFailReporter$2.apply(Runner.scala:1044)
	at org.scalatest.tools.Runner$$anonfun$runOptionallyWithPassFailReporter$2.apply(Runner.scala:1043)
	at org.scalatest.tools.Runner$.withClassLoaderAndDispatchReporter(Runner.scala:2722)
	at org.scalatest.tools.Runner$.runOptionallyWithPassFailReporter(Runner.scala:1043)
	at org.scalatest.tools.Runner$.main(Runner.scala:860)
	at org.scalatest.tools.Runner.main(Runner.scala)
18/03/27 06:19:18 AUDIT CarbonLoadDataCommand: [asf933.gq1.ygridcore.net][jenkins][Thread-1]Dataload
failure for default.timeseriestable_agg0_hour. Please check the logs
18/03/27 06:19:18 ERROR CarbonLoadDataCommand: ScalaTest-main-running-RunExamples 
java.lang.Exception: DataLoad failure
	at org.apache.carbondata.spark.rdd.CarbonDataRDDFactory$.loadCarbonData(CarbonDataRDDFactory.scala:470)
	at org.apache.spark.sql.execution.command.management.CarbonLoadDataCommand.loadData(CarbonLoadDataCommand.scala:511)
	at org.apache.spark.sql.execution.command.management.CarbonLoadDataCommand.processData(CarbonLoadDataCommand.scala:282)
	at org.apache.spark.sql.execution.command.preaaggregate.PreAggregateUtil$.startDataLoadForDataMap(PreAggregateUtil.scala:598)
	at org.apache.spark.sql.execution.command.preaaggregate.LoadPostAggregateListener$$anonfun$onEvent$6.apply(PreAggregateListeners.scala:240)
	at org.apache.spark.sql.execution.command.preaaggregate.LoadPostAggregateListener$$anonfun$onEvent$6.apply(PreAggregateListeners.scala:213)
	at scala.collection.TraversableLike$WithFilter$$anonfun$foreach$1.apply(TraversableLike.scala:733)
	at scala.collection.mutable.ResizableArray$class.foreach(ResizableArray.scala:59)
	at scala.collection.mutable.ArrayBuffer.foreach(ArrayBuffer.scala:48)
	at scala.collection.TraversableLike$WithFilter.foreach(TraversableLike.scala:732)
	at org.apache.spark.sql.execution.command.preaaggregate.LoadPostAggregateListener$.onEvent(PreAggregateListeners.scala:213)
	at org.apache.carbondata.events.OperationListenerBus.fireEvent(OperationListenerBus.java:117)
	at org.apache.carbondata.spark.rdd.CarbonDataRDDFactory$.loadCarbonData(CarbonDataRDDFactory.scala:508)
	at org.apache.spark.sql.execution.command.management.CarbonLoadDataCommand.loadData(CarbonLoadDataCommand.scala:511)
	at org.apache.spark.sql.execution.command.management.CarbonLoadDataCommand.processData(CarbonLoadDataCommand.scala:282)
	at org.apache.spark.sql.execution.command.AtomicRunnableCommand.run(package.scala:92)
	at org.apache.spark.sql.CarbonDataFrameWriter.loadDataFrame(CarbonDataFrameWriter.scala:61)
	at org.apache.spark.sql.CarbonDataFrameWriter.writeToCarbonFile(CarbonDataFrameWriter.scala:45)
	at org.apache.spark.sql.CarbonDataFrameWriter.appendToCarbonFile(CarbonDataFrameWriter.scala:40)
	at org.apache.spark.sql.CarbonSource.createRelation(CarbonSource.scala:123)
	at org.apache.spark.sql.execution.datasources.DataSource.write(DataSource.scala:469)
	at org.apache.spark.sql.execution.datasources.SaveIntoDataSourceCommand.run(SaveIntoDataSourceCommand.scala:50)
	at org.apache.spark.sql.execution.command.ExecutedCommandExec.sideEffectResult$lzycompute(commands.scala:58)
	at org.apache.spark.sql.execution.command.ExecutedCommandExec.sideEffectResult(commands.scala:56)
	at org.apache.spark.sql.execution.command.ExecutedCommandExec.doExecute(commands.scala:74)
	at org.apache.spark.sql.execution.SparkPlan$$anonfun$execute$1.apply(SparkPlan.scala:117)
	at org.apache.spark.sql.execution.SparkPlan$$anonfun$execute$1.apply(SparkPlan.scala:117)
	at org.apache.spark.sql.execution.SparkPlan$$anonfun$executeQuery$1.apply(SparkPlan.scala:138)
	at org.apache.spark.rdd.RDDOperationScope$.withScope(RDDOperationScope.scala:151)
	at org.apache.spark.sql.execution.SparkPlan.executeQuery(SparkPlan.scala:135)
	at org.apache.spark.sql.execution.SparkPlan.execute(SparkPlan.scala:116)
	at org.apache.spark.sql.execution.QueryExecution.toRdd$lzycompute(QueryExecution.scala:92)
	at org.apache.spark.sql.execution.QueryExecution.toRdd(QueryExecution.scala:92)
	at org.apache.spark.sql.DataFrameWriter.runCommand(DataFrameWriter.scala:609)
	at org.apache.spark.sql.DataFrameWriter.save(DataFrameWriter.scala:233)
	at org.apache.carbondata.examples.TimeSeriesPreAggregateTableExample$.exampleBody(TimeSeriesPreAggregateTableExample.scala:85)
	at org.apache.carbondata.examplesCI.RunExamples$$anonfun$15.apply$mcV$sp(RunExamples.scala:106)
	at org.apache.carbondata.examplesCI.RunExamples$$anonfun$15.apply(RunExamples.scala:106)
	at org.apache.carbondata.examplesCI.RunExamples$$anonfun$15.apply(RunExamples.scala:106)
	at org.scalatest.Transformer$$anonfun$apply$1.apply$mcV$sp(Transformer.scala:22)
	at org.scalatest.OutcomeOf$class.outcomeOf(OutcomeOf.scala:85)
	at org.scalatest.OutcomeOf$.outcomeOf(OutcomeOf.scala:104)
	at org.scalatest.Transformer.apply(Transformer.scala:22)
	at org.scalatest.Transformer.apply(Transformer.scala:20)
	at org.scalatest.FunSuiteLike$$anon$1.apply(FunSuiteLike.scala:166)
	at org.apache.spark.sql.test.util.CarbonFunSuite.withFixture(CarbonFunSuite.scala:41)
	at org.scalatest.FunSuiteLike$class.invokeWithFixture$1(FunSuiteLike.scala:163)
	at org.scalatest.FunSuiteLike$$anonfun$runTest$1.apply(FunSuiteLike.scala:175)
	at org.scalatest.FunSuiteLike$$anonfun$runTest$1.apply(FunSuiteLike.scala:175)
	at org.scalatest.SuperEngine.runTestImpl(Engine.scala:306)
	at org.scalatest.FunSuiteLike$class.runTest(FunSuiteLike.scala:175)
	at org.scalatest.FunSuite.runTest(FunSuite.scala:1555)
	at org.scalatest.FunSuiteLike$$anonfun$runTests$1.apply(FunSuiteLike.scala:208)
	at org.scalatest.FunSuiteLike$$anonfun$runTests$1.apply(FunSuiteLike.scala:208)
	at org.scalatest.SuperEngine$$anonfun$traverseSubNodes$1$1.apply(Engine.scala:413)
	at org.scalatest.SuperEngine$$anonfun$traverseSubNodes$1$1.apply(Engine.scala:401)
	at scala.collection.immutable.List.foreach(List.scala:381)
	at org.scalatest.SuperEngine.traverseSubNodes$1(Engine.scala:401)
	at org.scalatest.SuperEngine.org$scalatest$SuperEngine$$runTestsInBranch(Engine.scala:396)
	at org.scalatest.SuperEngine.runTestsImpl(Engine.scala:483)
	at org.scalatest.FunSuiteLike$class.runTests(FunSuiteLike.scala:208)
	at org.scalatest.FunSuite.runTests(FunSuite.scala:1555)
	at org.scalatest.Suite$class.run(Suite.scala:1424)
	at org.scalatest.FunSuite.org$scalatest$FunSuiteLike$$super$run(FunSuite.scala:1555)
	at org.scalatest.FunSuiteLike$$anonfun$run$1.apply(FunSuiteLike.scala:212)
	at org.scalatest.FunSuiteLike$$anonfun$run$1.apply(FunSuiteLike.scala:212)
	at org.scalatest.SuperEngine.runImpl(Engine.scala:545)
	at org.scalatest.FunSuiteLike$class.run(FunSuiteLike.scala:212)
	at org.apache.carbondata.examplesCI.RunExamples.org$scalatest$BeforeAndAfterAll$$super$run(RunExamples.scala:31)
	at org.scalatest.BeforeAndAfterAll$class.liftedTree1$1(BeforeAndAfterAll.scala:257)
	at org.scalatest.BeforeAndAfterAll$class.run(BeforeAndAfterAll.scala:256)
	at org.apache.carbondata.examplesCI.RunExamples.run(RunExamples.scala:31)
	at org.scalatest.Suite$class.callExecuteOnSuite$1(Suite.scala:1492)
	at org.scalatest.Suite$$anonfun$runNestedSuites$1.apply(Suite.scala:1528)
	at org.scalatest.Suite$$anonfun$runNestedSuites$1.apply(Suite.scala:1526)
	at scala.collection.IndexedSeqOptimized$class.foreach(IndexedSeqOptimized.scala:33)
	at scala.collection.mutable.ArrayOps$ofRef.foreach(ArrayOps.scala:186)
	at org.scalatest.Suite$class.runNestedSuites(Suite.scala:1526)
	at org.scalatest.tools.DiscoverySuite.runNestedSuites(DiscoverySuite.scala:29)
	at org.scalatest.Suite$class.run(Suite.scala:1421)
	at org.scalatest.tools.DiscoverySuite.run(DiscoverySuite.scala:29)
	at org.scalatest.tools.SuiteRunner.run(SuiteRunner.scala:55)
	at org.scalatest.tools.Runner$$anonfun$doRunRunRunDaDoRunRun$3.apply(Runner.scala:2563)
	at org.scalatest.tools.Runner$$anonfun$doRunRunRunDaDoRunRun$3.apply(Runner.scala:2557)
	at scala.collection.immutable.List.foreach(List.scala:381)
	at org.scalatest.tools.Runner$.doRunRunRunDaDoRunRun(Runner.scala:2557)
	at org.scalatest.tools.Runner$$anonfun$runOptionallyWithPassFailReporter$2.apply(Runner.scala:1044)
	at org.scalatest.tools.Runner$$anonfun$runOptionallyWithPassFailReporter$2.apply(Runner.scala:1043)
	at org.scalatest.tools.Runner$.withClassLoaderAndDispatchReporter(Runner.scala:2722)
	at org.scalatest.tools.Runner$.runOptionallyWithPassFailReporter(Runner.scala:1043)
	at org.scalatest.tools.Runner$.main(Runner.scala:860)
	at org.scalatest.tools.Runner.main(Runner.scala)
18/03/27 06:19:18 AUDIT CarbonLoadDataCommand: [asf933.gq1.ygridcore.net][jenkins][Thread-1]Dataload
failure for default.timeSeriesTable. Please check the logs
18/03/27 06:19:18 ERROR CarbonLoadDataCommand: ScalaTest-main-running-RunExamples Got exception
java.lang.Exception: DataLoad failure when processing data. But this command does not support
undo yet, skipping the undo part.
- TimeSeriesPreAggregateTableExample *** FAILED ***
  java.lang.Exception: DataLoad failure
  at org.apache.carbondata.spark.rdd.CarbonDataRDDFactory$.loadCarbonData(CarbonDataRDDFactory.scala:470)
  at org.apache.spark.sql.execution.command.management.CarbonLoadDataCommand.loadData(CarbonLoadDataCommand.scala:511)
  at org.apache.spark.sql.execution.command.management.CarbonLoadDataCommand.processData(CarbonLoadDataCommand.scala:282)
  at org.apache.spark.sql.execution.command.preaaggregate.PreAggregateUtil$.startDataLoadForDataMap(PreAggregateUtil.scala:598)
  at org.apache.spark.sql.execution.command.preaaggregate.LoadPostAggregateListener$$anonfun$onEvent$6.apply(PreAggregateListeners.scala:240)
  at org.apache.spark.sql.execution.command.preaaggregate.LoadPostAggregateListener$$anonfun$onEvent$6.apply(PreAggregateListeners.scala:213)
  at scala.collection.TraversableLike$WithFilter$$anonfun$foreach$1.apply(TraversableLike.scala:733)
  at scala.collection.mutable.ResizableArray$class.foreach(ResizableArray.scala:59)
  at scala.collection.mutable.ArrayBuffer.foreach(ArrayBuffer.scala:48)
  at scala.collection.TraversableLike$WithFilter.foreach(TraversableLike.scala:732)
  ...
Run completed in 3 minutes, 36 seconds.
Total number of tests run: 15
Suites: completed 2, aborted 0
Tests: succeeded 12, failed 3, canceled 0, ignored 0, pending 0
*** 3 TESTS FAILED ***
[JENKINS] Recording test results

Mime
View raw message