carbondata-commits mailing list archives

Site index · List index
Message view « Date » · « Thread »
Top « Date » · « Thread »
From Apache Jenkins Server <jenk...@builds.apache.org>
Subject Build failed in Jenkins: carbondata-master-spark-2.2 #29
Date Thu, 01 Feb 2018 16:56:39 GMT
See <https://builds.apache.org/job/carbondata-master-spark-2.2/29/display/redirect?page=changes>

Changes:

[ravipesala] Problem: For old store the measure min and max values are written

[ravipesala] [CARBONDATA-2113]compatibility fix for v2

[ravipesala] [CARBONDATA-2064] Add compaction listener

------------------------------------------
[...truncated 24.33 KB...]
[INFO] Downloaded: http://repo1.maven.org/maven2/org/apache/hadoop/hadoop-mapreduce-client-app/2.6.5/hadoop-mapreduce-client-app-2.6.5.pom
(5 KB at 305.8 KB/sec)
[INFO] Downloading: http://repo1.maven.org/maven2/org/apache/hadoop/hadoop-mapreduce-client/2.6.5/hadoop-mapreduce-client-2.6.5.pom
[INFO] Downloaded: http://repo1.maven.org/maven2/org/apache/hadoop/hadoop-mapreduce-client/2.6.5/hadoop-mapreduce-client-2.6.5.pom
(7 KB at 409.4 KB/sec)
[INFO] Downloading: http://repo1.maven.org/maven2/org/apache/hadoop/hadoop-mapreduce-client-common/2.6.5/hadoop-mapreduce-client-common-2.6.5.pom
[INFO] Downloaded: http://repo1.maven.org/maven2/org/apache/hadoop/hadoop-mapreduce-client-common/2.6.5/hadoop-mapreduce-client-common-2.6.5.pom
(4 KB at 213.1 KB/sec)
[INFO] Downloading: http://repo1.maven.org/maven2/org/apache/hadoop/hadoop-yarn-common/2.6.5/hadoop-yarn-common-2.6.5.pom
[INFO] Downloaded: http://repo1.maven.org/maven2/org/apache/hadoop/hadoop-yarn-common/2.6.5/hadoop-yarn-common-2.6.5.pom
(11 KB at 732.2 KB/sec)
[INFO] Downloading: http://repo1.maven.org/maven2/org/apache/hadoop/hadoop-yarn/2.6.5/hadoop-yarn-2.6.5.pom
[INFO] Downloaded: http://repo1.maven.org/maven2/org/apache/hadoop/hadoop-yarn/2.6.5/hadoop-yarn-2.6.5.pom
(4 KB at 194.1 KB/sec)
[INFO] Downloading: http://repo1.maven.org/maven2/org/apache/hadoop/hadoop-yarn-api/2.6.5/hadoop-yarn-api-2.6.5.pom
[INFO] Downloaded: http://repo1.maven.org/maven2/org/apache/hadoop/hadoop-yarn-api/2.6.5/hadoop-yarn-api-2.6.5.pom
(5 KB at 300.3 KB/sec)
[INFO] Downloading: http://repo1.maven.org/maven2/org/apache/hadoop/hadoop-yarn-client/2.6.5/hadoop-yarn-client-2.6.5.pom
[INFO] Downloaded: http://repo1.maven.org/maven2/org/apache/hadoop/hadoop-yarn-client/2.6.5/hadoop-yarn-client-2.6.5.pom
(7 KB at 441.1 KB/sec)
[INFO] Downloading: http://repo1.maven.org/maven2/org/apache/hadoop/hadoop-yarn-server-common/2.6.5/hadoop-yarn-server-common-2.6.5.pom
[INFO] Downloaded: http://repo1.maven.org/maven2/org/apache/hadoop/hadoop-yarn-server-common/2.6.5/hadoop-yarn-server-common-2.6.5.pom
(6 KB at 292.2 KB/sec)
[INFO] Downloading: http://repo1.maven.org/maven2/org/apache/hadoop/hadoop-yarn-server/2.6.5/hadoop-yarn-server-2.6.5.pom
[INFO] Downloaded: http://repo1.maven.org/maven2/org/apache/hadoop/hadoop-yarn-server/2.6.5/hadoop-yarn-server-2.6.5.pom
(2 KB at 123.3 KB/sec)
[INFO] Downloading: http://repo1.maven.org/maven2/org/apache/hadoop/hadoop-mapreduce-client-shuffle/2.6.5/hadoop-mapreduce-client-shuffle-2.6.5.pom
[INFO] Downloaded: http://repo1.maven.org/maven2/org/apache/hadoop/hadoop-mapreduce-client-shuffle/2.6.5/hadoop-mapreduce-client-shuffle-2.6.5.pom
(3 KB at 187.4 KB/sec)
[INFO] Downloading: http://repo1.maven.org/maven2/org/apache/hadoop/hadoop-mapreduce-client-jobclient/2.6.5/hadoop-mapreduce-client-jobclient-2.6.5.pom
[INFO] Downloaded: http://repo1.maven.org/maven2/org/apache/hadoop/hadoop-mapreduce-client-jobclient/2.6.5/hadoop-mapreduce-client-jobclient-2.6.5.pom
(6 KB at 368.2 KB/sec)
[INFO] Downloading: http://repo1.maven.org/maven2/org/apache/hadoop/hadoop-yarn-server-nodemanager/2.6.5/hadoop-yarn-server-nodemanager-2.6.5.pom
[INFO] Downloaded: http://repo1.maven.org/maven2/org/apache/hadoop/hadoop-yarn-server-nodemanager/2.6.5/hadoop-yarn-server-nodemanager-2.6.5.pom
(12 KB at 735.8 KB/sec)
[INFO] Downloading: http://repo1.maven.org/maven2/org/apache/hadoop/hadoop-annotations/2.6.5/hadoop-annotations-2.6.5.pom
[INFO] Downloaded: http://repo1.maven.org/maven2/org/apache/hadoop/hadoop-annotations/2.6.5/hadoop-annotations-2.6.5.pom
(3 KB at 137.2 KB/sec)
[INFO] Downloading: http://repo1.maven.org/maven2/org/apache/spark/spark-launcher_2.11/2.2.1/spark-launcher_2.11-2.2.1.pom
[INFO] Downloaded: http://repo1.maven.org/maven2/org/apache/spark/spark-launcher_2.11/2.2.1/spark-launcher_2.11-2.2.1.pom
(7 KB at 392.4 KB/sec)
[INFO] Downloading: http://repo1.maven.org/maven2/org/apache/spark/spark-network-common_2.11/2.2.1/spark-network-common_2.11-2.2.1.pom
[INFO] Downloaded: http://repo1.maven.org/maven2/org/apache/spark/spark-network-common_2.11/2.2.1/spark-network-common_2.11-2.2.1.pom
(6 KB at 343.5 KB/sec)
[INFO] Downloading: http://repo1.maven.org/maven2/io/netty/netty-all/4.0.43.Final/netty-all-4.0.43.Final.pom
[INFO] Downloaded: http://repo1.maven.org/maven2/io/netty/netty-all/4.0.43.Final/netty-all-4.0.43.Final.pom
(19 KB at 1129.7 KB/sec)
[INFO] Downloading: http://repo1.maven.org/maven2/org/apache/spark/spark-network-shuffle_2.11/2.2.1/spark-network-shuffle_2.11-2.2.1.pom
[INFO] Downloaded: http://repo1.maven.org/maven2/org/apache/spark/spark-network-shuffle_2.11/2.2.1/spark-network-shuffle_2.11-2.2.1.pom
(5 KB at 307.2 KB/sec)
[INFO] Downloading: http://repo1.maven.org/maven2/org/apache/spark/spark-unsafe_2.11/2.2.1/spark-unsafe_2.11-2.2.1.pom
[INFO] Downloaded: http://repo1.maven.org/maven2/org/apache/spark/spark-unsafe_2.11/2.2.1/spark-unsafe_2.11-2.2.1.pom
(5 KB at 171.1 KB/sec)
[INFO] Downloading: http://repo1.maven.org/maven2/net/java/dev/jets3t/jets3t/0.9.3/jets3t-0.9.3.pom
[INFO] Downloaded: http://repo1.maven.org/maven2/net/java/dev/jets3t/jets3t/0.9.3/jets3t-0.9.3.pom
(16 KB at 1038.1 KB/sec)
[INFO] Downloading: http://repo1.maven.org/maven2/io/netty/netty/3.9.9.Final/netty-3.9.9.Final.pom
[INFO] Downloaded: http://repo1.maven.org/maven2/io/netty/netty/3.9.9.Final/netty-3.9.9.Final.pom
(29 KB at 1407.6 KB/sec)
[INFO] Downloading: http://repo1.maven.org/maven2/org/apache/spark/spark-catalyst_2.11/2.2.1/spark-catalyst_2.11-2.2.1.pom
[INFO] Downloaded: http://repo1.maven.org/maven2/org/apache/spark/spark-catalyst_2.11/2.2.1/spark-catalyst_2.11-2.2.1.pom
(8 KB at 531.6 KB/sec)
[INFO] Downloading: http://repo1.maven.org/maven2/org/apache/parquet/parquet-column/1.8.2/parquet-column-1.8.2.pom
[INFO] Downloaded: http://repo1.maven.org/maven2/org/apache/parquet/parquet-column/1.8.2/parquet-column-1.8.2.pom
(6 KB at 296.8 KB/sec)
[INFO] Downloading: http://repo1.maven.org/maven2/org/apache/parquet/parquet/1.8.2/parquet-1.8.2.pom
[INFO] Downloaded: http://repo1.maven.org/maven2/org/apache/parquet/parquet/1.8.2/parquet-1.8.2.pom
(19 KB at 676.6 KB/sec)
[INFO] Downloading: http://repo1.maven.org/maven2/org/apache/parquet/parquet-common/1.8.2/parquet-common-1.8.2.pom
[INFO] Downloaded: http://repo1.maven.org/maven2/org/apache/parquet/parquet-common/1.8.2/parquet-common-1.8.2.pom
(4 KB at 226.1 KB/sec)
[INFO] Downloading: http://repo1.maven.org/maven2/org/apache/parquet/parquet-encoding/1.8.2/parquet-encoding-1.8.2.pom
[INFO] Downloaded: http://repo1.maven.org/maven2/org/apache/parquet/parquet-encoding/1.8.2/parquet-encoding-1.8.2.pom
(4 KB at 227.4 KB/sec)
[INFO] Downloading: http://repo1.maven.org/maven2/org/apache/parquet/parquet-hadoop/1.8.2/parquet-hadoop-1.8.2.pom
[INFO] Downloaded: http://repo1.maven.org/maven2/org/apache/parquet/parquet-hadoop/1.8.2/parquet-hadoop-1.8.2.pom
(4 KB at 230.0 KB/sec)
[INFO] Downloading: http://repo1.maven.org/maven2/org/apache/parquet/parquet-format/2.3.1/parquet-format-2.3.1.pom
[INFO] Downloaded: http://repo1.maven.org/maven2/org/apache/parquet/parquet-format/2.3.1/parquet-format-2.3.1.pom
(7 KB at 482.8 KB/sec)
[INFO] Downloading: http://repo1.maven.org/maven2/org/apache/parquet/parquet-jackson/1.8.2/parquet-jackson-1.8.2.pom
[INFO] Downloaded: http://repo1.maven.org/maven2/org/apache/parquet/parquet-jackson/1.8.2/parquet-jackson-1.8.2.pom
(4 KB at 246.5 KB/sec)
[INFO] Downloading: http://repo1.maven.org/maven2/org/apache/spark/spark-sql_2.11/2.2.1/spark-sql_2.11-2.2.1.jar
[INFO] Downloading: http://repo1.maven.org/maven2/org/apache/spark/spark-sketch_2.11/2.2.1/spark-sketch_2.11-2.2.1.jar
[INFO] Downloading: http://repo1.maven.org/maven2/org/apache/spark/spark-core_2.11/2.2.1/spark-core_2.11-2.2.1.jar
[INFO] Downloading: http://repo1.maven.org/maven2/org/apache/hadoop/hadoop-client/2.6.5/hadoop-client-2.6.5.jar
[INFO] Downloading: http://repo1.maven.org/maven2/org/apache/hadoop/hadoop-mapreduce-client-app/2.6.5/hadoop-mapreduce-client-app-2.6.5.jar
[INFO] Downloaded: http://repo1.maven.org/maven2/org/apache/hadoop/hadoop-client/2.6.5/hadoop-client-2.6.5.jar
(26 KB at 976.0 KB/sec)
[INFO] Downloading: http://repo1.maven.org/maven2/org/apache/hadoop/hadoop-mapreduce-client-common/2.6.5/hadoop-mapreduce-client-common-2.6.5.jar
[INFO] Downloaded: http://repo1.maven.org/maven2/org/apache/spark/spark-sketch_2.11/2.2.1/spark-sketch_2.11-2.2.1.jar
(30 KB at 563.5 KB/sec)
[INFO] Downloading: http://repo1.maven.org/maven2/org/apache/hadoop/hadoop-yarn-client/2.6.5/hadoop-yarn-client-2.6.5.jar
[INFO] Downloaded: http://repo1.maven.org/maven2/org/apache/hadoop/hadoop-yarn-client/2.6.5/hadoop-yarn-client-2.6.5.jar
(149 KB at 2966.1 KB/sec)
[INFO] Downloading: http://repo1.maven.org/maven2/org/apache/hadoop/hadoop-yarn-server-common/2.6.5/hadoop-yarn-server-common-2.6.5.jar
[INFO] Downloaded: http://repo1.maven.org/maven2/org/apache/hadoop/hadoop-mapreduce-client-app/2.6.5/hadoop-mapreduce-client-app-2.6.5.jar
(517 KB at 8193.6 KB/sec)
[INFO] Downloading: http://repo1.maven.org/maven2/org/apache/hadoop/hadoop-mapreduce-client-shuffle/2.6.5/hadoop-mapreduce-client-shuffle-2.6.5.jar
[INFO] Downloaded: http://repo1.maven.org/maven2/org/apache/hadoop/hadoop-mapreduce-client-common/2.6.5/hadoop-mapreduce-client-common-2.6.5.jar
(673 KB at 10339.7 KB/sec)
[INFO] Downloading: http://repo1.maven.org/maven2/org/apache/hadoop/hadoop-yarn-api/2.6.5/hadoop-yarn-api-2.6.5.jar
[INFO] Downloaded: http://repo1.maven.org/maven2/org/apache/hadoop/hadoop-yarn-server-common/2.6.5/hadoop-yarn-server-common-2.6.5.jar
(313 KB at 4222.4 KB/sec)
[INFO] Downloading: http://repo1.maven.org/maven2/org/apache/hadoop/hadoop-mapreduce-client-jobclient/2.6.5/hadoop-mapreduce-client-jobclient-2.6.5.jar
[INFO] Downloaded: http://repo1.maven.org/maven2/org/apache/hadoop/hadoop-mapreduce-client-shuffle/2.6.5/hadoop-mapreduce-client-shuffle-2.6.5.jar
(67 KB at 827.3 KB/sec)
[INFO] Downloading: http://repo1.maven.org/maven2/org/apache/spark/spark-launcher_2.11/2.2.1/spark-launcher_2.11-2.2.1.jar
[INFO] Downloaded: http://repo1.maven.org/maven2/org/apache/hadoop/hadoop-mapreduce-client-jobclient/2.6.5/hadoop-mapreduce-client-jobclient-2.6.5.jar
(60 KB at 672.7 KB/sec)
[INFO] Downloading: http://repo1.maven.org/maven2/org/apache/spark/spark-network-common_2.11/2.2.1/spark-network-common_2.11-2.2.1.jar
[INFO] Downloaded: http://repo1.maven.org/maven2/org/apache/spark/spark-launcher_2.11/2.2.1/spark-launcher_2.11-2.2.1.jar
(66 KB at 666.1 KB/sec)
[INFO] Downloading: http://repo1.maven.org/maven2/org/apache/spark/spark-network-shuffle_2.11/2.2.1/spark-network-shuffle_2.11-2.2.1.jar
[INFO] Downloaded: http://repo1.maven.org/maven2/org/apache/spark/spark-network-shuffle_2.11/2.2.1/spark-network-shuffle_2.11-2.2.1.jar
(62 KB at 532.1 KB/sec)
[INFO] Downloading: http://repo1.maven.org/maven2/org/apache/spark/spark-unsafe_2.11/2.2.1/spark-unsafe_2.11-2.2.1.jar
[INFO] Downloaded: http://repo1.maven.org/maven2/org/apache/hadoop/hadoop-yarn-api/2.6.5/hadoop-yarn-api-2.6.5.jar
(1852 KB at 14696.4 KB/sec)
[INFO] Downloading: http://repo1.maven.org/maven2/io/netty/netty-all/4.0.43.Final/netty-all-4.0.43.Final.jar
[INFO] Downloaded: http://repo1.maven.org/maven2/org/apache/spark/spark-unsafe_2.11/2.2.1/spark-unsafe_2.11-2.2.1.jar
(46 KB at 344.6 KB/sec)
[INFO] Downloading: http://repo1.maven.org/maven2/org/apache/spark/spark-catalyst_2.11/2.2.1/spark-catalyst_2.11-2.2.1.jar
[INFO] Downloaded: http://repo1.maven.org/maven2/io/netty/netty-all/4.0.43.Final/netty-all-4.0.43.Final.jar
(2272 KB at 10975.7 KB/sec)
[INFO] Downloading: http://repo1.maven.org/maven2/org/apache/spark/spark-tags_2.11/2.2.1/spark-tags_2.11-2.2.1.jar
[INFO] Downloaded: http://repo1.maven.org/maven2/org/apache/spark/spark-network-common_2.11/2.2.1/spark-network-common_2.11-2.2.1.jar
(2320 KB at 11097.5 KB/sec)
[INFO] Downloading: http://repo1.maven.org/maven2/org/apache/parquet/parquet-column/1.8.2/parquet-column-1.8.2.jar
[INFO] Downloaded: http://repo1.maven.org/maven2/org/apache/spark/spark-tags_2.11/2.2.1/spark-tags_2.11-2.2.1.jar
(16 KB at 67.4 KB/sec)
[INFO] Downloading: http://repo1.maven.org/maven2/org/apache/parquet/parquet-common/1.8.2/parquet-common-1.8.2.jar
[INFO] Downloaded: http://repo1.maven.org/maven2/org/apache/parquet/parquet-common/1.8.2/parquet-common-1.8.2.jar
(42 KB at 167.5 KB/sec)
[INFO] Downloading: http://repo1.maven.org/maven2/org/apache/parquet/parquet-encoding/1.8.2/parquet-encoding-1.8.2.jar
[INFO] Downloaded: http://repo1.maven.org/maven2/org/apache/parquet/parquet-column/1.8.2/parquet-column-1.8.2.jar
(935 KB at 3768.4 KB/sec)
[INFO] Downloading: http://repo1.maven.org/maven2/org/apache/parquet/parquet-hadoop/1.8.2/parquet-hadoop-1.8.2.jar
[INFO] Downloaded: http://repo1.maven.org/maven2/org/apache/parquet/parquet-hadoop/1.8.2/parquet-hadoop-1.8.2.jar
(245 KB at 889.1 KB/sec)
[INFO] Downloading: http://repo1.maven.org/maven2/org/apache/parquet/parquet-format/2.3.1/parquet-format-2.3.1.jar
[INFO] Downloaded: http://repo1.maven.org/maven2/org/apache/parquet/parquet-encoding/1.8.2/parquet-encoding-1.8.2.jar
(280 KB at 1012.2 KB/sec)
[INFO] Downloading: http://repo1.maven.org/maven2/org/apache/parquet/parquet-jackson/1.8.2/parquet-jackson-1.8.2.jar
[INFO] Downloaded: http://repo1.maven.org/maven2/org/apache/spark/spark-sql_2.11/2.2.1/spark-sql_2.11-2.2.1.jar
(6980 KB at 20896.0 KB/sec)
[INFO] Downloaded: http://repo1.maven.org/maven2/org/apache/parquet/parquet-format/2.3.1/parquet-format-2.3.1.jar
(382 KB at 1242.9 KB/sec)
[INFO] Downloaded: http://repo1.maven.org/maven2/org/apache/parquet/parquet-jackson/1.8.2/parquet-jackson-1.8.2.jar
(1024 KB at 3111.1 KB/sec)
[INFO] Downloaded: http://repo1.maven.org/maven2/org/apache/spark/spark-core_2.11/2.2.1/spark-core_2.11-2.2.1.jar
(12206 KB at 31457.2 KB/sec)
[INFO] Downloaded: http://repo1.maven.org/maven2/org/apache/spark/spark-catalyst_2.11/2.2.1/spark-catalyst_2.11-2.2.1.jar
(8124 KB at 18675.0 KB/sec)
[INFO] 
[INFO] --- maven-clean-plugin:2.5:clean (default-clean) @ carbondata-core ---
[INFO] 
[INFO] --- jacoco-maven-plugin:0.7.9:prepare-agent (default-prepare-agent) @ carbondata-core
---
[INFO] argLine set to -javaagent:/home/jenkins/jenkins-slave/maven-repositories/0/org/jacoco/org.jacoco.agent/0.7.9/org.jacoco.agent-0.7.9-runtime.jar=destfile=<https://builds.apache.org/job/carbondata-master-spark-2.2/ws/core/target/jacoco.exec>
[INFO] 
[INFO] --- maven-remote-resources-plugin:1.5:process (default) @ carbondata-core ---
[INFO] 
[INFO] --- exec-maven-plugin:1.2.1:exec (default) @ carbondata-core ---
[INFO] 
[INFO] --- maven-resources-plugin:2.7:resources (default-resources) @ carbondata-core ---
[INFO] Using 'UTF-8' encoding to copy filtered resources.
[INFO] Copying 1 resource
[INFO] Copying 1 resource
[INFO] Copying 3 resources
[INFO] 
[INFO] --- maven-compiler-plugin:3.2:compile (default-compile) @ carbondata-core ---
[INFO] Changes detected - recompiling the module!
[INFO] Compiling 580 source files to <https://builds.apache.org/job/carbondata-master-spark-2.2/ws/core/target/classes>
[INFO] <https://builds.apache.org/job/carbondata-master-spark-2.2/ws/core/src/main/java/org/apache/carbondata/core/util/ByteUtil.java>:
<https://builds.apache.org/job/carbondata-master-spark-2.2/ws/core/src/main/java/org/apache/carbondata/core/util/ByteUtil.java>
uses or overrides a deprecated API.
[INFO] <https://builds.apache.org/job/carbondata-master-spark-2.2/ws/core/src/main/java/org/apache/carbondata/core/util/ByteUtil.java>:
Recompile with -Xlint:deprecation for details.
[INFO] <https://builds.apache.org/job/carbondata-master-spark-2.2/ws/core/src/main/java/org/apache/carbondata/core/datamap/DataMapStoreManager.java>:
Some input files use unchecked or unsafe operations.
[INFO] <https://builds.apache.org/job/carbondata-master-spark-2.2/ws/core/src/main/java/org/apache/carbondata/core/datamap/DataMapStoreManager.java>:
Recompile with -Xlint:unchecked for details.
[INFO] -------------------------------------------------------------
[WARNING] COMPILATION WARNING : 
[INFO] -------------------------------------------------------------
[WARNING] <https://builds.apache.org/job/carbondata-master-spark-2.2/ws/core/src/main/java/org/apache/carbondata/core/memory/CarbonUnsafe.java>:[23,16]
sun.misc.Unsafe is internal proprietary API and may be removed in a future release
[WARNING] <https://builds.apache.org/job/carbondata-master-spark-2.2/ws/core/src/main/java/org/apache/carbondata/core/memory/CarbonUnsafe.java>:[43,18]
sun.misc.Unsafe is internal proprietary API and may be removed in a future release
[WARNING] <https://builds.apache.org/job/carbondata-master-spark-2.2/ws/core/src/main/java/org/apache/carbondata/core/memory/CarbonUnsafe.java>:[47,21]
sun.misc.Unsafe is internal proprietary API and may be removed in a future release
[WARNING] <https://builds.apache.org/job/carbondata-master-spark-2.2/ws/core/src/main/java/org/apache/carbondata/core/memory/CarbonUnsafe.java>:[49,17]
sun.misc.Unsafe is internal proprietary API and may be removed in a future release
[WARNING] <https://builds.apache.org/job/carbondata-master-spark-2.2/ws/core/src/main/java/org/apache/carbondata/core/memory/CarbonUnsafe.java>:[70,17]
sun.misc.Unsafe is internal proprietary API and may be removed in a future release
[INFO] 5 warnings 
[INFO] -------------------------------------------------------------
[INFO] -------------------------------------------------------------
[ERROR] COMPILATION ERROR : 
[INFO] -------------------------------------------------------------
[ERROR] <https://builds.apache.org/job/carbondata-master-spark-2.2/ws/core/src/main/java/org/apache/carbondata/core/util/AbstractDataFileFooterConverter.java>:[169,28]
cannot find symbol
  symbol:   method isSetSchema_time_stamp()
  location: variable readIndexHeader of type org.apache.carbondata.format.IndexHeader
[ERROR] <https://builds.apache.org/job/carbondata-master-spark-2.2/ws/core/src/main/java/org/apache/carbondata/core/util/AbstractDataFileFooterConverter.java>:[170,67]
cannot find symbol
  symbol:   method getSchema_time_stamp()
  location: variable readIndexHeader of type org.apache.carbondata.format.IndexHeader
[ERROR] <https://builds.apache.org/job/carbondata-master-spark-2.2/ws/core/src/main/java/org/apache/carbondata/core/util/CarbonMetadataUtil.java>:[260,16]
cannot find symbol
  symbol:   method setSchema_time_stamp(long)
  location: variable indexHeader of type org.apache.carbondata.format.IndexHeader
[INFO] 3 errors 
[INFO] -------------------------------------------------------------
[INFO] ------------------------------------------------------------------------
[INFO] Reactor Summary:
[INFO] 
[INFO] Apache CarbonData :: Parent ........................ SUCCESS [ 13.218 s]
[INFO] Apache CarbonData :: Common ........................ SUCCESS [ 16.812 s]
[INFO] Apache CarbonData :: Core .......................... FAILURE [ 15.231 s]
[INFO] Apache CarbonData :: Processing .................... SKIPPED
[INFO] Apache CarbonData :: Hadoop ........................ SKIPPED
[INFO] Apache CarbonData :: Spark Common .................. SKIPPED
[INFO] Apache CarbonData :: Streaming ..................... SKIPPED
[INFO] Apache CarbonData :: Spark2 ........................ SKIPPED
[INFO] Apache CarbonData :: Spark Common Test ............. SKIPPED
[INFO] Apache CarbonData :: Assembly ...................... SKIPPED
[INFO] Apache CarbonData :: Hive .......................... SKIPPED
[INFO] Apache CarbonData :: presto ........................ SKIPPED
[INFO] Apache CarbonData :: Spark2 Examples ............... SKIPPED
[INFO] ------------------------------------------------------------------------
[INFO] BUILD FAILURE
[INFO] ------------------------------------------------------------------------
[INFO] Total time: 01:04 min
[INFO] Finished at: 2018-02-01T16:56:11+00:00
[INFO] Final Memory: 81M/976M
[INFO] ------------------------------------------------------------------------
[ERROR] Failed to execute goal org.apache.maven.plugins:maven-compiler-plugin:3.2:compile
(default-compile) on project carbondata-core: Compilation failure: Compilation failure:
[ERROR] <https://builds.apache.org/job/carbondata-master-spark-2.2/ws/core/src/main/java/org/apache/carbondata/core/util/AbstractDataFileFooterConverter.java>:[169,28]
cannot find symbol
[ERROR] symbol:   method isSetSchema_time_stamp()
[ERROR] location: variable readIndexHeader of type org.apache.carbondata.format.IndexHeader
[ERROR] <https://builds.apache.org/job/carbondata-master-spark-2.2/ws/core/src/main/java/org/apache/carbondata/core/util/AbstractDataFileFooterConverter.java>:[170,67]
cannot find symbol
[ERROR] symbol:   method getSchema_time_stamp()
[ERROR] location: variable readIndexHeader of type org.apache.carbondata.format.IndexHeader
[ERROR] <https://builds.apache.org/job/carbondata-master-spark-2.2/ws/core/src/main/java/org/apache/carbondata/core/util/CarbonMetadataUtil.java>:[260,16]
cannot find symbol
[ERROR] symbol:   method setSchema_time_stamp(long)
[ERROR] location: variable indexHeader of type org.apache.carbondata.format.IndexHeader
[ERROR] -> [Help 1]
org.apache.maven.lifecycle.LifecycleExecutionException: Failed to execute goal org.apache.maven.plugins:maven-compiler-plugin:3.2:compile
(default-compile) on project carbondata-core: Compilation failure
	at org.apache.maven.lifecycle.internal.MojoExecutor.execute(MojoExecutor.java:212)
	at org.apache.maven.lifecycle.internal.MojoExecutor.execute(MojoExecutor.java:153)
	at org.apache.maven.lifecycle.internal.MojoExecutor.execute(MojoExecutor.java:145)
	at org.apache.maven.lifecycle.internal.LifecycleModuleBuilder.buildProject(LifecycleModuleBuilder.java:116)
	at org.apache.maven.lifecycle.internal.LifecycleModuleBuilder.buildProject(LifecycleModuleBuilder.java:80)
	at org.apache.maven.lifecycle.internal.builder.singlethreaded.SingleThreadedBuilder.build(SingleThreadedBuilder.java:51)
	at org.apache.maven.lifecycle.internal.LifecycleStarter.execute(LifecycleStarter.java:128)
	at org.apache.maven.DefaultMaven.doExecute(DefaultMaven.java:307)
	at org.apache.maven.DefaultMaven.doExecute(DefaultMaven.java:193)
	at org.apache.maven.DefaultMaven.execute(DefaultMaven.java:106)
	at org.jvnet.hudson.maven3.launcher.Maven33Launcher.main(Maven33Launcher.java:129)
	at sun.reflect.NativeMethodAccessorImpl.invoke0(Native Method)
	at sun.reflect.NativeMethodAccessorImpl.invoke(NativeMethodAccessorImpl.java:62)
	at sun.reflect.DelegatingMethodAccessorImpl.invoke(DelegatingMethodAccessorImpl.java:43)
	at java.lang.reflect.Method.invoke(Method.java:498)
	at org.codehaus.plexus.classworlds.launcher.Launcher.launchStandard(Launcher.java:330)
	at org.codehaus.plexus.classworlds.launcher.Launcher.launch(Launcher.java:238)
	at jenkins.maven3.agent.Maven33Main.launch(Maven33Main.java:176)
	at sun.reflect.NativeMethodAccessorImpl.invoke0(Native Method)
	at sun.reflect.NativeMethodAccessorImpl.invoke(NativeMethodAccessorImpl.java:62)
	at sun.reflect.DelegatingMethodAccessorImpl.invoke(DelegatingMethodAccessorImpl.java:43)
	at java.lang.reflect.Method.invoke(Method.java:498)
	at hudson.maven.Maven3Builder.call(Maven3Builder.java:139)
	at hudson.maven.Maven3Builder.call(Maven3Builder.java:70)
	at hudson.remoting.UserRequest.perform(UserRequest.java:207)
	at hudson.remoting.UserRequest.perform(UserRequest.java:53)
	at hudson.remoting.Request$2.run(Request.java:358)
	at hudson.remoting.InterceptingExecutorService$1.call(InterceptingExecutorService.java:72)
	at java.util.concurrent.FutureTask.run(FutureTask.java:266)
	at java.util.concurrent.ThreadPoolExecutor.runWorker(ThreadPoolExecutor.java:1149)
	at java.util.concurrent.ThreadPoolExecutor$Worker.run(ThreadPoolExecutor.java:624)
	at java.lang.Thread.run(Thread.java:748)
Caused by: org.apache.maven.plugin.compiler.CompilationFailureException: Compilation failure
	at org.apache.maven.plugin.compiler.AbstractCompilerMojo.execute(AbstractCompilerMojo.java:909)
	at org.apache.maven.plugin.compiler.CompilerMojo.execute(CompilerMojo.java:129)
	at org.apache.maven.plugin.DefaultBuildPluginManager.executeMojo(DefaultBuildPluginManager.java:134)
	at org.apache.maven.lifecycle.internal.MojoExecutor.execute(MojoExecutor.java:207)
	... 31 more
[ERROR] 
[ERROR] Re-run Maven using the -X switch to enable full debug logging.
[ERROR] 
[ERROR] For more information about the errors and possible solutions, please read the following
articles:
[ERROR] [Help 1] http://cwiki.apache.org/confluence/display/MAVEN/MojoFailureException
[ERROR] 
[ERROR] After correcting the problems, you can resume the build with the command
[ERROR]   mvn <goals> -rf :carbondata-core
[JENKINS] Archiving <https://builds.apache.org/job/carbondata-master-spark-2.2/ws/processing/pom.xml>
to org.apache.carbondata/carbondata-processing/1.3.0-SNAPSHOT/carbondata-processing-1.3.0-SNAPSHOT.pom
[JENKINS] Archiving <https://builds.apache.org/job/carbondata-master-spark-2.2/ws/streaming/pom.xml>
to org.apache.carbondata/carbondata-streaming/1.3.0-SNAPSHOT/carbondata-streaming-1.3.0-SNAPSHOT.pom
[JENKINS] Archiving <https://builds.apache.org/job/carbondata-master-spark-2.2/ws/integration/spark-common/pom.xml>
to org.apache.carbondata/carbondata-spark-common/1.3.0-SNAPSHOT/carbondata-spark-common-1.3.0-SNAPSHOT.pom
[JENKINS] Archiving <https://builds.apache.org/job/carbondata-master-spark-2.2/ws/integration/hive/pom.xml>
to org.apache.carbondata/carbondata-hive/1.3.0-SNAPSHOT/carbondata-hive-1.3.0-SNAPSHOT.pom
[JENKINS] Archiving <https://builds.apache.org/job/carbondata-master-spark-2.2/ws/common/pom.xml>
to org.apache.carbondata/carbondata-common/1.3.0-SNAPSHOT/carbondata-common-1.3.0-SNAPSHOT.pom
[JENKINS] Archiving <https://builds.apache.org/job/carbondata-master-spark-2.2/ws/common/target/carbondata-common-1.3.0-SNAPSHOT.jar>
to org.apache.carbondata/carbondata-common/1.3.0-SNAPSHOT/carbondata-common-1.3.0-SNAPSHOT.jar
[JENKINS] Archiving <https://builds.apache.org/job/carbondata-master-spark-2.2/ws/examples/spark2/pom.xml>
to org.apache.carbondata/carbondata-examples-spark2/1.3.0-SNAPSHOT/carbondata-examples-spark2-1.3.0-SNAPSHOT.pom
[JENKINS] Archiving <https://builds.apache.org/job/carbondata-master-spark-2.2/ws/integration/spark2/pom.xml>
to org.apache.carbondata/carbondata-spark2/1.3.0-SNAPSHOT/carbondata-spark2-1.3.0-SNAPSHOT.pom
[JENKINS] Archiving <https://builds.apache.org/job/carbondata-master-spark-2.2/ws/assembly/pom.xml>
to org.apache.carbondata/carbondata-assembly/1.3.0-SNAPSHOT/carbondata-assembly-1.3.0-SNAPSHOT.pom
[JENKINS] Archiving <https://builds.apache.org/job/carbondata-master-spark-2.2/ws/pom.xml>
to org.apache.carbondata/carbondata-parent/1.3.0-SNAPSHOT/carbondata-parent-1.3.0-SNAPSHOT.pom
[JENKINS] Archiving <https://builds.apache.org/job/carbondata-master-spark-2.2/ws/core/pom.xml>
to org.apache.carbondata/carbondata-core/1.3.0-SNAPSHOT/carbondata-core-1.3.0-SNAPSHOT.pom
[JENKINS] Archiving <https://builds.apache.org/job/carbondata-master-spark-2.2/ws/hadoop/pom.xml>
to org.apache.carbondata/carbondata-hadoop/1.3.0-SNAPSHOT/carbondata-hadoop-1.3.0-SNAPSHOT.pom
[JENKINS] Archiving <https://builds.apache.org/job/carbondata-master-spark-2.2/ws/integration/presto/pom.xml>
to org.apache.carbondata/carbondata-presto/1.3.0-SNAPSHOT/carbondata-presto-1.3.0-SNAPSHOT.pom
[JENKINS] Archiving <https://builds.apache.org/job/carbondata-master-spark-2.2/ws/integration/spark-common-test/pom.xml>
to org.apache.carbondata/carbondata-spark-common-test/1.3.0-SNAPSHOT/carbondata-spark-common-test-1.3.0-SNAPSHOT.pom
Sending e-mails to: commits@carbondata.apache.org ravi.pesala@gmail.com
channel stopped
Not sending mail to unregistered user kumarvishal.1802@gmail.com
Not sending mail to unregistered user kunalkapoor642@gmail.com

Mime
View raw message