carbondata-commits mailing list archives

Site index · List index
Message view « Date » · « Thread »
Top « Date » · « Thread »
From Apache Jenkins Server <jenk...@builds.apache.org>
Subject Build failed in Jenkins: carbondata-master-spark-2.1 » Apache CarbonData :: presto #1385
Date Fri, 15 Sep 2017 09:50:42 GMT
See <https://builds.apache.org/job/carbondata-master-spark-2.1/org.apache.carbondata$carbondata-presto/1385/display/redirect>

------------------------------------------
[...truncated 174.40 KB...]
2017-09-15 09:50:01 INFO  PrestoServer$:101 - ***** executing the query ***** 
 SELECT SUM(DISTINCT BONUS) AS RESULT FROM TESTDB.TESTTABLE 
Sep 15, 2017 9:50:01 AM io.airlift.log.Logger info
INFO: TIMELINE: Query 20170915_095001_00009_hq8e7 :: Transaction:[58a0b043-7da2-4149-aa6a-01a58484d446]
:: elapsed 263ms :: planning 52ms :: scheduling 211ms :: running 0ms :: finishing 211ms ::
begin 2017-09-15T09:50:01.367Z :: end 2017-09-15T09:50:01.630Z
2017-09-15 09:50:01 INFO  PrestoServer$:101 - ***** executing the query ***** 
 SELECT AVG(DISTINCT BONUS) AS RESULT FROM TESTDB.TESTTABLE 
Sep 15, 2017 9:50:01 AM io.airlift.log.Logger info
INFO: TIMELINE: Query 20170915_095001_00010_hq8e7 :: Transaction:[b8314270-610f-4f05-8bd2-6ab417f2383d]
:: elapsed 171ms :: planning 33ms :: scheduling 138ms :: running 0ms :: finishing 138ms ::
begin 2017-09-15T09:50:01.655Z :: end 2017-09-15T09:50:01.826Z
- test the result for sum() with distinct operator for decimal column in presto *** FAILED
***
  java.lang.NullPointerException:
  at org.apache.carbondata.presto.integrationtest.PrestoAllDataTypeTest$$anonfun$11.apply$mcV$sp(PrestoAllDataTypeTest.scala:115)
  at org.apache.carbondata.presto.integrationtest.PrestoAllDataTypeTest$$anonfun$11.apply(PrestoAllDataTypeTest.scala:110)
  at org.apache.carbondata.presto.integrationtest.PrestoAllDataTypeTest$$anonfun$11.apply(PrestoAllDataTypeTest.scala:110)
  at org.scalatest.Transformer$$anonfun$apply$1.apply$mcV$sp(Transformer.scala:22)
  at org.scalatest.OutcomeOf$class.outcomeOf(OutcomeOf.scala:85)
  at org.scalatest.OutcomeOf$.outcomeOf(OutcomeOf.scala:104)
  at org.scalatest.Transformer.apply(Transformer.scala:22)
  at org.scalatest.Transformer.apply(Transformer.scala:20)
  at org.scalatest.FunSuiteLike$$anon$1.apply(FunSuiteLike.scala:166)
  at org.scalatest.Suite$class.withFixture(Suite.scala:1122)
  ...
Sep 15, 2017 9:50:02 AM io.airlift.log.Logger info
INFO: TIMELINE: Query 20170915_095001_00011_hq8e7 :: Transaction:[13652ef9-c0d9-4dd0-92cc-0c7ff76a72e9]
:: elapsed 171ms :: planning 45ms :: scheduling 126ms :: running 0ms :: finishing 126ms ::
begin 2017-09-15T09:50:01.844Z :: end 2017-09-15T09:50:02.015Z
2017-09-15 09:50:02 INFO  PrestoServer$:101 - ***** executing the query ***** 
 SELECT MIN(BONUS) AS RESULT FROM TESTDB.TESTTABLE 
- test the result for avg() with distinct operator on decimal coin presto
Sep 15, 2017 9:50:02 AM io.airlift.log.Logger info
INFO: TIMELINE: Query 20170915_095002_00012_hq8e7 :: Transaction:[18d7e1d1-5efa-491e-bd1f-68a2f8758890]
:: elapsed 93ms :: planning 47ms :: scheduling 46ms :: running 0ms :: finishing 46ms :: begin
2017-09-15T09:50:02.037Z :: end 2017-09-15T09:50:02.130Z
- test the result for min() with distinct operator in decimalType of presto
2017-09-15 09:50:02 INFO  PrestoServer$:101 - ***** executing the query ***** 
 SELECT MAX(BONUS) AS RESULT FROM TESTDB.TESTTABLE 
Sep 15, 2017 9:50:02 AM io.airlift.log.Logger info
INFO: TIMELINE: Query 20170915_095002_00013_hq8e7 :: Transaction:[e4f64e44-3ec3-4787-9522-1debda83443f]
:: elapsed 95ms :: planning 49ms :: scheduling 46ms :: running 0ms :: finishing 46ms :: begin
2017-09-15T09:50:02.143Z :: end 2017-09-15T09:50:02.238Z
- test the result for max() with distinct operator in decimalType of presto
2017-09-15 09:50:02 INFO  PrestoServer$:101 - ***** executing the query ***** 
 SELECT DISTINCT BONUS FROM TESTDB.TESTTABLE ORDER BY BONUS limit 3 
2017-09-15 09:50:02 INFO  PrestoServer$:101 - ***** executing the query ***** 
 SELECT NAME FROM TESTDB.TESTTABLE ORDER BY NAME
- select decimal data type with ORDER BY  clause *** FAILED ***
  actualResult.equals(expectedResult) was false (PrestoAllDataTypeTest.scala:147)
Sep 15, 2017 9:50:02 AM io.airlift.log.Logger info
INFO: TIMELINE: Query 20170915_095002_00014_hq8e7 :: Transaction:[1bc9d592-b439-4b93-ba3b-c6a31f235278]
:: elapsed 174ms :: planning 30ms :: scheduling 144ms :: running 0ms :: finishing 144ms ::
begin 2017-09-15T09:50:02.267Z :: end 2017-09-15T09:50:02.441Z
2017-09-15 09:50:02 INFO  PrestoServer$:101 - ***** executing the query ***** 
 SELECT DATE FROM TESTDB.TESTTABLE ORDER BY DATE
- select string type with order by clause *** FAILED ***
  actualResult.equals(expectedResult) was false (PrestoAllDataTypeTest.scala:162)
Sep 15, 2017 9:50:02 AM io.airlift.log.Logger info
INFO: TIMELINE: Query 20170915_095002_00015_hq8e7 :: Transaction:[f8b291f2-dc18-4c2c-ba4b-65e7de979070]
:: elapsed 96ms :: planning 32ms :: scheduling 64ms :: running 0ms :: finishing 64ms :: begin
2017-09-15T09:50:02.456Z :: end 2017-09-15T09:50:02.552Z
2017-09-15 09:50:02 INFO  PrestoServer$:101 - ***** executing the query ***** 
 SELECT DISTINCT ID FROM TESTDB.TESTTABLE ORDER BY ID
- select DATE type with order by clause *** FAILED ***
  java.util.NoSuchElementException: head of empty list
  at scala.collection.immutable.Nil$.head(List.scala:420)
  at scala.collection.immutable.Nil$.head(List.scala:417)
  at org.apache.carbondata.presto.integrationtest.PrestoAllDataTypeTest$$anonfun$17.apply$mcV$sp(PrestoAllDataTypeTest.scala:182)
  at org.apache.carbondata.presto.integrationtest.PrestoAllDataTypeTest$$anonfun$17.apply(PrestoAllDataTypeTest.scala:164)
Sep 15, 2017 9:50:02 AM io.airlift.log.Logger info
INFO: TIMELINE: Query 20170915_095002_00016_hq8e7 :: Transaction:[577d29d5-e401-4b78-b74a-17dacfd977bf]
:: elapsed 58ms :: planning 32ms :: scheduling 26ms :: running 0ms :: finishing 26ms :: begin
2017-09-15T09:50:02.570Z :: end 2017-09-15T09:50:02.628Z
  at org.apache.carbondata.presto.integrationtest.PrestoAllDataTypeTest$$anonfun$17.apply(PrestoAllDataTypeTest.scala:164)
  at org.scalatest.Transformer$$anonfun$apply$1.apply$mcV$sp(Transformer.scala:22)
  at org.scalatest.OutcomeOf$class.outcomeOf(OutcomeOf.scala:85)
  at org.scalatest.OutcomeOf$.outcomeOf(OutcomeOf.scala:104)
  at org.scalatest.Transformer.apply(Transformer.scala:22)
  at org.scalatest.Transformer.apply(Transformer.scala:20)
  ...
2017-09-15 09:50:02 INFO  PrestoServer$:101 - ***** executing the query ***** 
 SELECT ID,DATE,COUNTRY,NAME,PHONETYPE,SERIALNAME,SALARY,BONUS FROM TESTDB.TESTTABLE WHERE
BONUS>1234 AND ID>2 GROUP BY ID,DATE,COUNTRY,NAME,PHONETYPE,SERIALNAME,SALARY,BONUS
ORDER BY ID
Sep 15, 2017 9:50:02 AM io.airlift.log.Logger info
INFO: TIMELINE: Query 20170915_095002_00017_hq8e7 :: Transaction:[a3a5aa4b-6f2d-41db-9884-54ebc02a429a]
:: elapsed 84ms :: planning 29ms :: scheduling 55ms :: running 0ms :: finishing 55ms :: begin
2017-09-15T09:50:02.643Z :: end 2017-09-15T09:50:02.727Z
- select int type with order by clause *** FAILED ***
  actualResult.equals(expectedResult) was false (PrestoAllDataTypeTest.scala:197)
- test and filter clause with greater than expression *** FAILED ***
  actualResult.toString().equals(expectedResult.toString()) was false (PrestoAllDataTypeTest.scala:223)
2017-09-15 09:50:03 INFO  PrestoServer$:101 - ***** executing the query ***** 
 SELECT ID,DATE,COUNTRY,NAME,PHONETYPE,SERIALNAME,SALARY,BONUS FROM TESTDB.TESTTABLE WHERE
BONUS>=1234.444 GROUP BY ID,DATE,COUNTRY,NAME,PHONETYPE,SERIALNAME,SALARY,BONUS ORDER BY
ID
Sep 15, 2017 9:50:03 AM io.airlift.log.Logger info
INFO: TIMELINE: Query 20170915_095002_00018_hq8e7 :: Transaction:[c76ee8fb-2e68-4253-bbe2-b0076a13e821]
:: elapsed 267ms :: planning 182ms :: scheduling 85ms :: running 0ms :: finishing 85ms ::
begin 2017-09-15T09:50:02.769Z :: end 2017-09-15T09:50:03.036Z
2017-09-15 09:50:03 INFO  PrestoServer$:101 - ***** executing the query ***** 
 SELECT ID,DATE,COUNTRY,NAME,PHONETYPE,SERIALNAME,SALARY,BONUS FROM TESTDB.TESTTABLE WHERE
BONUS<=1234.444 GROUP BY ID,DATE,COUNTRY,NAME,PHONETYPE,SERIALNAME,SALARY,BONUS ORDER BY
ID LIMIT 2
- test and filter clause with greater than equal to expression *** FAILED ***
  actualResult.toString().equals(expectedResult.toString()) was false (PrestoAllDataTypeTest.scala:267)
Sep 15, 2017 9:50:03 AM io.airlift.log.Logger info
INFO: TIMELINE: Query 20170915_095003_00019_hq8e7 :: Transaction:[9cfb004e-24e7-466d-94a2-f1203e56c0b2]
:: elapsed 134ms :: planning 68ms :: scheduling 66ms :: running 0ms :: finishing 66ms :: begin
2017-09-15T09:50:03.094Z :: end 2017-09-15T09:50:03.228Z
2017-09-15 09:50:03 INFO  PrestoServer$:101 - ***** executing the query ***** 
 SELECT ID FROM TESTDB.TESTTABLE WHERE BONUS=1234.444
- test and filter clause with less than equal to expression *** FAILED ***
  actualResult.toString().equals(expectedResult.toString()) was false (PrestoAllDataTypeTest.scala:292)
Sep 15, 2017 9:50:03 AM io.airlift.log.Logger info
INFO: TIMELINE: Query 20170915_095003_00020_hq8e7 :: Transaction:[801b6928-39b6-4736-99f8-a7e4221ec806]
:: elapsed 114ms :: planning 61ms :: scheduling 53ms :: running 0ms :: finishing 53ms :: begin
2017-09-15T09:50:03.252Z :: end 2017-09-15T09:50:03.366Z
Sep 15, 2017 9:50:03 AM io.airlift.log.Logger info
INFO: TIMELINE: Query 20170915_095003_00021_hq8e7 :: Transaction:[92e4f765-facc-4652-9f39-7ce48bdfe71b]
:: elapsed 56ms :: planning 38ms :: scheduling 18ms :: running 0ms :: finishing 18ms :: begin
2017-09-15T09:50:03.384Z :: end 2017-09-15T09:50:03.440Z
2017-09-15 09:50:03 INFO  PrestoServer$:101 - ***** executing the query ***** 
 SELECT ID,DATE,COUNTRY,NAME,PHONETYPE,SERIALNAME,SALARY,BONUS FROM TESTDB.TESTTABLE WHERE
BONUS>1234 AND ID<2 GROUP BY ID,DATE,COUNTRY,NAME,PHONETYPE,SERIALNAME,SALARY,BONUS
ORDER BY ID
- test equal to expression on decimal value *** FAILED ***
  actualResult.equals(expectedResult) was false (PrestoAllDataTypeTest.scala:301)
2017-09-15 09:50:03 INFO  PrestoServer$:101 - ***** executing the query ***** 
 SELECT NAME from testdb.testtable WHERE PHONETYPE IN('phone1848','phone706')
- test less than expression with and operator *** FAILED ***
  actualResult.toString().equals(expectedResult.toString()) was false (PrestoAllDataTypeTest.scala:317)
Sep 15, 2017 9:50:03 AM io.airlift.log.Logger info
INFO: TIMELINE: Query 20170915_095003_00022_hq8e7 :: Transaction:[bd4027d1-0541-4116-b127-74ec7caf4ddf]
:: elapsed 134ms :: planning 74ms :: scheduling 60ms :: running 0ms :: finishing 60ms :: begin
2017-09-15T09:50:03.461Z :: end 2017-09-15T09:50:03.595Z
2017-09-15 09:50:04 INFO  PrestoServer$:101 - ***** executing the query ***** 
 SELECT NAME from testdb.testtable WHERE PHONETYPE NOT IN('phone1848','phone706')
- test the result for in clause *** FAILED ***
  actualResult.equals(expectedResult) was false (PrestoAllDataTypeTest.scala:327)
Sep 15, 2017 9:50:04 AM io.airlift.log.Logger info
INFO: TIMELINE: Query 20170915_095003_00023_hq8e7 :: Transaction:[1716b154-8579-4a5e-8261-ddb37cc8fe2a]
:: elapsed 401ms :: planning 381ms :: scheduling 20ms :: running 0ms :: finishing 20ms ::
begin 2017-09-15T09:50:03.622Z :: end 2017-09-15T09:50:04.023Z
Sep 15, 2017 9:50:04 AM io.airlift.log.Logger info
INFO: TIMELINE: Query 20170915_095004_00024_hq8e7 :: Transaction:[f5e9f160-6885-4d6c-b242-fbb208add3a5]
:: elapsed 65ms :: planning 48ms :: scheduling 17ms :: running 0ms :: finishing 17ms :: begin
2017-09-15T09:50:04.048Z :: end 2017-09-15T09:50:04.113Z
2017-09-15 09:50:04 INFO  PrestoServer$:101 - ***** executing the query ***** 
 SELECT ID FROM TESTDB.TESTTABLE WHERE DATE IS NULL
- test the result for not in clause *** FAILED ***
  actualResult.equals(expectedResult) was false (PrestoAllDataTypeTest.scala:341)
Sep 15, 2017 9:50:04 AM io.airlift.log.Logger info
INFO: TIMELINE: Query 20170915_095004_00025_hq8e7 :: Transaction:[3118cc06-e749-43d4-8887-044e0226b16f]
:: elapsed 56ms :: planning 33ms :: scheduling 23ms :: running 0ms :: finishing 23ms :: begin
2017-09-15T09:50:04.129Z :: end 2017-09-15T09:50:04.185Z
2017-09-15 09:50:04 INFO  PrestoServer$:101 - ***** executing the query ***** 
 SELECT NAME FROM TESTDB.TESTTABLE WHERE DATE IS NOT NULL AND ID=9
- test for null operator on date data type *** FAILED ***
  actualResult.equals(expectedResult) was false (PrestoAllDataTypeTest.scala:347)
- test for not null operator on date data type *** FAILED ***
  actualResult.equals(expectedResult) was false (PrestoAllDataTypeTest.scala:354)
Sep 15, 2017 9:50:04 AM io.airlift.log.Logger info
INFO: TIMELINE: Query 20170915_095004_00026_hq8e7 :: Transaction:[dee64055-34f9-4979-a0bf-351322539215]
:: elapsed 63ms :: planning 40ms :: scheduling 23ms :: running 0ms :: finishing 23ms :: begin
2017-09-15T09:50:04.205Z :: end 2017-09-15T09:50:04.268Z
2017-09-15 09:50:04 INFO  PrestoServer$:101 - ***** executing the query ***** 
 SELECT NAME FROM TESTDB.TESTTABLE WHERE DOB IS NOT NULL AND ID=9
- test for not null operator on timestamp type *** FAILED ***
  actualResult.equals(expectedResult) was false (PrestoAllDataTypeTest.scala:362)
2017-09-15 09:50:04 INFO  PrestoServer$:101 - ***** executing the query ***** 
 SELECT NAME FROM TESTDB.TESTTABLE WHERE DOB IS NULL AND ID=1
Sep 15, 2017 9:50:04 AM io.airlift.log.Logger info
INFO: TIMELINE: Query 20170915_095004_00027_hq8e7 :: Transaction:[0500319b-0f74-4d84-8243-f35ce8568228]
:: elapsed 55ms :: planning 31ms :: scheduling 24ms :: running 0ms :: finishing 24ms :: begin
2017-09-15T09:50:04.281Z :: end 2017-09-15T09:50:04.336Z
Sep 15, 2017 9:50:04 AM io.airlift.log.Logger info
INFO: TIMELINE: Query 20170915_095004_00028_hq8e7 :: Transaction:[33dd3b5a-ab98-41e6-ada3-99e9ee79056f]
:: elapsed 52ms :: planning 39ms :: scheduling 13ms :: running 0ms :: finishing 13ms :: begin
2017-09-15T09:50:04.356Z :: end 2017-09-15T09:50:04.408Z
2017-09-15 09:50:04 INFO  PrestoServer$:101 - ***** executing the query ***** 
 SELECT DISTINCT SHORTFIELD from testdb.testtable ORDER BY SHORTFIELD 
- test for null operator on timestamp type *** FAILED ***
  actualResult.equals(expectedResult) was false (PrestoAllDataTypeTest.scala:369)
2017-09-15 09:50:04 INFO  PrestoServer$:101 - ***** executing the query ***** 
 SELECT ID from testdb.testtable WHERE SHORTFIELD IS NULL ORDER BY SHORTFIELD 
- test the result for short datatype with order by clause *** FAILED ***
  actualResult.equals(expectedResult) was false (PrestoAllDataTypeTest.scala:385)
Sep 15, 2017 9:50:04 AM io.airlift.log.Logger info
INFO: TIMELINE: Query 20170915_095004_00029_hq8e7 :: Transaction:[659c0aef-7cd0-4398-a1e5-9c573d62bcec]
:: elapsed 91ms :: planning 27ms :: scheduling 64ms :: running 0ms :: finishing 64ms :: begin
2017-09-15T09:50:04.423Z :: end 2017-09-15T09:50:04.514Z
- test the result for short datatype in clause where field is null *** FAILED ***
  actualResult.equals(expectedResult) was false (PrestoAllDataTypeTest.scala:393)
Sep 15, 2017 9:50:04 AM io.airlift.log.Logger info
INFO: TIMELINE: Query 20170915_095004_00030_hq8e7 :: Transaction:[cbe4c977-285c-4f4a-9e38-a7a6975db663]
:: elapsed 52ms :: planning 33ms :: scheduling 19ms :: running 0ms :: finishing 19ms :: begin
2017-09-15T09:50:04.527Z :: end 2017-09-15T09:50:04.579Z
2017-09-15 09:50:04 INFO  PrestoServer$:101 - ***** executing the query ***** 
 SELECT ID from testdb.testtable WHERE SHORTFIELD>11 
Sep 15, 2017 9:50:04 AM io.airlift.log.Logger info
INFO: TIMELINE: Query 20170915_095004_00031_hq8e7 :: Transaction:[a4366ea3-1ab9-434a-8a7f-1a9f19ce0168]
:: elapsed 53ms :: planning 35ms :: scheduling 18ms :: running 0ms :: finishing 18ms :: begin
2017-09-15T09:50:04.593Z :: end 2017-09-15T09:50:04.646Z
- test the result for short datatype with greater than operator *** FAILED ***
  actualResult.equals(expectedResult) was false (PrestoAllDataTypeTest.scala:401)
Sep 15, 2017 9:50:04 AM io.airlift.log.Logger info
INFO: Life cycle stopping...
Sep 15, 2017 9:50:04 AM org.eclipse.jetty.server.AbstractConnector doStop
INFO: Stopped http@4ef277ef{HTTP/1.1,[http/1.1, h2c, h2c-17, h2c-16, h2c-15, h2c-14]}{127.0.0.1:8086}
Sep 15, 2017 9:50:06 AM io.airlift.log.Logger warn
WARNING: Error fetching memory info from http://127.0.0.1:8086/v1/memory: Server refused connection:
http://127.0.0.1:8086/v1/memory
Sep 15, 2017 9:50:07 AM io.airlift.log.Logger warn
WARNING: Error fetching node state from http://127.0.0.1:8086/v1/info/state: Server refused
connection: http://127.0.0.1:8086/v1/info/state
Sep 15, 2017 9:50:07 AM org.eclipse.jetty.server.handler.ContextHandler doStop
INFO: Stopped o.e.j.s.ServletContextHandler@2c51c756{/,null,UNAVAILABLE,@http}
Sep 15, 2017 9:50:07 AM org.eclipse.jetty.util.thread.QueuedThreadPool doStop
WARNING: http-worker{STOPPING,2<=16<=200,i=12,q=14} Couldn't stop Thread[http-worker-253,5,]
Sep 15, 2017 9:50:07 AM org.eclipse.jetty.util.thread.QueuedThreadPool doStop
WARNING: http-worker{STOPPING,2<=16<=200,i=7,q=13} Couldn't stop Thread[http-worker-371,5,]
Sep 15, 2017 9:50:07 AM org.eclipse.jetty.util.thread.QueuedThreadPool doStop
WARNING: http-worker{STOPPING,2<=16<=200,i=4,q=13} Couldn't stop Thread[http-worker-212,5,]
Sep 15, 2017 9:50:07 AM org.eclipse.jetty.util.thread.QueuedThreadPool doStop
WARNING: http-worker{STOPPING,2<=16<=200,i=0,q=12} Couldn't stop Thread[http-worker-210,5,]
Sep 15, 2017 9:50:07 AM org.eclipse.jetty.util.thread.QueuedThreadPool doStop
WARNING: http-worker{STOPPING,2<=16<=200,i=0,q=12} Couldn't stop Thread[http-worker-214,5,]
Sep 15, 2017 9:50:07 AM io.airlift.log.Logger info
INFO: Life cycle stopped.
Sep 15, 2017 9:50:07 AM io.airlift.log.Logger info
INFO: Life cycle stopping...
Sep 15, 2017 9:50:07 AM org.eclipse.jetty.server.AbstractConnector doStop
INFO: Stopped http@31c0c7e5{HTTP/1.1,[http/1.1, h2c, h2c-17, h2c-16, h2c-15, h2c-14]}{127.0.0.1:37405}
2017-09-15 09:50:07 INFO  AbstractDataLoadProcessorStep:150 - Thread-2 Rows processed in step
Data Writer : 10
2017-09-15 09:50:07 INFO  AbstractDataLoadProcessorStep:150 - Thread-3 Rows processed in step
Data Converter : 10
2017-09-15 09:50:07 INFO  AbstractDataLoadProcessorStep:150 - Thread-4 Rows processed in step
Input Processor : 10
Sep 15, 2017 9:50:08 AM org.eclipse.jetty.server.handler.ContextHandler doStop
INFO: Stopped o.e.j.s.ServletContextHandler@67f266bd{/,null,UNAVAILABLE,@http}
Sep 15, 2017 9:50:08 AM org.eclipse.jetty.util.thread.QueuedThreadPool doStop
WARNING: http-worker{STOPPING,2<=12<=200,i=8,q=9} Couldn't stop Thread[http-worker-300,5,]
Sep 15, 2017 9:50:08 AM org.eclipse.jetty.util.thread.QueuedThreadPool doStop
WARNING: http-worker{STOPPING,2<=12<=200,i=3,q=8} Couldn't stop Thread[http-worker-156,5,]
Sep 15, 2017 9:50:08 AM org.eclipse.jetty.util.thread.QueuedThreadPool doStop
WARNING: http-worker{STOPPING,2<=12<=200,i=0,q=7} Couldn't stop Thread[http-worker-161,5,]
Sep 15, 2017 9:50:08 AM io.airlift.log.Logger info
INFO: Life cycle stopped.
Sep 15, 2017 9:50:08 AM io.airlift.log.Logger info
INFO: Life cycle stopping...
Sep 15, 2017 9:50:08 AM org.eclipse.jetty.server.AbstractConnector doStop
INFO: Stopped http@4adcc981{HTTP/1.1,[http/1.1, h2c, h2c-17, h2c-16, h2c-15, h2c-14]}{127.0.0.1:45930}
Sep 15, 2017 9:50:08 AM org.eclipse.jetty.server.handler.ContextHandler doStop
INFO: Stopped o.e.j.s.ServletContextHandler@729d6ee2{/,null,UNAVAILABLE,@http}
Sep 15, 2017 9:50:08 AM org.eclipse.jetty.util.thread.QueuedThreadPool doStop
WARNING: http-worker{STOPPING,2<=13<=200,i=11,q=12} Couldn't stop Thread[http-worker-421,5,main]
Sep 15, 2017 9:50:08 AM org.eclipse.jetty.util.thread.QueuedThreadPool doStop
WARNING: http-worker{STOPPING,2<=13<=200,i=5,q=10} Couldn't stop Thread[http-worker-252,5,]
Sep 15, 2017 9:50:08 AM org.eclipse.jetty.util.thread.QueuedThreadPool doStop
WARNING: http-worker{STOPPING,2<=13<=200,i=3,q=9} Couldn't stop Thread[http-worker-381,5,]
Sep 15, 2017 9:50:08 AM org.eclipse.jetty.util.thread.QueuedThreadPool doStop
WARNING: http-worker{STOPPING,2<=13<=200,i=0,q=7} Couldn't stop Thread[http-worker-250,5,]
Sep 15, 2017 9:50:08 AM io.airlift.log.Logger info
INFO: Life cycle stopped.
Sep 15, 2017 9:50:08 AM io.airlift.log.Logger info
INFO: Life cycle stopping...
Sep 15, 2017 9:50:08 AM org.eclipse.jetty.server.AbstractConnector doStop
INFO: Stopped http@38929da{HTTP/1.1,[http/1.1, h2c, h2c-17, h2c-16, h2c-15, h2c-14]}{127.0.0.1:36076}
Sep 15, 2017 9:50:08 AM org.eclipse.jetty.server.handler.ContextHandler doStop
INFO: Stopped o.e.j.s.ServletContextHandler@1e6d30c0{/,null,UNAVAILABLE,@http}
Sep 15, 2017 9:50:08 AM org.eclipse.jetty.util.thread.QueuedThreadPool doStop
WARNING: http-worker{STOPPING,2<=13<=200,i=10,q=10} Couldn't stop Thread[http-worker-85,5,main]
Sep 15, 2017 9:50:08 AM org.eclipse.jetty.util.thread.QueuedThreadPool doStop
WARNING: http-worker{STOPPING,2<=13<=200,i=5,q=9} Couldn't stop Thread[http-worker-422,5,main]
Sep 15, 2017 9:50:08 AM org.eclipse.jetty.util.thread.QueuedThreadPool doStop
WARNING: http-worker{STOPPING,2<=13<=200,i=0,q=7} Couldn't stop Thread[http-worker-373,5,]
Sep 15, 2017 9:50:08 AM org.eclipse.jetty.util.thread.QueuedThreadPool doStop
WARNING: http-worker{STOPPING,2<=13<=200,i=0,q=7} Couldn't stop Thread[http-worker-372,5,]
Sep 15, 2017 9:50:08 AM io.airlift.log.Logger info
INFO: Life cycle stopped.
Sep 15, 2017 9:50:08 AM io.airlift.log.Logger info
INFO: Life cycle stopping...
Sep 15, 2017 9:50:08 AM org.eclipse.jetty.server.AbstractConnector doStop
INFO: Stopped http@7da635c0{HTTP/1.1,[http/1.1, h2c, h2c-17, h2c-16, h2c-15, h2c-14]}{127.0.0.1:40963}
Sep 15, 2017 9:50:08 AM org.eclipse.jetty.server.handler.ContextHandler doStop
INFO: Stopped o.e.j.s.ServletContextHandler@3d615b2e{/,null,UNAVAILABLE,@http}
Sep 15, 2017 9:50:08 AM org.eclipse.jetty.util.thread.QueuedThreadPool doStop
WARNING: http-worker{STOPPING,2<=10<=200,i=8,q=8} Couldn't stop Thread[http-worker-65,5,main]
Sep 15, 2017 9:50:08 AM org.eclipse.jetty.util.thread.QueuedThreadPool doStop
WARNING: http-worker{STOPPING,2<=10<=200,i=4,q=7} Couldn't stop Thread[http-worker-93,5,]
Sep 15, 2017 9:50:08 AM org.eclipse.jetty.util.thread.QueuedThreadPool doStop
WARNING: http-worker{STOPPING,2<=10<=200,i=2,q=7} Couldn't stop Thread[http-worker-427,5,]
Sep 15, 2017 9:50:08 AM org.eclipse.jetty.util.thread.QueuedThreadPool doStop
WARNING: http-worker{STOPPING,2<=10<=200,i=2,q=7} Couldn't stop Thread[http-worker-426,5,main]
Sep 15, 2017 9:50:08 AM org.eclipse.jetty.util.thread.QueuedThreadPool doStop
WARNING: http-worker{STOPPING,2<=10<=200,i=2,q=7} Couldn't stop Thread[http-worker-425,5,main]
Sep 15, 2017 9:50:08 AM io.airlift.log.Logger info
INFO: Life cycle stopped.
2017-09-15 09:50:08 INFO  PrestoServer$:88 - ***** Stopping The Server *****
Run completed in 21 seconds, 429 milliseconds.
Total number of tests run: 32
Suites: completed 2, aborted 0
Tests: succeeded 6, failed 26, canceled 0, ignored 0, pending 0
*** 26 TESTS FAILED ***
[JENKINS] Recording test results

Mime
View raw message