carbondata-commits mailing list archives

Site index · List index
Message view « Date » · « Thread »
Top « Date » · « Thread »
From Apache Jenkins Server <jenk...@builds.apache.org>
Subject Build failed in Jenkins: carbondata-master-spark-2.1 #1383
Date Fri, 15 Sep 2017 08:51:45 GMT
See <https://builds.apache.org/job/carbondata-master-spark-2.1/1383/display/redirect?page=changes>

Changes:

[ravi.pesala] [CARBONDATA-1452] Issue with loading timestamp data beyond cutoff

------------------------------------------
[...truncated 1.43 MB...]
INFO: TIMELINE: Query 20170915_085054_00022_6c8cn :: Transaction:[23df2e60-f4a3-486c-a293-aa3f56acad23]
:: elapsed 104ms :: planning 54ms :: scheduling 50ms :: running 0ms :: finishing 50ms :: begin
2017-09-15T08:50:54.824Z :: end 2017-09-15T08:50:54.928Z
Sep 15, 2017 8:50:55 AM io.airlift.log.Logger info
INFO: TIMELINE: Query 20170915_085054_00023_6c8cn :: Transaction:[1002650a-5472-490f-9f88-a764114e3534]
:: elapsed 330ms :: planning 311ms :: scheduling 19ms :: running 0ms :: finishing 19ms ::
begin 2017-09-15T08:50:54.951Z :: end 2017-09-15T08:50:55.281Z
2017-09-15 08:50:55 INFO  PrestoServer$:101 - ***** executing the query ***** 
 SELECT NAME from testdb.testtable WHERE PHONETYPE NOT IN('phone1848','phone706')
- test the result for in clause *** FAILED ***
  actualResult.equals(expectedResult) was false (PrestoAllDataTypeTest.scala:327)
Sep 15, 2017 8:50:55 AM io.airlift.log.Logger info
INFO: TIMELINE: Query 20170915_085055_00024_6c8cn :: Transaction:[b26d5038-1af9-4ba0-85ed-c58bfbe89c42]
:: elapsed 54ms :: planning 37ms :: scheduling 17ms :: running 0ms :: finishing 17ms :: begin
2017-09-15T08:50:55.296Z :: end 2017-09-15T08:50:55.350Z
2017-09-15 08:50:55 INFO  PrestoServer$:101 - ***** executing the query ***** 
 SELECT ID FROM TESTDB.TESTTABLE WHERE DATE IS NULL
- test the result for not in clause *** FAILED ***
  actualResult.equals(expectedResult) was false (PrestoAllDataTypeTest.scala:341)
Sep 15, 2017 8:50:55 AM io.airlift.log.Logger info
INFO: TIMELINE: Query 20170915_085055_00025_6c8cn :: Transaction:[f3ca6fe3-926d-4196-8d40-b1a73279d492]
:: elapsed 41ms :: planning 22ms :: scheduling 19ms :: running 0ms :: finishing 19ms :: begin
2017-09-15T08:50:55.363Z :: end 2017-09-15T08:50:55.404Z
2017-09-15 08:50:55 INFO  PrestoServer$:101 - ***** executing the query ***** 
 SELECT NAME FROM TESTDB.TESTTABLE WHERE DATE IS NOT NULL AND ID=9
- test for null operator on date data type *** FAILED ***
  actualResult.equals(expectedResult) was false (PrestoAllDataTypeTest.scala:347)
Sep 15, 2017 8:50:55 AM io.airlift.log.Logger info
INFO: TIMELINE: Query 20170915_085055_00026_6c8cn :: Transaction:[0f5bb643-fa74-485e-abad-ae921ee5bf88]
:: elapsed 49ms :: planning 33ms :: scheduling 16ms :: running 0ms :: finishing 16ms :: begin
2017-09-15T08:50:55.423Z :: end 2017-09-15T08:50:55.472Z
2017-09-15 08:50:55 INFO  PrestoServer$:101 - ***** executing the query ***** 
 SELECT NAME FROM TESTDB.TESTTABLE WHERE DOB IS NOT NULL AND ID=9
- test for not null operator on date data type *** FAILED ***
  actualResult.equals(expectedResult) was false (PrestoAllDataTypeTest.scala:354)
- test for not null operator on timestamp type *** FAILED ***
  actualResult.equals(expectedResult) was false (PrestoAllDataTypeTest.scala:362)
2017-09-15 08:50:55 INFO  PrestoServer$:101 - ***** executing the query ***** 
 SELECT NAME FROM TESTDB.TESTTABLE WHERE DOB IS NULL AND ID=1
Sep 15, 2017 8:50:55 AM io.airlift.log.Logger info
INFO: TIMELINE: Query 20170915_085055_00027_6c8cn :: Transaction:[032c2561-789f-43b6-a0bf-52764714a802]
:: elapsed 57ms :: planning 41ms :: scheduling 16ms :: running 0ms :: finishing 16ms :: begin
2017-09-15T08:50:55.485Z :: end 2017-09-15T08:50:55.542Z
Sep 15, 2017 8:50:55 AM io.airlift.log.Logger info
INFO: TIMELINE: Query 20170915_085055_00028_6c8cn :: Transaction:[02462fe1-20f5-4160-89fb-5c19cba5a75e]
:: elapsed 45ms :: planning 30ms :: scheduling 15ms :: running 0ms :: finishing 15ms :: begin
2017-09-15T08:50:55.556Z :: end 2017-09-15T08:50:55.601Z
2017-09-15 08:50:55 INFO  PrestoServer$:101 - ***** executing the query ***** 
 SELECT DISTINCT SHORTFIELD from testdb.testtable ORDER BY SHORTFIELD 
- test for null operator on timestamp type *** FAILED ***
  actualResult.equals(expectedResult) was false (PrestoAllDataTypeTest.scala:369)
2017-09-15 08:50:55 INFO  PrestoServer$:101 - ***** executing the query ***** 
 SELECT ID from testdb.testtable WHERE SHORTFIELD IS NULL ORDER BY SHORTFIELD 
- test the result for short datatype with order by clause *** FAILED ***
  actualResult.equals(expectedResult) was false (PrestoAllDataTypeTest.scala:385)
Sep 15, 2017 8:50:55 AM io.airlift.log.Logger info
INFO: TIMELINE: Query 20170915_085055_00029_6c8cn :: Transaction:[6ef1eeea-0447-4477-bc5b-b9fd2867f4ba]
:: elapsed 72ms :: planning 24ms :: scheduling 48ms :: running 0ms :: finishing 48ms :: begin
2017-09-15T08:50:55.612Z :: end 2017-09-15T08:50:55.684Z
- test the result for short datatype in clause where field is null *** FAILED ***
  actualResult.equals(expectedResult) was false (PrestoAllDataTypeTest.scala:393)
2017-09-15 08:50:55 INFO  PrestoServer$:101 - ***** executing the query ***** 
 SELECT ID from testdb.testtable WHERE SHORTFIELD>11 
Sep 15, 2017 8:50:55 AM io.airlift.log.Logger info
INFO: TIMELINE: Query 20170915_085055_00030_6c8cn :: Transaction:[5752afcc-27e9-4ee0-92e4-0849c089b891]
:: elapsed 48ms :: planning 31ms :: scheduling 17ms :: running 0ms :: finishing 17ms :: begin
2017-09-15T08:50:55.699Z :: end 2017-09-15T08:50:55.747Z
Sep 15, 2017 8:50:55 AM io.airlift.log.Logger info
INFO: TIMELINE: Query 20170915_085055_00031_6c8cn :: Transaction:[6d604deb-01bc-483a-9766-7ba375462fcc]
:: elapsed 40ms :: planning 26ms :: scheduling 14ms :: running 0ms :: finishing 14ms :: begin
2017-09-15T08:50:55.759Z :: end 2017-09-15T08:50:55.799Z
- test the result for short datatype with greater than operator *** FAILED ***
  actualResult.equals(expectedResult) was false (PrestoAllDataTypeTest.scala:401)
Sep 15, 2017 8:50:55 AM io.airlift.log.Logger info
INFO: Life cycle stopping...
Sep 15, 2017 8:50:55 AM org.eclipse.jetty.server.AbstractConnector doStop
INFO: Stopped http@4ef277ef{HTTP/1.1,[http/1.1, h2c, h2c-17, h2c-16, h2c-15, h2c-14]}{127.0.0.1:8086}
Sep 15, 2017 8:50:55 AM io.airlift.log.Logger warn
WARNING: Error fetching memory info from http://127.0.0.1:8086/v1/memory: Server refused connection:
http://127.0.0.1:8086/v1/memory
Sep 15, 2017 8:50:57 AM io.airlift.log.Logger warn
WARNING: Error fetching memory info from http://127.0.0.1:8086/v1/memory: Server refused connection:
http://127.0.0.1:8086/v1/memory
Sep 15, 2017 8:50:59 AM io.airlift.log.Logger warn
WARNING: Error fetching node state from http://127.0.0.1:8086/v1/info/state: Server refused
connection: http://127.0.0.1:8086/v1/info/state
2017-09-15 08:50:59 INFO  AbstractDataLoadProcessorStep:150 - Thread-2 Rows processed in step
Data Writer : 10
2017-09-15 08:50:59 INFO  AbstractDataLoadProcessorStep:150 - Thread-3 Rows processed in step
Data Converter : 10
2017-09-15 08:50:59 INFO  AbstractDataLoadProcessorStep:150 - Thread-4 Rows processed in step
Input Processor : 10
Sep 15, 2017 8:50:59 AM io.airlift.log.Logger warn
WARNING: Error fetching memory info from http://127.0.0.1:8086/v1/memory: Server refused connection:
http://127.0.0.1:8086/v1/memory
Sep 15, 2017 8:51:00 AM org.eclipse.jetty.server.handler.ContextHandler doStop
INFO: Stopped o.e.j.s.ServletContextHandler@2c51c756{/,null,UNAVAILABLE,@http}
Sep 15, 2017 8:51:00 AM org.eclipse.jetty.util.thread.QueuedThreadPool doStop
WARNING: http-worker{STOPPING,2<=16<=200,i=14,q=14} Couldn't stop Thread[http-worker-213,5,main]
Sep 15, 2017 8:51:00 AM org.eclipse.jetty.util.thread.QueuedThreadPool doStop
WARNING: http-worker{STOPPING,2<=16<=200,i=7,q=13} Couldn't stop Thread[http-worker-277,5,]
Sep 15, 2017 8:51:00 AM org.eclipse.jetty.util.thread.QueuedThreadPool doStop
WARNING: http-worker{STOPPING,2<=16<=200,i=4,q=13} Couldn't stop Thread[http-worker-314,5,]
Sep 15, 2017 8:51:00 AM org.eclipse.jetty.util.thread.QueuedThreadPool doStop
WARNING: http-worker{STOPPING,2<=16<=200,i=0,q=13} Couldn't stop Thread[http-worker-255,5,]
Sep 15, 2017 8:51:00 AM io.airlift.log.Logger info
INFO: Life cycle stopped.
Sep 15, 2017 8:51:00 AM io.airlift.log.Logger info
INFO: Life cycle stopping...
Sep 15, 2017 8:51:00 AM org.eclipse.jetty.server.AbstractConnector doStop
INFO: Stopped http@31c0c7e5{HTTP/1.1,[http/1.1, h2c, h2c-17, h2c-16, h2c-15, h2c-14]}{127.0.0.1:38555}
Sep 15, 2017 8:51:00 AM org.eclipse.jetty.server.handler.ContextHandler doStop
INFO: Stopped o.e.j.s.ServletContextHandler@67f266bd{/,null,UNAVAILABLE,@http}
Sep 15, 2017 8:51:00 AM org.eclipse.jetty.util.thread.QueuedThreadPool doStop
WARNING: http-worker{STOPPING,2<=14<=200,i=13,q=13} Couldn't stop Thread[http-worker-397,5,main]
Sep 15, 2017 8:51:00 AM org.eclipse.jetty.util.thread.QueuedThreadPool doStop
WARNING: http-worker{STOPPING,2<=14<=200,i=6,q=11} Couldn't stop Thread[http-worker-304,5,]
Sep 15, 2017 8:51:00 AM org.eclipse.jetty.util.thread.QueuedThreadPool doStop
WARNING: http-worker{STOPPING,2<=14<=200,i=3,q=11} Couldn't stop Thread[http-worker-412,5,main]
Sep 15, 2017 8:51:00 AM org.eclipse.jetty.util.thread.QueuedThreadPool doStop
WARNING: http-worker{STOPPING,2<=14<=200,i=0,q=8} Couldn't stop Thread[http-worker-414,5,]
Sep 15, 2017 8:51:00 AM io.airlift.log.Logger info
INFO: Life cycle stopped.
Sep 15, 2017 8:51:00 AM io.airlift.log.Logger info
INFO: Life cycle stopping...
Sep 15, 2017 8:51:00 AM org.eclipse.jetty.server.AbstractConnector doStop
INFO: Stopped http@4adcc981{HTTP/1.1,[http/1.1, h2c, h2c-17, h2c-16, h2c-15, h2c-14]}{127.0.0.1:42055}
Sep 15, 2017 8:51:00 AM org.eclipse.jetty.server.handler.ContextHandler doStop
INFO: Stopped o.e.j.s.ServletContextHandler@729d6ee2{/,null,UNAVAILABLE,@http}
Sep 15, 2017 8:51:00 AM org.eclipse.jetty.util.thread.QueuedThreadPool doStop
WARNING: http-worker{STOPPING,2<=14<=200,i=11,q=12} Couldn't stop Thread[http-worker-124,5,]
Sep 15, 2017 8:51:00 AM org.eclipse.jetty.util.thread.QueuedThreadPool doStop
WARNING: http-worker{STOPPING,2<=14<=200,i=9,q=11} Couldn't stop Thread[http-worker-415,5,main]
Sep 15, 2017 8:51:00 AM org.eclipse.jetty.util.thread.QueuedThreadPool doStop
WARNING: http-worker{STOPPING,2<=14<=200,i=2,q=10} Couldn't stop Thread[http-worker-306,5,]
Sep 15, 2017 8:51:00 AM org.eclipse.jetty.util.thread.QueuedThreadPool doStop
WARNING: http-worker{STOPPING,2<=14<=200,i=0,q=10} Couldn't stop Thread[http-worker-417,5,]
Sep 15, 2017 8:51:00 AM io.airlift.log.Logger info
INFO: Life cycle stopped.
Sep 15, 2017 8:51:00 AM io.airlift.log.Logger info
INFO: Life cycle stopping...
Sep 15, 2017 8:51:00 AM org.eclipse.jetty.server.AbstractConnector doStop
INFO: Stopped http@38929da{HTTP/1.1,[http/1.1, h2c, h2c-17, h2c-16, h2c-15, h2c-14]}{127.0.0.1:38018}
Sep 15, 2017 8:51:00 AM org.eclipse.jetty.server.handler.ContextHandler doStop
INFO: Stopped o.e.j.s.ServletContextHandler@1e6d30c0{/,null,UNAVAILABLE,@http}
Sep 15, 2017 8:51:00 AM org.eclipse.jetty.util.thread.QueuedThreadPool doStop
WARNING: http-worker{STOPPING,2<=13<=200,i=11,q=11} Couldn't stop Thread[http-worker-298,5,]
Sep 15, 2017 8:51:00 AM org.eclipse.jetty.util.thread.QueuedThreadPool doStop
WARNING: http-worker{STOPPING,2<=13<=200,i=6,q=11} Couldn't stop Thread[http-worker-420,5,]
Sep 15, 2017 8:51:00 AM org.eclipse.jetty.util.thread.QueuedThreadPool doStop
WARNING: http-worker{STOPPING,2<=13<=200,i=2,q=10} Couldn't stop Thread[http-worker-79,5,main]
Sep 15, 2017 8:51:00 AM org.eclipse.jetty.util.thread.QueuedThreadPool doStop
WARNING: http-worker{STOPPING,2<=13<=200,i=0,q=10} Couldn't stop Thread[http-worker-253,5,]
Sep 15, 2017 8:51:00 AM io.airlift.log.Logger info
INFO: Life cycle stopped.
Sep 15, 2017 8:51:00 AM io.airlift.log.Logger info
INFO: Life cycle stopping...
Sep 15, 2017 8:51:00 AM org.eclipse.jetty.server.AbstractConnector doStop
INFO: Stopped http@7da635c0{HTTP/1.1,[http/1.1, h2c, h2c-17, h2c-16, h2c-15, h2c-14]}{127.0.0.1:43221}
Sep 15, 2017 8:51:00 AM org.eclipse.jetty.server.handler.ContextHandler doStop
INFO: Stopped o.e.j.s.ServletContextHandler@3d615b2e{/,null,UNAVAILABLE,@http}
Sep 15, 2017 8:51:00 AM org.eclipse.jetty.util.thread.QueuedThreadPool doStop
WARNING: http-worker{STOPPING,2<=10<=200,i=5,q=8} Couldn't stop Thread[http-worker-422,5,main]
Sep 15, 2017 8:51:00 AM org.eclipse.jetty.util.thread.QueuedThreadPool doStop
WARNING: http-worker{STOPPING,2<=10<=200,i=2,q=8} Couldn't stop Thread[http-worker-421,5,]
Sep 15, 2017 8:51:00 AM org.eclipse.jetty.util.thread.QueuedThreadPool doStop
WARNING: http-worker{STOPPING,2<=10<=200,i=1,q=8} Couldn't stop Thread[http-worker-423,5,main]
Sep 15, 2017 8:51:00 AM io.airlift.log.Logger info
INFO: Life cycle stopped.
2017-09-15 08:51:00 INFO  PrestoServer$:88 - ***** Stopping The Server *****
Run completed in 22 seconds, 56 milliseconds.
Total number of tests run: 32
Suites: completed 2, aborted 0
Tests: succeeded 6, failed 26, canceled 0, ignored 0, pending 0
*** 26 TESTS FAILED ***
[JENKINS] Recording test results
[INFO] ------------------------------------------------------------------------
[INFO] Reactor Summary:
[INFO] 
[INFO] Apache CarbonData :: Parent ........................ SUCCESS [  9.425 s]
[INFO] Apache CarbonData :: Common ........................ SUCCESS [ 13.417 s]
[INFO] Apache CarbonData :: Core .......................... SUCCESS [01:56 min]
[INFO] Apache CarbonData :: Processing .................... SUCCESS [ 29.406 s]
[INFO] Apache CarbonData :: Hadoop ........................ SUCCESS [ 25.034 s]
[INFO] Apache CarbonData :: Spark Common .................. SUCCESS [01:02 min]
[INFO] Apache CarbonData :: Spark2 ........................ SUCCESS [04:18 min]
[INFO] Apache CarbonData :: Spark Common Test ............. SUCCESS [14:26 min]
[INFO] Apache CarbonData :: Assembly ...................... SUCCESS [  8.143 s]
[INFO] Apache CarbonData :: Hive .......................... SUCCESS [ 31.779 s]
[INFO] Apache CarbonData :: presto ........................ FAILURE [ 56.420 s]
[INFO] Apache CarbonData :: Spark2 Examples ............... SKIPPED
[INFO] ------------------------------------------------------------------------
[INFO] BUILD FAILURE
[INFO] ------------------------------------------------------------------------
[INFO] Total time: 25:08 min
[INFO] Finished at: 2017-09-15T08:51:13+00:00
[INFO] Final Memory: 195M/1849M
[INFO] ------------------------------------------------------------------------
Waiting for Jenkins to finish collecting data
[ERROR] Failed to execute goal org.scalatest:scalatest-maven-plugin:1.0:test (test) on project
carbondata-presto: There are test failures -> [Help 1]
org.apache.maven.lifecycle.LifecycleExecutionException: Failed to execute goal org.scalatest:scalatest-maven-plugin:1.0:test
(test) on project carbondata-presto: There are test failures
	at org.apache.maven.lifecycle.internal.MojoExecutor.execute(MojoExecutor.java:212)
	at org.apache.maven.lifecycle.internal.MojoExecutor.execute(MojoExecutor.java:153)
	at org.apache.maven.lifecycle.internal.MojoExecutor.execute(MojoExecutor.java:145)
	at org.apache.maven.lifecycle.internal.LifecycleModuleBuilder.buildProject(LifecycleModuleBuilder.java:116)
	at org.apache.maven.lifecycle.internal.LifecycleModuleBuilder.buildProject(LifecycleModuleBuilder.java:80)
	at org.apache.maven.lifecycle.internal.builder.singlethreaded.SingleThreadedBuilder.build(SingleThreadedBuilder.java:51)
	at org.apache.maven.lifecycle.internal.LifecycleStarter.execute(LifecycleStarter.java:128)
	at org.apache.maven.DefaultMaven.doExecute(DefaultMaven.java:307)
	at org.apache.maven.DefaultMaven.doExecute(DefaultMaven.java:193)
	at org.apache.maven.DefaultMaven.execute(DefaultMaven.java:106)
	at org.jvnet.hudson.maven3.launcher.Maven33Launcher.main(Maven33Launcher.java:129)
	at sun.reflect.NativeMethodAccessorImpl.invoke0(Native Method)
	at sun.reflect.NativeMethodAccessorImpl.invoke(NativeMethodAccessorImpl.java:62)
	at sun.reflect.DelegatingMethodAccessorImpl.invoke(DelegatingMethodAccessorImpl.java:43)
	at java.lang.reflect.Method.invoke(Method.java:498)
	at org.codehaus.plexus.classworlds.launcher.Launcher.launchStandard(Launcher.java:330)
	at org.codehaus.plexus.classworlds.launcher.Launcher.launch(Launcher.java:238)
	at jenkins.maven3.agent.Maven33Main.launch(Maven33Main.java:176)
	at sun.reflect.NativeMethodAccessorImpl.invoke0(Native Method)
	at sun.reflect.NativeMethodAccessorImpl.invoke(NativeMethodAccessorImpl.java:62)
	at sun.reflect.DelegatingMethodAccessorImpl.invoke(DelegatingMethodAccessorImpl.java:43)
	at java.lang.reflect.Method.invoke(Method.java:498)
	at hudson.maven.Maven3Builder.call(Maven3Builder.java:139)
	at hudson.maven.Maven3Builder.call(Maven3Builder.java:70)
	at hudson.remoting.UserRequest.perform(UserRequest.java:153)
	at hudson.remoting.UserRequest.perform(UserRequest.java:50)
	at hudson.remoting.Request$2.run(Request.java:336)
	at hudson.remoting.InterceptingExecutorService$1.call(InterceptingExecutorService.java:68)
	at java.util.concurrent.FutureTask.run(FutureTask.java:266)
	at java.util.concurrent.ThreadPoolExecutor.runWorker(ThreadPoolExecutor.java:1149)
	at java.util.concurrent.ThreadPoolExecutor$Worker.run(ThreadPoolExecutor.java:624)
	at java.lang.Thread.run(Thread.java:748)
Caused by: org.apache.maven.plugin.MojoFailureException: There are test failures
	at org.scalatest.tools.maven.TestMojo.execute(TestMojo.java:107)
	at org.apache.maven.plugin.DefaultBuildPluginManager.executeMojo(DefaultBuildPluginManager.java:134)
	at org.apache.maven.lifecycle.internal.MojoExecutor.execute(MojoExecutor.java:207)
	... 31 more
[ERROR] 
[ERROR] Re-run Maven using the -X switch to enable full debug logging.
[ERROR] 
[ERROR] For more information about the errors and possible solutions, please read the following
articles:
[ERROR] [Help 1] http://cwiki.apache.org/confluence/display/MAVEN/MojoFailureException
[ERROR] 
[ERROR] After correcting the problems, you can resume the build with the command
[ERROR]   mvn <goals> -rf :carbondata-presto
[JENKINS] Archiving <https://builds.apache.org/job/carbondata-master-spark-2.1/ws/processing/pom.xml>
to org.apache.carbondata/carbondata-processing/1.2.0-SNAPSHOT/carbondata-processing-1.2.0-SNAPSHOT.pom
[JENKINS] Archiving <https://builds.apache.org/job/carbondata-master-spark-2.1/ws/processing/target/carbondata-processing-1.2.0-SNAPSHOT.jar>
to org.apache.carbondata/carbondata-processing/1.2.0-SNAPSHOT/carbondata-processing-1.2.0-SNAPSHOT.jar
[Fast Archiver] No artifacts from carbondata-master-spark-2.1 » Apache CarbonData :: Processing
#1384 to compare, so performing full copy of artifacts
[JENKINS] Archiving <https://builds.apache.org/job/carbondata-master-spark-2.1/ws/integration/spark2/pom.xml>
to org.apache.carbondata/carbondata-spark2/1.2.0-SNAPSHOT/carbondata-spark2-1.2.0-SNAPSHOT.pom
[JENKINS] Archiving <https://builds.apache.org/job/carbondata-master-spark-2.1/ws/integration/spark2/target/carbondata-spark2-1.2.0-SNAPSHOT.jar>
to org.apache.carbondata/carbondata-spark2/1.2.0-SNAPSHOT/carbondata-spark2-1.2.0-SNAPSHOT.jar
[Fast Archiver] No artifacts from carbondata-master-spark-2.1 » Apache CarbonData :: Spark2
#1384 to compare, so performing full copy of artifacts
[JENKINS] Archiving <https://builds.apache.org/job/carbondata-master-spark-2.1/ws/assembly/pom.xml>
to org.apache.carbondata/carbondata-assembly/1.2.0-SNAPSHOT/carbondata-assembly-1.2.0-SNAPSHOT.pom
[JENKINS] Archiving <https://builds.apache.org/job/carbondata-master-spark-2.1/ws/integration/spark-common/pom.xml>
to org.apache.carbondata/carbondata-spark-common/1.2.0-SNAPSHOT/carbondata-spark-common-1.2.0-SNAPSHOT.pom
[JENKINS] Archiving <https://builds.apache.org/job/carbondata-master-spark-2.1/ws/integration/spark-common/target/carbondata-spark-common-1.2.0-SNAPSHOT.jar>
to org.apache.carbondata/carbondata-spark-common/1.2.0-SNAPSHOT/carbondata-spark-common-1.2.0-SNAPSHOT.jar
[Fast Archiver] No artifacts from carbondata-master-spark-2.1 » Apache CarbonData :: Spark
Common #1384 to compare, so performing full copy of artifacts
[JENKINS] Archiving <https://builds.apache.org/job/carbondata-master-spark-2.1/ws/pom.xml>
to org.apache.carbondata/carbondata-parent/1.2.0-SNAPSHOT/carbondata-parent-1.2.0-SNAPSHOT.pom
[Fast Archiver] No artifacts from carbondata-master-spark-2.1 » Apache CarbonData :: Parent
#1384 to compare, so performing full copy of artifacts
[JENKINS] Archiving <https://builds.apache.org/job/carbondata-master-spark-2.1/ws/core/pom.xml>
to org.apache.carbondata/carbondata-core/1.2.0-SNAPSHOT/carbondata-core-1.2.0-SNAPSHOT.pom
[JENKINS] Archiving <https://builds.apache.org/job/carbondata-master-spark-2.1/ws/core/target/carbondata-core-1.2.0-SNAPSHOT.jar>
to org.apache.carbondata/carbondata-core/1.2.0-SNAPSHOT/carbondata-core-1.2.0-SNAPSHOT.jar
[Fast Archiver] No artifacts from carbondata-master-spark-2.1 » Apache CarbonData :: Core
#1384 to compare, so performing full copy of artifacts
[JENKINS] Archiving <https://builds.apache.org/job/carbondata-master-spark-2.1/ws/hadoop/pom.xml>
to org.apache.carbondata/carbondata-hadoop/1.2.0-SNAPSHOT/carbondata-hadoop-1.2.0-SNAPSHOT.pom
[JENKINS] Archiving <https://builds.apache.org/job/carbondata-master-spark-2.1/ws/hadoop/target/carbondata-hadoop-1.2.0-SNAPSHOT.jar>
to org.apache.carbondata/carbondata-hadoop/1.2.0-SNAPSHOT/carbondata-hadoop-1.2.0-SNAPSHOT.jar
[Fast Archiver] No artifacts from carbondata-master-spark-2.1 » Apache CarbonData :: Hadoop
#1384 to compare, so performing full copy of artifacts
[JENKINS] Archiving <https://builds.apache.org/job/carbondata-master-spark-2.1/ws/integration/presto/pom.xml>
to org.apache.carbondata/carbondata-presto/1.2.0-SNAPSHOT/carbondata-presto-1.2.0-SNAPSHOT.pom
[JENKINS] Archiving <https://builds.apache.org/job/carbondata-master-spark-2.1/ws/integration/hive/pom.xml>
to org.apache.carbondata/carbondata-hive/1.2.0-SNAPSHOT/carbondata-hive-1.2.0-SNAPSHOT.pom
[JENKINS] Archiving <https://builds.apache.org/job/carbondata-master-spark-2.1/ws/integration/hive/target/carbondata-hive-1.2.0-SNAPSHOT.jar>
to org.apache.carbondata/carbondata-hive/1.2.0-SNAPSHOT/carbondata-hive-1.2.0-SNAPSHOT.jar
[JENKINS] Archiving <https://builds.apache.org/job/carbondata-master-spark-2.1/ws/common/pom.xml>
to org.apache.carbondata/carbondata-common/1.2.0-SNAPSHOT/carbondata-common-1.2.0-SNAPSHOT.pom
[JENKINS] Archiving <https://builds.apache.org/job/carbondata-master-spark-2.1/ws/common/target/carbondata-common-1.2.0-SNAPSHOT.jar>
to org.apache.carbondata/carbondata-common/1.2.0-SNAPSHOT/carbondata-common-1.2.0-SNAPSHOT.jar
[Fast Archiver] No artifacts from carbondata-master-spark-2.1 » Apache CarbonData :: Common
#1384 to compare, so performing full copy of artifacts
[JENKINS] Archiving <https://builds.apache.org/job/carbondata-master-spark-2.1/ws/integration/spark-common-test/pom.xml>
to org.apache.carbondata/carbondata-spark-common-test/1.2.0-SNAPSHOT/carbondata-spark-common-test-1.2.0-SNAPSHOT.pom
[JENKINS] Archiving <https://builds.apache.org/job/carbondata-master-spark-2.1/ws/integration/spark-common-test/target/carbondata-spark-common-test-1.2.0-SNAPSHOT.jar>
to org.apache.carbondata/carbondata-spark-common-test/1.2.0-SNAPSHOT/carbondata-spark-common-test-1.2.0-SNAPSHOT.jar
[JENKINS] Archiving <https://builds.apache.org/job/carbondata-master-spark-2.1/ws/examples/spark2/pom.xml>
to org.apache.carbondata/carbondata-examples-spark2/1.2.0-SNAPSHOT/carbondata-examples-spark2-1.2.0-SNAPSHOT.pom
Sending e-mails to: commits@carbondata.apache.org chenliang613@apache.org
channel stopped
Not sending mail to unregistered user ravi.pesala@gmail.com

Mime
View raw message